{"text_format":"1","workbook":"xlsx","n_sheets":25,"sheets":["Part 1","Part 1 Cont'd","Part 2","Part2A Deductible","Part 3","Part 4","Part 5","Personnel Sheet","Soil-Water Disposal","Equipment Rent-Purchase","Hotel & Food","Travel","Transportation&Shipping","Drilling-P&A","Analysis","Miscellaneous 1","Miscellaneous 2","Miscellaneous 3","Miscellaneous 4","Part 7","Part 8","Reference","ExcData","Print Sheets","Actions to correct"],"not_rendered":{"charts":0,"images":24,"macros":1,"external_links":0,"defined_names":65,"comments":6,"pivot_tables":0},"unopened":[],"bounds":{"document_bytes":16777216,"sheet_cells":100000,"rows_first":2000,"rows_last":500,"rows_between":2000,"halvings":0,"cell_chars":16384,"cell_head_chars":4096},"cells_cut":0,"cells_raw":0,"read":"whole","date_system":"1900"}

{"sheet":"Part 1","index":0,"n_rows":47,"n_cols":11,"rows_kept":47,"cut":false,"hidden":false,"merged":[[42,0,42,6],[46,0,46,7],[36,0,40,7],[31,10,32,10],[32,2,32,3],[34,2,34,3],[43,7,45,7],[27,0,27,1],[28,2,28,3],[30,2,30,3],[31,5,32,7],[20,0,20,3],[20,4,20,7],[21,0,21,3],[21,4,21,7],[22,0,22,3],[22,4,22,5],[22,6,22,7],[23,0,24,3],[23,4,24,5],[23,6,24,7],[25,0,25,2],[26,0,26,7],[16,3,17,7],[18,0,18,3],[18,4,18,7],[12,0,12,7],[19,0,19,3],[19,4,19,7],[7,0,7,7],[8,0,8,7],[9,0,9,7],[10,0,10,7],[11,0,11,7],[0,0,0,7],[1,0,1,7],[2,0,2,7],[3,0,3,7],[4,0,4,3],[4,4,6,7],[6,1,6,3]]}
["LOUISIANA MOTOR FUELS UNDERGROUND STORAGE TANK"]
["TRUST FUND REIMBURSEMENT APPLICATION"]
["PART 1"]
["SITE IDENTIFICATION"]
["FOR DEQ OFFICE USE ONLY         ",null,null,null,"DATE RECEIVED/DATE TO BE ENTERED ON EDMS"]
["TF No.",null,"Reviewer’s\nDue Date"]
["Reviewer Name"]
["APPLICATIONS WILL BE REJECTED FOR ANY OF THE FOLLOWING REASONS:"]
["1.  Proof of payment of the appropriate deductible is not provided."]
[]
["2.  Neither a work plan or sufficient budget has been approved by the DEQ prior to the submittal of charges."]
[]
["3.  Refer to section I.C.15.f of the Guidance Document for the complete list of reasons."]
[]
[]
[]
[null,null,null,{"$f":"IF(OR(A20=\"\",E20=\"\",A22=\"\",E22=\"\",A24=\"\",G24=\"\",E24=\"\"),\"MISSING INFORMATION\",\"\")","v":"MISSING INFORMATION"}]
["A. SITE/OWNER INFORMATION"]
["Site Name – Current Name",null,null,null,"Name of Responsible Party as Identified in Part 2 - Affidavit"]
[]
["DEQ Issued \nAgency Interest No.",null,null,null,"DEQ Issued Owner Identification Number of Responsible Party"]
[]
["Site Street Address – Physical Address, Not P.O. Box",null,null,null,"City",null,"Parish"]
[null,null,null,null,null,null,null,null,null,{"$f":"IF(OR(E29>0,E31>0,E33>0,E35>0),1,0)","v":0},"Print check"]
[]
["B.  APPLICATION INFORMATION"]
["1.   This application includes ALL INVOICES to the owner (responsible party) dated from: [Check appropriate quarter(s) and indicate"]
["      year(s)]:",null,null,null,null,null,null,null,null,"Quarters","Fiscal Years"]
[null,null,null,null,null,null,null,null,null,false]
[]
[null,null,null,null,null,null,null,null,null,false]
[null,null,null,null,null,{"$f":"IF(OR(AND(E29=\"\",E31=\"\",E33=\"\",E35=\"\"),OR(AND(E29>0,J29=FALSE),AND(E29=\"\",J29=TRUE),AND(E31>0,J31=FALSE),AND(E31=\"\",J31=TRUE),AND(E33>0,J33=FALSE),AND(E33=\"\",J33=TRUE),AND(E35>0,J35=FALSE),AND(E35=\"\",J35=TRUE))),\"MISSING INFORMATION\",IF(OR(AND(AND(E29>0,E31>0),E31-E29<>0),AND(AND(E29>0,E33>0),E33-E29<>1),AND(AND(E31>0,E33>0),E33-E31<>1),AND(AND(E29>0,E35>0),E35-E29<>1),AND(AND(E31>0,E35>0),E35-E31<>1),AND(AND(E33>0,E35>0),E35-E33<>0)),\"APP CROSSES FISCAL YEARS\",\"\"))","v":"MISSING INFORMATION"},null,null,null,null,{"$f":"IF(F32=\"APP CROSSES FISCAL YEARS\", TRUE,FALSE)","v":false}]
[null,null,null,null,null,null,null,null,null,false]
[]
[null,null,null,null,null,null,null,null,null,false]
[]
["Application requests must include all invoices dated during at least one calendar quarter:  July through September, October through December, January through March, or April through June.  A single application may include invoices which cover more than one calendar quarter, provided the application includes all invoice for the entire calendar quarter or quarters.  However, all multiple calendar quarter invoices must be dated within a single state fiscal year, July 1 - June 30. Once an application is submitted to DEQ, invoices for the period submitted or any prior periods WILL NOT be accepted.  Overlapping \"Work Performed\" dates in subsequent applications is not permitted. When the site’s RAC changes during a quarter, two separate applications addressing each RAC's work should be submitted."]
[]
[]
[]
[]
[]
["2.     Application Grand Total (Reflecting the eligible pre-approved costs shown on Part 5 of this application) :",null,null,null,null,null,null,{"$f":"+'Part 5'!A3","v":0}]
["3.     If applicable, indicate the following:",null,null,null,null,null,null,null,null,"First App?"]
[null,null,null,null,null,null,null,null,null,false]
[null,null,null,null,null,null,null,null,null,false]
["(Any application submitted to the Trust Fund Management Section for work performed on or after July 1, 2025 must be submitted on this form.)"]

{"sheet":"Part 1 Cont'd","index":1,"n_rows":40,"n_cols":7,"rows_kept":40,"cut":false,"hidden":false,"merged":[[37,5,39,7],[31,0,31,7],[32,0,32,7],[33,0,33,7],[22,6,22,7],[34,3,35,4],[34,5,35,7],[35,0,35,2],[36,1,36,2],[36,3,36,4],[36,5,36,7],[38,1,38,2],[22,3,22,5],[23,3,23,5],[37,3,39,4],[30,0,30,7],[16,6,16,7],[17,6,17,7],[16,1,16,2],[17,1,17,2],[18,1,18,2],[16,3,16,5],[17,3,17,5],[18,3,18,5],[28,0,28,7],[29,0,29,7],[22,1,22,2],[23,1,23,2],[34,0,34,2],[23,6,23,7],[25,0,25,1],[26,0,26,7],[27,0,27,7],[14,0,14,7],[15,6,15,7],[15,3,15,5],[15,1,15,2],[39,1,39,2],[20,6,20,7],[21,6,21,7],[21,1,21,2],[18,6,18,7],[19,6,19,7],[19,1,19,2],[20,1,20,2],[19,3,19,5],[20,3,20,5],[21,3,21,5],[37,1,37,2],[9,2,9,5],[10,2,10,5],[7,2,7,5],[8,2,8,5],[13,0,13,7],[5,2,5,5],[6,2,6,5],[0,0,0,7],[2,0,2,1],[2,2,2,7],[3,0,3,7],[4,2,4,5]]}
["PART 1 (cont’d)"]
[]
["C. RELEASE INFORMATION",null,{"$f":"IF(AND(A6=\"\",A7=\"\",A8=\"\",A9=\"\",A10=\"\",A11=\"\"),\"MISSING INFORMATION\",\"\")","v":"MISSING INFORMATION"}]
[]
["Incident No(s). \nUse the numeric value","Date Released","Substance(s) Released"]
[]
[]
[]
[]
[]
[]
[]
[]
["D. CORRECTIVE ACTION PLAN AND ADDENDUMS"]
[]
["Addendum Submittal Date","CAP Category",null,"DEQ Approval Date",null,null,"Approved Cost"]
[]
[]
[]
[]
[]
[]
[]
[]
[]
["I certify the following:"]
[" • I have reviewed the time sheets and the personnel charges and verify that they are in line with the duties indicated "]
["    in the UST Trust Fund Cost Control Guidance Document in effect at the time the work was performed;"]
[" • the rates identified in this application are in accordance with the response action contractor equipment rate sheet;"]
[" • the travel charges contained in this application are based on the mileage logs which indicate the person traveling, "]
["    distance traveled and beginning/ending odometer readings;"]
[" • I personally examined and am familiar with the information submitted with this application, and that I "]
["    believe that the submitted information is true, accurate and complete.   "]
[]
["Preparer’s Certification (Original Signature Required)                 ",null,null,"Date Signed"]
[{"$f":"IF(OR(B37=\"\",F37=\"\",B38=\"\",B40=\"\",F38=\"\"),\"MISSING INFORMATION\",\"\")","v":"MISSING INFORMATION"}]
["Preparer’s Name",null,null,"Firm Name"]
["Telephone Number",null,null,"Mailing Address"]
["Telefax Number"]
["Email Address"]

{"sheet":"Part 2","index":2,"n_rows":50,"n_cols":14,"rows_kept":50,"cut":false,"hidden":false,"merged":[[46,0,46,5],[46,8,46,11],[47,0,47,7],[47,8,47,11],[49,1,49,6],[49,9,49,11],[44,0,44,7],[36,0,36,7],[36,8,36,11],[37,0,37,7],[37,8,37,10],[38,0,38,11],[39,0,39,11],[41,0,41,4],[41,5,41,6],[41,10,41,11],[43,0,43,5],[43,10,43,11],[31,0,31,11],[32,0,32,11],[33,0,33,11],[34,0,34,11],[35,0,35,3],[35,4,35,7],[35,8,35,10],[28,0,28,3],[28,4,28,11],[29,0,29,7],[29,8,29,11],[30,0,30,7],[30,8,30,11],[26,0,26,7],[26,8,26,11],[27,0,27,1],[27,2,27,3],[27,5,27,7],[27,8,27,11],[24,0,24,2],[24,3,24,5],[24,6,24,7],[24,8,24,10],[25,0,25,2],[25,3,25,5],[25,6,25,7],[25,8,25,10],[21,0,21,7],[21,8,21,11],[22,0,22,7],[22,8,22,11],[23,0,23,7],[23,9,23,11],[20,0,20,7],[20,8,20,11],[8,0,8,11],[9,0,9,11],[10,0,10,11],[11,0,11,11],[13,0,13,11],[14,0,14,11],[15,0,15,11],[16,0,16,11],[17,0,17,11],[18,0,18,11],[19,0,19,11],[7,0,7,11],[0,0,0,11],[1,0,1,11],[3,0,3,11],[4,0,4,11],[5,0,5,11]]}
["PART 2"]
["OWNER, OPERATOR, OR RESPONSIBLE PARTY CERTIFICATION AFFIDAVIT"]
[]
["            I certify that I have researched and determined that I have no assistance from private sources, such as "]
["insurance or other means of financial assurance, to pay for investigation or remediation costs at this site. I also "]
["certify that all outstanding financial obligations integral to this site investigation/remediation have been met."]
[]
["         I certify that this program task has been completed in accordance with La. R.S. 30:2194 et seq and La R.S."]
["30:2195 et seq. I have reviewed and certify that all data and documentation represented on invoices listed in"]
["section D are a true and correct representation of costs actually incurred as an integral part of site "]
["rehabilitation from motor fuel contamination and that reimbursement from the Motor Fuels Underground "]
["Storage Tank Trust Fund has not been received on any of the charges identified in this application."]
[]
["        The site owner, operator, or responsible party warrants that he has not received any fee, commission,"]
["percentage, gift, or other consideration as a result of his employment of a person, company, corporation,"]
["individual, or firm for purposes of conducting the site assessment or rehabilitation."]
["If charges within this application are being applied toward the deductible(s), the following statement must be certified by checking the box below: "]
["       The responsible party received an invoice for the applicable deductible from the Department for the incident(s) associated with this application."]
["deductible [canceled checks and a list of corresponding invoices or Proof of Payment of Deductible Affidavit (Part 2A)] is attached."]
[]
["A. Site Owner, Operator, Responsible Party",null,null,null,null,null,null,null,"  I. Site Name"]
[{"$f":"IF('Part 1'!E20=\"\",\"\",'Part 1'!E20)","v":""},null,null,null,null,null,null,null,{"$f":"IF('Part 1'!A20>0,'Part 1'!A20,\"\")","v":""}]
["B. Mailing Address                                                                           ",null,null,null,null,null,null,null,"  J. Site Address"]
[null,null,null,null,null,null,null,null,"Physical Address",{"$f":"IF('Part 1'!A24>0,'Part 1'!A24,\"\")","v":""}]
["City",null,null,"State",null,null,"Zip",null,"City",null,null,"Parish"]
[null,null,null," ",null,null,null,null,{"$f":"IF('Part 1'!E24>0,'Part 1'!E24,\"\")","v":""},null,null,{"$f":"IF('Part 1'!G24>0,'Part 1'!G24,\"\")","v":""}]
["C. Telephone/Telefax Numbers  ",null,null,null,null,null,null,null,"K. Agency Interest Number"]
["Telephone ",null,null,null,"Telefax",null,null,null,{"$f":"IF('Part 1'!A22>0,'Part 1'!A22,\"\")","v":""}]
["D.   RAC/Owner Invoice No(s).",null,null,null,{"$f":"IF(N29=\"\",\"\",LEFT(N29,LEN(N29)-2))","v":""},null,null,null,null,null,null,null,null,{"$f":"CONCATENATE('Part 4'!Q12,'Part 4'!Q13,'Part 4'!Q14,'Part 4'!Q15,'Part 4'!Q16,'Part 4'!Q17,'Part 4'!Q18,'Part 4'!Q19,'Part 4'!Q20,'Part 4'!Q21,'Part 4'!Q22,'Part 4'!Q23,'Part 4'!Q24,'Part 4'!Q25,'Part 4'!Q26,'Part 4'!Q27,'Part 4'!Q28,'Part 4'!Q29,'Part 4'!Q30,'Part 4'!Q31,)","v":""}]
["E. Signature of person designated to sign for the owner, operator, or responsible party",null,null,null,null,null,null,null," L. Federal Tax ID# if applicable\n      (SSN not applicable)"]
[]
["F. Check the appropriate box below.  The contract for work addressed in this application was signed:"]
["        Before August 1, 1995, the owner/operator/responsible party receives reimbursement.",null,null,null,null,null,null,null,null,null,null,null,null,false]
["       On or after August 1, 1995, and as required by Act 336 of the 1995 Regular Session, the RAC receives reimbursement",null,null,null,null,null,null,null,null,null,null,null,null,false]
["G. Invoices to the owner (responsible party) addressed in this application are dated for the following quarters:  [Check appropriate quarter(s) and indicate year(s)] "]
["      July 1,          -Sept 30,          .",null,null,null,"       Oct. 1,           -Dec. 31,            .",null,null,null,"      Jan 1,           - Mar 31,           .",null,null,"      Apr 1,            - June 30,            ."]
["H. Program Grand Task Total Addressed in Part 1, Part 3 and Part 5",null,null,null,null,null,null,null,{"$f":"'Part 5'!A3","v":0}]
["       Before me, the undersigned notary public, came and appeared ",null,null,null,null,null,null,null,null,null,null,"(please print or type the name"]
["shown in E above), who, being known to me, did execute the foregoing certification affidavit in my presence, who, being duly sworn,"]
["did state under oath or affirmation that he/she executed said document for the purpose expressed therein."]
[]
["WITNESS my hand and official seal, this",null,null,null,null,null,null,"day of,",null,","]
[]
[null,null,null,null,null,null,null,null,"My commission expires"]
["Notary Public (Signature)"]
[]
[]
["Notary Public Name (Printed, typed, or stamped)",null,null,null,null,null,null,null,"Notary # or Bar Roll #( if a Louisiana notary)"]
[]
["State of",null,null,null,null,null,null,null,"County or Parish of "]

{"sheet":"Part2A Deductible","index":3,"n_rows":42,"n_cols":14,"rows_kept":42,"cut":false,"hidden":false,"merged":[[39,1,39,3],[39,6,39,7],[39,8,39,10],[34,0,34,4],[34,6,34,9],[35,0,35,10],[36,0,36,4],[36,6,36,10],[37,0,37,4],[37,6,37,10],[32,0,32,2],[32,3,32,4],[32,6,32,8],[24,0,24,1],[24,2,24,4],[24,5,24,8],[26,0,27,10],[28,4,28,8],[28,9,28,10],[29,0,29,10],[30,0,30,10],[24,9,24,10],[25,0,25,8],[25,9,25,10],[22,0,22,1],[22,2,22,4],[22,5,22,8],[22,9,22,10],[23,0,23,1],[23,2,23,4],[23,5,23,8],[23,9,23,10],[20,0,20,1],[20,2,20,4],[20,5,20,8],[20,9,20,10],[21,0,21,1],[21,2,21,4],[21,5,21,8],[21,9,21,10],[18,0,18,1],[18,2,18,4],[18,5,18,8],[18,9,18,10],[19,0,19,1],[19,2,19,4],[19,5,19,8],[19,9,19,10],[16,0,16,1],[16,2,16,4],[16,5,16,8],[16,9,16,10],[17,0,17,1],[17,2,17,4],[17,5,17,8],[17,9,17,10],[13,0,13,4],[13,5,13,8],[13,9,13,10],[14,0,14,1],[14,2,15,4],[14,5,15,8],[14,9,15,10],[15,0,15,1],[12,0,12,4],[12,5,12,8],[12,9,12,10],[0,0,0,10],[1,0,1,10],[2,0,2,10],[4,0,4,10],[6,0,6,10],[8,0,8,10],[9,0,9,10],[10,0,10,10],[11,0,11,10],[5,2,5,9]]}
["PART 2.A"]
["PROOF OF PAYMENT OF DEDUCTIBLE AFFIDAVIT"]
["(To be completed by Response Action Contractor)"]
[]
["I,                                            (signature of principal or his designee for the response action contractor) certify"]
["that payments were made to",null,null,null,null,null,null,null,null,null," (name of response "]
["action contractor) in the amounts specified below, which were integral to the investigation/remediation of the "]
["below specified site."]
["A. Name of Site"]
[{"$f":"IF('Part 1'!A20>0,'Part 1'!A20,\"\")","v":""}]
["B. Site Address (Physical address, city)"]
[{"$f":"IF('Part 1'!A24>0,'Part 1'!A24&\",  \"&'Part 1'!E24,\"\")","v":""}]
["C. Parish",null,null,null,null,"D.  Site AI No.",null,null,null,"E. Incident No."]
[{"$f":"IF('Part 1'!G24>0,'Part 1'!G24,\"\")","v":""},null,null,null,null,{"$f":"IF('Part 1'!A22>0,'Part 1'!A22,\"\")","v":""}]
["Invoice No.",null,"Date of Payment Received",null,null,"Check No.",null,null,null,"Amount"]
["(As contained in application)",null,null,null,null,null,null,null,null,null,null,null,null,{"$f":"IF(J26>0,1,0)","v":0}]
[]
[]
[]
[]
[]
[]
[]
[]
[]
["Total Deductible Amount Addressed in Affidavit",null,null,null,null,null,null,null,null,{"$f":"SUM(J17:K25)","v":0}]
[{"$f":"IF(OR(C6=\"\",J14=\"\",AND(OR(A17=\"\",C17=\"\",F17=\"\",J17=\"\"),OR(A18=\"\",C18=\"\",F18=\"\",J18=\"\"),OR(A19=\"\",C19=\"\",F19=\"\",J19=\"\"),OR(A20=\"\",C20=\"\",F20=\"\",J20=\"\"),OR(A21=\"\",C21=\"\",F21=\"\",J21=\"\"),OR(A22=\"\",C22=\"\",F22=\"\",J22=\"\"),OR(A23=\"\",C23=\"\",F23=\"\",J23=\"\"),OR(A24=\"\",C24=\"\",F24=\"\",J24=\"\"),OR(A25=\"\",C25=\"\",F25=\"\",J25=\"\"))),\"MISSING INFORMATION\",\"\")","v":"MISSING INFORMATION"}]
[]
["Before me, the undersigned notary public, came and appeared",null,null,null,null,null,null,null,null,"(please print or type the name"]
["shown in first Paragraph), who, being known to me, did execute the foregoing certification affidavit in my presence, and who, being"]
["duly sworn, did state under oath or affirmation that he/she executed said document for the purpose expressed therein."]
[]
["WITNESS my hand and official seal, this",null,null,null,null,"day of,",null,null,null,","]
[]
[null,null,null,null,null,null,"My commission expires"]
["Notary Public (Signature)"]
[]
["Notary Public Name (Printed, typed, or stamped)",null,null,null,null,null,"Notary # or Bar Roll #( if a Louisiana notary)"]
[]
["State of",null,null,null,null,null,"County or Parish of"]
[]
[null,null,null,null,null,null,null," "]

{"sheet":"Part 3","index":4,"n_rows":49,"n_cols":20,"rows_kept":49,"cut":false,"hidden":false,"merged":[[48,1,48,4],[48,6,48,8],[48,9,48,12],[43,0,43,5],[45,0,45,4],[45,6,45,12],[46,0,46,5],[46,6,46,12],[42,0,42,4],[42,6,42,9],[42,10,42,12],[40,0,40,3],[40,4,40,5],[40,7,40,10],[36,0,36,5],[36,6,36,10],[36,11,36,12],[37,0,37,12],[38,0,38,12],[34,11,34,12],[35,0,35,5],[35,6,35,12],[29,0,29,5],[29,6,29,12],[30,0,30,12],[31,0,31,12],[32,0,32,12],[33,0,33,12],[34,0,34,2],[34,3,34,5],[34,6,34,10],[25,0,25,5],[25,6,25,12],[26,0,26,5],[26,6,26,12],[27,0,28,5],[27,6,28,12],[23,0,23,1],[23,2,23,4],[23,6,24,7],[23,8,24,12],[24,0,24,1],[24,2,24,4],[22,0,22,5],[22,6,22,7],[22,8,22,12],[14,0,14,12],[15,0,15,12],[16,0,16,12],[17,0,17,12],[18,0,18,5],[18,6,18,12],[19,0,19,5],[20,0,20,5],[20,6,20,12],[21,0,21,5],[21,6,21,12],[13,0,13,12],[0,0,0,12],[1,0,1,12],[3,0,3,12],[4,0,4,12],[5,0,5,12],[6,0,6,12],[7,0,7,12],[8,0,8,12],[10,0,10,12],[11,0,11,12],[12,0,12,12]]}
["PART 3"]
["RESPONSE ACTION CONTRACTOR CERTIFICATION AFFIDAVIT"]
[]
["        I certify that this program task has been completed in accordance with La. R.S. 30:2194 et seq and La. R.S. 30:2195 et seq."]
[" I have reviewed and certify that all data and documentation submitted as part of this reimbursement application are a true and"]
["correct representation of costs actually incurred as an integral part of site rehabilitation from motor fuel contamination. I also"]
["certify that  reimbursement from the Motor Fuels Underground Storage Tank Trust Fund has not been received on any of the "]
["charges identified in this application. I agree to reimburse the owner, operator, or the responsible party of the referenced site"]
[" any monies due to him upon reimbursement from the Motor Fuels Underground Storage Tank Trust Fund."]
[]
["      The person responsible for conducting site rehabilitation warrants that he/she has not received any fee, commission,"]
[" percentage, gift, or other consideration as a result of his employment of a person, company, corporation, individual, firm, or "]
["other legal entity for purposes of conducting the site assessment or rehabilitation.  Copies of mileage logs, detailed timesheets"]
[" and RAC equipment rental rates sheets will be maintained for a period of four years following reimbursement for auditing"]
[" purposes and will be readily available upon request by the DEQ or a DEQ contractor."]
[]
[null,null,null,null,null,null,null,null,null,null,null,null,null,null,false]
[]
["A.    Name principal/president of the company responsible for",null,null,null,null,null," H. Company Name"]
["       conducting the site assessment/rehabilitation"]
[]
["B. Mailing Address                                                                           ",null,null,null,null,null," I.  Response Action Contractor Telephone/Telefax Numbers"]
[null,null,null,null,null,null,"Telephone"]
["City:",null,"State",null,null,"Zip","Telefax"]
[]
["C.  Facility Name",null,null,null,null,null,"J.  Agency Interest Number",null,null,null,null,null,null,null,null,null,null,null,null,"  "]
[{"$f":"IF(+'Part 1'!A20=\"\",\"\",'Part 1'!A20)","v":""},null,null,null,null,null,{"$f":"IF(+'Part 1'!A22=\"\",\"\",+'Part 1'!A22)","v":""}]
["D. Signature of the principal/president of the company or his  designee responsible for conducting site assessment/rehabilitation",null,null,null,null,null,"  K.  Federal Tax ID# if applicable"]
[]
[{"$f":"IF(OR(A21=\"\",G21=\"\",A23=\"\",I23=\"\",A25=\"\",A27=\"\",G27=\"\",C25=\"\",F25=\"\",AND(O32=FALSE,O33=FALSE),AND(O35=FALSE,P35=FALSE,Q35=FALSE,R35=FALSE),G36=0),\"MISSING INFORMATION\",\"\")","v":"MISSING INFORMATION"}]
["E. Check appropriate box below.  The contract for work addressed in this application was signed:"]
["        Before August 1, 1995, the owner/operator/responsible party receives reimbursement.",null,null,null,null,null,null,null,null,null,null,null,null,null,false]
["       On or after August 1, 1995, and as required by Act 336 of the 1995 Regular Session, the RAC receives reimbursement",null,null,null,null,null,null,null,null,null,null,null,null,null,false]
["F. Invoices to the owner (responsible party) addressed in this application are dated for the following quarters:  [Check appropriate quarter(s) and indicate year(s)]"]
["      July 1,           - Sept 30,            .",null,null,"      Oct. 1,          - Dec. 31,           .",null,null,"     Jan 1,            - Mar 31,             .",null,null,null,null,"     Apr 1,           - June 30,           .",null,null,{"$f":"'Part 1'!J29","v":false},{"$f":"'Part 1'!J31","v":false},{"$f":"'Part 1'!J33","v":false},{"$f":"'Part 1'!J35","v":false}]
["G. Program Grand Task Total Addressed in Part 1, Part 2 and Part 5",null,null,null,null,null,{"$f":"'Part 5'!A3","v":0}]
["      Before me, the undersigned notary public, came and appeared",null,null,null,null,null,null,null,null,null,null,"(please print or type the name"]
["shown in D above), who, being known to me, did execute the foregoing certification affidavit in my presence, who, being duly sworn,"]
["did state under oath or affirmation that he/she executed said document for the purpose expressed therein."]
[]
["WITNESS my hand and official seal, this",null,null,null,null,null,"day of,",null,null,null,null,","]
[]
[null,null,null,null,null,null,"My commission expires "]
["Notary Public (Signature)"]
[]
[]
["Notary Public Name (Printed, Typed, or Stamped)",null,null,null,null,null,"                Notary # or Bar Roll #( if a Louisiana notary)"]
[]
["State of",null,null,null,null,null,"County or Parish of"]

{"sheet":"Part 4","index":5,"n_rows":32,"n_cols":17,"rows_kept":32,"cut":false,"hidden":false,"merged":[[30,0,30,1],[30,3,30,4],[30,7,30,9],[31,0,31,5],[31,6,31,9],[28,0,28,1],[28,3,28,4],[28,7,28,9],[29,0,29,1],[29,3,29,4],[29,7,29,9],[26,0,26,1],[26,3,26,4],[26,7,26,9],[27,0,27,1],[27,3,27,4],[27,7,27,9],[24,0,24,1],[24,3,24,4],[24,7,24,9],[25,0,25,1],[25,3,25,4],[25,7,25,9],[22,0,22,1],[22,3,22,4],[22,7,22,9],[23,0,23,1],[23,3,23,4],[23,7,23,9],[20,0,20,1],[20,3,20,4],[20,7,20,9],[21,0,21,1],[21,3,21,4],[21,7,21,9],[18,0,18,1],[18,3,18,4],[18,7,18,9],[19,0,19,1],[19,3,19,4],[19,7,19,9],[16,0,16,1],[16,3,16,4],[16,7,16,9],[17,0,17,1],[17,3,17,4],[17,7,17,9],[14,0,14,1],[14,3,14,4],[14,7,14,9],[15,0,15,1],[15,3,15,4],[15,7,15,9],[12,0,12,1],[12,3,12,4],[12,7,12,9],[13,0,13,1],[13,3,13,4],[13,7,13,9],[9,0,9,1],[9,3,9,4],[9,7,9,9],[11,0,11,1],[11,3,11,4],[11,7,11,9],[7,1,7,4],[7,7,7,8],[8,1,8,6],[8,8,8,9],[6,6,6,9],[5,0,5,9],[0,0,0,9],[1,0,1,9],[2,0,2,9],[3,0,3,9],[4,0,4,9]]}
["PART 4"]
["RAC OR OWNER INVOICE SUMMARY"]
[]
["List in chronological order, all RAC invoices to the owner and all other invoices billed directly to the owner on this sheet. Each application can"]
["not address invoices dated for a period of more than one fiscal year (July 1 - June 30). Copies of all listed invoices must be attached."]
["Outside invoices/receipts must be attached to the appropriate RAC/Owner Invoice."]
[null,null,null,null,null,null,{"$f":"IF(OR(G8=\"\",J8=\"\",L32>0,AND(N13=0,L32=0)),\"MISSING INFORMATION\",\"\")","v":"MISSING INFORMATION"}]
["Site Name",{"$f":"IF('Part 1'!A20>0,'Part 1'!A20,\"\")","v":""},null,null,null,"Invoicing Period",null,"through"]
["Site Address",{"$f":"IF('Part 1'!A24<>\"\",('Part 1'!A24&\",  \"&'Part 1'!E24&\",  \"&'Part 1'!G24&\" Parish\"),\"\")","v":""},null,null,null,null,null,"AIN",{"$f":"IF('Part 1'!A22>0,'Part 1'!A22,\"\")","v":""}]
["WORKED PERFORMED (TIME PERIOD)",null,"INVOICE DATE","COMPANY NAME",null,"INVOICE NO.","AMOUNT","RAC INVOICE DESCRIPTION",null,null,null,"Missing Invoice Info"]
[]
[null,null,null,null,null,null,null,null,null,null,null,{"$f":"IF(OR(AND(A12=\"\",OR(C12>0,D12>0,F12>0,G12>0)), AND(C12=\"\",OR(A12>0,D12>0,F12>0,G12>0)), AND(D12=\"\",OR(A12>0,C12>0,F12>0,G12>0)), AND(F12=\"\",OR(A12>0,C12>0,D12>0,G12>0)), AND(G12=\"\",OR(A12>0,C12>0,D12>0,F12>0))),TRUE,FALSE)","v":false},"part 5",{"$f":"'Part 5'!A3","v":0},{"$f":"ROUND(N12,2)","v":0},null,{"$f":"IF(F12=\"\",\"\",F12&\"; \")","v":""}]
[null,null,null,null,null,null,null,null,null,null,null,false,"part 4",{"$f":"G32","v":0},{"$f":"ROUND(N13,2)","v":0},null,{"$f":"IF(F13=\"\",\"\",F13&\"; \")","v":""}]
[null,null,null,null,null,null,null,null,null,null,null,false,null,null,null,null,""]
[null,null,null,null,null,null,null,null,null,null,null,false,{"$f":"IF(O12=O13,0,1)","v":0},null,null,null,""]
[null,null,null,null,null,null,null,null,null,null,null,false,null,null,null,null,""]
[null,null,null,null,null,null,null,null,null,null,null,false,null,null,null,null,""]
[null,null,null,null,null,null,null,null,null,null,null,false,null,null,null,null,""]
[null,null,null,null,null,null,null,null,null,null,null,false,null,null,null,null,""]
[null,null,null,null,null,null,null,null,null,null,null,false,null,null,null,null,""]
[null,null,null,null,null,null,null,null,null,null,null,false,null,null,null,null,""]
[null,null,null,null,null,null,null,null,null,null,null,false,null,null,null,null,""]
[null,null,null,null,null,null,null,null,null,null,null,false,null,null,null,null,""]
[null,null,null,null,null,null,null,null,null,null,null,false,null,null,null,null,""]
[null,null,null,null,null,null,null,null,null,null,null,false,null,null,null,null,""]
[null,null,null,null,null,null,null,null,null,null,null,false,null,null,null,null,""]
[null,null,null,null,null,null,null,null,null,null,null,false,null,null,null,null,""]
[null,null,null,null,null,null,null,null,null,null,null,false,null,null,null,null,""]
[null,null,null,null,null,null,null,null,null,null,null,false,null,null,null,null,""]
[null,null,null,null,null,null,null,null,null,null,null,false,null,null,null,null,""]
[null,null,null,null,null,null,null,null,null,null,null,false,null,null,null,null,""]
["TOTAL RAC OR OWNER INVOICE SUMMARY",null,null,null,null,null,{"$f":"SUM(G12:G31)","v":0},null,null,null,null,{"$f":"COUNTIF(L12:L31,TRUE)","v":0}]

{"sheet":"Part 5","index":6,"n_rows":29,"n_cols":20,"rows_kept":29,"cut":false,"hidden":false,"merged":[[27,15,28,16],[27,17,27,18],[28,17,28,18],[27,2,28,2],[27,3,28,4],[27,5,28,6],[27,7,28,9],[27,10,28,10],[27,11,28,12],[27,13,28,14],[23,2,23,3],[23,4,23,5],[23,9,23,10],[23,12,23,14],[27,0,28,1],[24,0,24,1],[24,2,24,3],[24,4,24,5],[24,6,24,11],[24,12,24,14],[25,1,25,5],[25,6,26,11],[25,12,26,14],[26,1,26,5],[17,0,17,19],[18,0,18,5],[18,6,19,11],[18,12,19,14],[19,0,19,1],[19,2,19,3],[19,4,19,5],[20,0,20,1],[20,2,20,3],[20,4,20,5],[20,6,23,8],[20,9,20,10],[20,12,20,14],[21,0,21,1],[21,2,21,3],[21,4,21,5],[21,9,21,10],[21,12,21,14],[22,0,22,1],[22,2,22,3],[22,4,22,5],[22,9,22,10],[22,12,22,14],[23,0,23,1],[16,12,16,13],[16,14,16,17],[16,18,16,19],[13,16,13,17],[13,18,13,19],[14,0,15,3],[14,4,14,5],[14,6,14,8],[14,9,14,19],[15,4,15,5],[15,6,15,8],[15,9,15,11],[15,12,15,13],[13,0,13,1],[13,3,13,4],[13,5,13,6],[13,7,13,9],[13,12,13,13],[13,14,13,15],[16,9,16,11],[12,0,12,1],[12,3,12,4],[12,5,12,6],[12,7,12,9],[12,12,12,13],[12,14,12,15],[12,16,12,17],[12,18,12,19],[11,0,11,1],[11,3,11,4],[11,5,11,6],[11,7,11,9],[11,12,11,13],[11,14,11,15],[10,0,10,1],[10,3,10,4],[10,5,10,6],[10,7,10,9],[10,12,10,13],[10,14,10,15],[10,16,10,17],[10,18,10,19],[9,0,9,1],[9,3,9,4],[9,5,9,6],[9,7,9,9],[9,12,9,13],[9,14,9,15],[7,0,7,1],[7,3,7,4],[7,5,7,6],[7,7,7,9],[7,12,7,13],[7,14,7,15],[7,16,7,17],[7,18,7,19],[8,0,8,1],[8,3,8,4],[8,5,8,6],[8,7,8,9],[8,12,8,13],[8,14,8,15],[8,16,8,17],[8,18,8,19],[0,0,0,19],[1,0,1,1],[1,12,1,19],[2,0,3,1],[2,2,2,4],[2,5,2,9],[2,10,2,11],[2,12,2,15],[1,10,1,11],[1,3,1,9],[5,2,6,2],[5,3,6,4],[5,5,6,6],[5,7,6,9],[5,10,6,10],[5,11,6,11],[5,12,6,13],[4,0,4,1],[4,3,4,4],[4,5,4,6],[4,7,4,9],[4,12,4,13],[21,15,26,19],[18,15,20,19],[2,16,2,19],[3,3,3,4],[3,5,3,6],[3,7,3,9],[3,12,3,13],[3,14,3,15],[3,16,3,17],[3,18,3,19],[4,16,4,17],[4,18,4,19],[4,14,4,15],[5,14,6,15],[5,16,6,17],[5,18,6,19],[9,16,9,17],[9,18,9,19],[11,16,11,17],[11,18,11,19],[15,14,15,17],[15,18,15,19],[16,0,16,3],[16,4,16,8]]}
["PART 5 – EVENT SUMMARY SHEET"]
["APPLICATION GRAND TOTAL  ",null,"AIN",{"$f":"IF('Part 1'!A22>0,'Part 1'!A22,\"\")","v":""},null,null,null,null,null,null,"RAC Name",null,{"$f":"IF('Part 3'!G21>0,'Part 3'!G21,\" \")","v":" "}]
[{"$f":"SUM(C14,F14,K14,M14,Q14,)","v":0},null,"1.  Emergency/Initial",null,null,"2.  Investigation Field Work",null,null,null,null,"3.  Interim Monitoring",null,"4.  Corrective \nAction Plan",null,null,null,"5.  Report \nPreparation"]
[null,null,"Charges","DEQ Adjusted Charges",null,"Charges",null,"DEQ Adjusted Charges",null,null,"Charges","DEQ Adjusted Charges","Charges",null,"DEQ Adjusted Charges",null,"Charges",null,"DEQ Adjusted Charges"]
["A.  Personnel",null,{"$f":"+'Personnel Sheet'!H3","v":0},0,null,{"$f":"+'Personnel Sheet'!H4","v":0},null,0,null,null,{"$f":"+'Personnel Sheet'!H5","v":0},0,{"$f":"+'Personnel Sheet'!H6","v":0},null,0,null,{"$f":"+'Personnel Sheet'!H7","v":0},null,0]
["B.  Soil/Water",null,{"$f":"+'Soil-Water Disposal'!J5","v":0},0,null,{"$f":"+'Soil-Water Disposal'!J6","v":0},null,0,null,null,{"$f":"+'Soil-Water Disposal'!J7","v":0},0,{"$f":"+'Soil-Water Disposal'!J8","v":0},null,0]
["     Disposal"]
["C.  Equipment",null,{"$f":"+'Equipment Rent-Purchase'!L6","v":0},0,null,{"$f":"+'Equipment Rent-Purchase'!L7","v":0},null,0,null,null,{"$f":"+'Equipment Rent-Purchase'!L8","v":0},0,{"$f":"+'Equipment Rent-Purchase'!L9","v":0},null,0]
["D.  Travel",null,{"$f":"+Travel!J3+'Hotel & Food'!J4","v":0},0,null,{"$f":"+'Hotel & Food'!J5+Travel!J4","v":0},null,0,null,null,{"$f":"+'Hotel & Food'!J6+Travel!J5","v":0},0,{"$f":"+'Hotel & Food'!J7+Travel!J6","v":0},null,0,null,{"$f":"+'Hotel & Food'!J8+Travel!J7","v":0},null,0]
["E.  Transportation",null,{"$f":"+'Transportation&Shipping'!G5","v":0},0,null,{"$f":"+'Transportation&Shipping'!G6","v":0},null,0,null,null,{"$f":"+'Transportation&Shipping'!G7","v":0},0,{"$f":"+'Transportation&Shipping'!G8","v":0},null,0]
["F.  Drilling & \n     P & A",null,{"$f":"+'Drilling-P&A'!I9","v":0},0,null,{"$f":"+'Drilling-P&A'!I10","v":0},null,0,null,null,{"$f":"+'Drilling-P&A'!I11","v":0},0,{"$f":"+'Drilling-P&A'!I12","v":0},null,0]
["G.  Analysis",null,{"$f":"+Analysis!K3","v":0},0,null,{"$f":"+Analysis!K4","v":0},null,0,null,null,{"$f":"+Analysis!K5","v":0},0,{"$f":"+Analysis!K6","v":0},null,0]
["H.  Miscellaneous ",null,{"$f":"+'Miscellaneous 1'!H4+'Miscellaneous 2'!K3+'Miscellaneous 3'!K2","v":0},0,null,{"$f":"+'Miscellaneous 1'!H5+'Miscellaneous 2'!K4+'Miscellaneous 3'!K3+'Miscellaneous 4'!G4","v":0},null,0,null,null,{"$f":"+'Miscellaneous 1'!H6+'Miscellaneous 2'!K5+'Miscellaneous 3'!K4+'Miscellaneous 4'!G5","v":0},0,{"$f":"+'Miscellaneous 1'!H7+'Miscellaneous 2'!K6+'Miscellaneous 3'!K5+'Miscellaneous 4'!G6","v":0},null,0,null,{"$f":"+'Miscellaneous 1'!H8+'Miscellaneous 3'!K6+'Miscellaneous 4'!G7","v":0},null,0]
["Subtotals",null,{"$f":"SUM(C5:C13)","v":0},{"$f":"SUM(D5:D13)","v":0},0,0,0,0,0,0,0,0,0,0,0,0,0,0,0,0]
[{"$f":"IF(OR(E16=\"\",G16=\"\"),\"6. Dates work performed in application: MISSING INFORMATION\",\"6. Dates work performed in application:\")","v":"6. Dates work performed in application: MISSING INFORMATION"},null,null,null,"Beginning",null,"Ending",null,null,"7. Application addresses invoices to the owner dated:   (Select quarter by entering year)"]
[null,null,null,null,null,null,null,null,null,"July 1 – September 30",null,null,{"$f":"IF('Part 1'!E29>0,'Part 1'!E29,\"\")","v":""},null,"January 1 – March 31",null,null,null,{"$f":"IF('Part 1'!E33>0,'Part 1'!E33,\"\")","v":""}]
["8.        DEQ Fiscal Year (July - June)",null,null,null,{"$f":"IF((IF(AND(M16>0,M17>0,S16>0,S17>0),(MAX(IF(M16=\"\",0,M16+1),IF(M17=\"\",,M17+1),S16,S17)),\"\"))=0,\"\",(IF(AND(M16>0,M17>0,S16>0,S17>0),(MAX(IF(M16=\"\",0,M16+1),IF(M17=\"\",,M17+1),S16,S17)),\"\")))","v":""},null,null,null,null,"October 1 – December 31",null,null,{"$f":"IF('Part 1'!E31>0,'Part 1'!E31,\"\")","v":""},null,"April 1 - June 30",null,null,null,{"$f":"IF('Part 1'!E35>0,'Part 1'!E35,\"\")","v":""}]
["The area below is for DEQ Trust Fund use only:"]
["Incident Information",null,null,null,null,null,"Total Adjusted Charges $",null,null,null,null,null,{"$f":"+D14+H14+L14+O14+S14","v":0},null,null,"DEQ Comments, Notations for\nDeductibles, Treatment Units, & Last Applications"]
["Incident No.",null,"Release Date",null,"Substance"]
[null,null,null,null,null,null,"LDEQ Adjustments",null,null,"Trust Fund No.",null,"CAP Amount"]
[]
[]
[]
[null,null,null,null,null,null,"Deductible Amount ($)"]
["Reviewer Name",{"$f":"IF('Part 1'!B7<>\"\",'Part 1'!B7,\"\")","v":""},null,null,null,null,"LDEQ  Reimbursement $",null,null,null,null,null,{"$f":"+M19+M22+M23+M24-M25","v":0}]
["Trust Fund Number",{"$f":"IF('Part 1'!B6=\"\",\"\",'Part 1'!B6)","v":""}]
["ICAP\n Charges $",null,null,"ICAP Balance $",null,null,null,"CAP \nCharges $",null,null,null,"(ROG Approved) \nCAP Balance $",null,null,null,"Payment To:",null,"RAC"]
[null,null,null,null,null,null,null,null,null,null,null,null,null,null,null,null,null,"Owner"]

{"sheet":"Personnel Sheet","index":7,"n_rows":66,"n_cols":17,"rows_kept":66,"cut":false,"hidden":false,"merged":[[1,4,1,7],[9,0,9,5],[8,0,8,5],[42,0,42,5],[64,0,64,6],[65,0,65,6],[30,0,30,6],[31,0,31,6],[39,4,39,5],[2,4,2,6],[3,4,3,6],[4,4,4,6],[5,4,5,6],[6,0,6,1],[6,4,6,6]]}
["PART 5.A",null,null,null,null,null,null,null,null,null,null,{"$f":"+L30+L64","v":0},"Total Print check"]
["PERSONNEL SUPPLEMENTARY SHEET",null,null,null,"Costing Category Summary"]
[null,null,null,null,"Emergency/Initial",null,null,{"$f":"SUMIF($A$12:$A$30,E3,$H$12:$H$30)+SUMIF($A$46:$A$64,E3,$H$46:$H$64)","v":0}]
[null,null,null,null,"Investigation",null,null,{"$f":"SUMIF($A$12:$A$30,E4,$H$12:$H$30)+SUMIF($A$46:$A$64,E4,$H$46:$H$64)","v":0}]
[null,null,null,null,"Interim Monitoring",null,null,{"$f":"SUMIF($A$12:$A$30,E5,$H$12:$H$30)+SUMIF($A$46:$A$64,E5,$H$46:$H$64)","v":0}]
[null,null,null,null,"Corrective Action Plan",null,null,{"$f":"SUMIF($A$12:$A$30,E6,$H$12:$H$30)+SUMIF($A$46:$A$64,E6,$H$46:$H$64)","v":0}]
[{"$f":"IF(SUM(O11:O30)>0,\"MISSING INFORMATION\",\"\")","v":""},null,null,null,"Report Preparation",null,null,{"$f":"SUMIF($A$12:$A$30,E7,$H$12:$H$30)+SUMIF($A$46:$A$64,E7,$H$46:$H$64)","v":0}]
[]
["Personnel charges for work activities included in unit pricing should not be addressed on this form."]
[]
["Costing Category","Personnel Duties","Employee Name","Hourly Rate","Work Performed\nDate,  Location (field or office) and Description","RAC Invoice No.","No.     HRS","TOTAL",null,null,null,null,null,null,"Test","Max Hours","Adjusted Hours"]
[null,null,null,{"$f":"IF(B12=\"\",\"\",VLOOKUP(B12,Reference!A$9:B$23,2,FALSE))","v":""},null,null,null,{"$f":"IF(B12=\"\",\"\",ROUND((D12*Q12),2))","v":""},null,null,null,null,null,null,{"$f":"IF(B12<>\"\",IF(OR(A12=\"\",C12=\"\",E12=\"\",F12=\"\",G12=\"\"),1,0),0)","v":0},{"$f":"IF(G12>0,VLOOKUP('Personnel Sheet'!B12,Reference!A$9:C$23,3,FALSE),0)","v":0},{"$f":"IF(G12>P12,P12,G12)","v":0}]
[null,null,null,{"$f":"IF(B13=\"\",\"\",VLOOKUP(B13,Reference!A$9:B$23,2,FALSE))","v":""},null,null,null,{"$f":"IF(B13=\"\",\"\",ROUND((D13*Q13),2))","v":""},null,null,null,null,null,null,{"$f":"IF(B13<>\"\",IF(OR(A13=\"\",C13=\"\",E13=\"\",F13=\"\",G13=\"\"),1,0),0)","v":0},{"$f":"IF(G13>0,VLOOKUP('Personnel Sheet'!B13,Reference!A$9:C$23,3,FALSE),0)","v":0},{"$f":"IF(G13>P13,P13,G13)","v":0}]
[null,null,null,{"$f":"IF(B14=\"\",\"\",VLOOKUP(B14,Reference!A$9:B$23,2,FALSE))","v":""},null,null,null,"",null,null,null,null,null,null,0,{"$f":"IF(G14>0,VLOOKUP('Personnel Sheet'!B14,Reference!A$9:C$23,3,FALSE),0)","v":0},0]
[null,null,null,{"$f":"IF(B15=\"\",\"\",VLOOKUP(B15,Reference!A$9:B$23,2,FALSE))","v":""},null,null,null,"",null,null,null,null,null,null,0,{"$f":"IF(G15>0,VLOOKUP('Personnel Sheet'!B15,Reference!A$9:C$23,3,FALSE),0)","v":0},0]
[null,null,null,{"$f":"IF(B16=\"\",\"\",VLOOKUP(B16,Reference!A$9:B$23,2,FALSE))","v":""},null,null,null,"",null,null,null,null,null,null,0,{"$f":"IF(G16>0,VLOOKUP('Personnel Sheet'!B16,Reference!A$9:C$23,3,FALSE),0)","v":0},0]
[null,null,null,{"$f":"IF(B17=\"\",\"\",VLOOKUP(B17,Reference!A$9:B$23,2,FALSE))","v":""},null,null,null,"",null,null,null,null,null,null,0,{"$f":"IF(G17>0,VLOOKUP('Personnel Sheet'!B17,Reference!A$9:C$23,3,FALSE),0)","v":0},0]
[null,null,null,{"$f":"IF(B18=\"\",\"\",VLOOKUP(B18,Reference!A$9:B$23,2,FALSE))","v":""},null,null,null,"",null,null,null,null,null,null,0,{"$f":"IF(G18>0,VLOOKUP('Personnel Sheet'!B18,Reference!A$9:C$23,3,FALSE),0)","v":0},0]
[null,null,null,{"$f":"IF(B19=\"\",\"\",VLOOKUP(B19,Reference!A$9:B$23,2,FALSE))","v":""},null,null,null,"",null,null,null,null,null,null,0,{"$f":"IF(G19>0,VLOOKUP('Personnel Sheet'!B19,Reference!A$9:C$23,3,FALSE),0)","v":0},0]
[null,null,null,{"$f":"IF(B20=\"\",\"\",VLOOKUP(B20,Reference!A$9:B$23,2,FALSE))","v":""},null,null,null,"",null,null,null,null,null,null,0,{"$f":"IF(G20>0,VLOOKUP('Personnel Sheet'!B20,Reference!A$9:C$23,3,FALSE),0)","v":0},0]
[null,null,null,{"$f":"IF(B21=\"\",\"\",VLOOKUP(B21,Reference!A$9:B$23,2,FALSE))","v":""},null,null,null,"",null,null,null,null,null,null,0,{"$f":"IF(G21>0,VLOOKUP('Personnel Sheet'!B21,Reference!A$9:C$23,3,FALSE),0)","v":0},0]
[null,null,null,{"$f":"IF(B22=\"\",\"\",VLOOKUP(B22,Reference!A$9:B$23,2,FALSE))","v":""},null,null,null,"",null,null,null,null,null,null,0,{"$f":"IF(G22>0,VLOOKUP('Personnel Sheet'!B22,Reference!A$9:C$23,3,FALSE),0)","v":0},0]
[null,null,null,{"$f":"IF(B23=\"\",\"\",VLOOKUP(B23,Reference!A$9:B$23,2,FALSE))","v":""},null,null,null,"",null,null,null,null,null,null,0,{"$f":"IF(G23>0,VLOOKUP('Personnel Sheet'!B23,Reference!A$9:C$23,3,FALSE),0)","v":0},0]
[null,null,null,{"$f":"IF(B24=\"\",\"\",VLOOKUP(B24,Reference!A$9:B$23,2,FALSE))","v":""},null,null,null,"",null,null,null,null,null,null,0,{"$f":"IF(G24>0,VLOOKUP('Personnel Sheet'!B24,Reference!A$9:C$23,3,FALSE),0)","v":0},0]
[null,null,null,{"$f":"IF(B25=\"\",\"\",VLOOKUP(B25,Reference!A$9:B$23,2,FALSE))","v":""},null,null,null,"",null,null,null,null,null,null,0,{"$f":"IF(G25>0,VLOOKUP('Personnel Sheet'!B25,Reference!A$9:C$23,3,FALSE),0)","v":0},0]
[null,null,null,{"$f":"IF(B26=\"\",\"\",VLOOKUP(B26,Reference!A$9:B$23,2,FALSE))","v":""},null,null,null,"",null,null,null,null,null,null,0,{"$f":"IF(G26>0,VLOOKUP('Personnel Sheet'!B26,Reference!A$9:C$23,3,FALSE),0)","v":0},0]
[null,null,null,{"$f":"IF(B27=\"\",\"\",VLOOKUP(B27,Reference!A$9:B$23,2,FALSE))","v":""},null,null,null,"",null,null,null,null,null,null,0,{"$f":"IF(G27>0,VLOOKUP('Personnel Sheet'!B27,Reference!A$9:C$23,3,FALSE),0)","v":0},0]
[null,null,null,{"$f":"IF(B28=\"\",\"\",VLOOKUP(B28,Reference!A$9:B$23,2,FALSE))","v":""},null,null,null,"",null,null,null,null,null,null,0,{"$f":"IF(G28>0,VLOOKUP('Personnel Sheet'!B28,Reference!A$9:C$23,3,FALSE),0)","v":0},0]
[null,null,null,{"$f":"IF(B29=\"\",\"\",VLOOKUP(B29,Reference!A$9:B$23,2,FALSE))","v":""},null,null,null,{"$f":"IF(B29=\"\",\"\",ROUND((D29*Q29),2))","v":""},null,null,null,null,null,null,{"$f":"IF(B29<>\"\",IF(OR(A29=\"\",C29=\"\",E29=\"\",F29=\"\",G29=\"\"),1,0),0)","v":0},{"$f":"IF(G29>0,VLOOKUP('Personnel Sheet'!B29,Reference!A$9:C$23,3,FALSE),0)","v":0},{"$f":"IF(G29>P29,P29,G29)","v":0}]
[null,null,null,{"$f":"IF(B30=\"\",\"\",VLOOKUP(B30,Reference!A$9:B$23,2,FALSE))","v":""},null,null,null,"",null,null,null,{"$f":"IF(SUM(H12:H30)>0,1,0)","v":0},"Print check",null,0,{"$f":"IF(G30>0,VLOOKUP('Personnel Sheet'!B30,Reference!A$9:C$23,3,FALSE),0)","v":0},0]
["*Only one individual can perform this duty for a specific time period."]
["**A limited number of hours is allowable for this position. "]
[]
[]
[]
[]
[]
["PART 5.A"]
["PERSONNEL SUPPLEMENTARY SHEET"]
[null,null,null,null,{"$f":"IF(SUM(O46:O64)>0,\"MISSING INFORMATION\",\"\")","v":""}]
[]
[]
["Personnel charges for work activities included in unit pricing should not be addressed on this form."]
[]
["Costing Category","Personnel Duties","Employee Name","Hourly Rate","Work Performed\nDate,  Location (field or office) and Description","RAC Invoice No.","No.     HRS","TOTAL",null,null,null,null,null,null,"Test","Max Hours","Adjusted Hours"]
[null,null,null,{"$f":"IF(B46=\"\",\"\",VLOOKUP(B46,Reference!A$9:B$23,2,FALSE))","v":""},null,null,null,{"$f":"IF(B46=\"\",\"\",ROUND((D46*Q46),2))","v":""},null,null,null,null,null,null,{"$f":"IF(B46<>\"\",IF(OR(A46=\"\",C46=\"\",E46=\"\",F46=\"\",G46=\"\"),1,0),0)","v":0},{"$f":"IF(G46>0,VLOOKUP('Personnel Sheet'!B46,Reference!A$9:C$23,3,FALSE),0)","v":0},{"$f":"IF(G46>P46,P46,G46)","v":0}]
[null,null,null,{"$f":"IF(B47=\"\",\"\",VLOOKUP(B47,Reference!A$9:B$23,2,FALSE))","v":""},null,null,null,{"$f":"IF(B47=\"\",\"\",ROUND((D47*Q47),2))","v":""},null,null,null,null,null,null,{"$f":"IF(B47<>\"\",IF(OR(A47=\"\",C47=\"\",E47=\"\",F47=\"\",G47=\"\"),1,0),0)","v":0},{"$f":"IF(G47>0,VLOOKUP('Personnel Sheet'!B47,Reference!A$9:C$23,3,FALSE),0)","v":0},{"$f":"IF(G47>P47,P47,G47)","v":0}]
[null,null,null,{"$f":"IF(B48=\"\",\"\",VLOOKUP(B48,Reference!A$9:B$23,2,FALSE))","v":""},null,null,null,"",null,null,null,null,null,null,0,{"$f":"IF(G48>0,VLOOKUP('Personnel Sheet'!B48,Reference!A$9:C$23,3,FALSE),0)","v":0},0]
[null,null,null,{"$f":"IF(B49=\"\",\"\",VLOOKUP(B49,Reference!A$9:B$23,2,FALSE))","v":""},null,null,null,"",null,null,null,null,null,null,0,{"$f":"IF(G49>0,VLOOKUP('Personnel Sheet'!B49,Reference!A$9:C$23,3,FALSE),0)","v":0},0]
[null,null,null,{"$f":"IF(B50=\"\",\"\",VLOOKUP(B50,Reference!A$9:B$23,2,FALSE))","v":""},null,null,null,"",null,null,null,null,null,null,0,{"$f":"IF(G50>0,VLOOKUP('Personnel Sheet'!B50,Reference!A$9:C$23,3,FALSE),0)","v":0},0]
[null,null,null,{"$f":"IF(B51=\"\",\"\",VLOOKUP(B51,Reference!A$9:B$23,2,FALSE))","v":""},null,null,null,"",null,null,null,null,null,null,0,{"$f":"IF(G51>0,VLOOKUP('Personnel Sheet'!B51,Reference!A$9:C$23,3,FALSE),0)","v":0},0]
[null,null,null,{"$f":"IF(B52=\"\",\"\",VLOOKUP(B52,Reference!A$9:B$23,2,FALSE))","v":""},null,null,null,"",null,null,null,null,null,null,0,{"$f":"IF(G52>0,VLOOKUP('Personnel Sheet'!B52,Reference!A$9:C$23,3,FALSE),0)","v":0},0]
[null,null,null,{"$f":"IF(B53=\"\",\"\",VLOOKUP(B53,Reference!A$9:B$23,2,FALSE))","v":""},null,null,null,"",null,null,null,null,null,null,0,{"$f":"IF(G53>0,VLOOKUP('Personnel Sheet'!B53,Reference!A$9:C$23,3,FALSE),0)","v":0},0]
[null,null,null,{"$f":"IF(B54=\"\",\"\",VLOOKUP(B54,Reference!A$9:B$23,2,FALSE))","v":""},null,null,null,"",null,null,null,null,null,null,0,{"$f":"IF(G54>0,VLOOKUP('Personnel Sheet'!B54,Reference!A$9:C$23,3,FALSE),0)","v":0},0]
[null,null,null,{"$f":"IF(B55=\"\",\"\",VLOOKUP(B55,Reference!A$9:B$23,2,FALSE))","v":""},null,null,null,"",null,null,null,null,null,null,0,{"$f":"IF(G55>0,VLOOKUP('Personnel Sheet'!B55,Reference!A$9:C$23,3,FALSE),0)","v":0},0]
[null,null,null,{"$f":"IF(B56=\"\",\"\",VLOOKUP(B56,Reference!A$9:B$23,2,FALSE))","v":""},null,null,null,"",null,null,null,null,null,null,0,{"$f":"IF(G56>0,VLOOKUP('Personnel Sheet'!B56,Reference!A$9:C$23,3,FALSE),0)","v":0},0]
[null,null,null,{"$f":"IF(B57=\"\",\"\",VLOOKUP(B57,Reference!A$9:B$23,2,FALSE))","v":""},null,null,null,"",null,null,null,null,null,null,0,{"$f":"IF(G57>0,VLOOKUP('Personnel Sheet'!B57,Reference!A$9:C$23,3,FALSE),0)","v":0},0]
[null,null,null,{"$f":"IF(B58=\"\",\"\",VLOOKUP(B58,Reference!A$9:B$23,2,FALSE))","v":""},null,null,null,"",null,null,null,null,null,null,0,{"$f":"IF(G58>0,VLOOKUP('Personnel Sheet'!B58,Reference!A$9:C$23,3,FALSE),0)","v":0},0]
[null,null,null,{"$f":"IF(B59=\"\",\"\",VLOOKUP(B59,Reference!A$9:B$23,2,FALSE))","v":""},null,null,null,"",null,null,null,null,null,null,0,{"$f":"IF(G59>0,VLOOKUP('Personnel Sheet'!B59,Reference!A$9:C$23,3,FALSE),0)","v":0},0]
[null,null,null,{"$f":"IF(B60=\"\",\"\",VLOOKUP(B60,Reference!A$9:B$23,2,FALSE))","v":""},null,null,null,"",null,null,null,null,null,null,0,{"$f":"IF(G60>0,VLOOKUP('Personnel Sheet'!B60,Reference!A$9:C$23,3,FALSE),0)","v":0},0]
[null,null,null,{"$f":"IF(B61=\"\",\"\",VLOOKUP(B61,Reference!A$9:B$23,2,FALSE))","v":""},null,null,null,"",null,null,null,null,null,null,0,{"$f":"IF(G61>0,VLOOKUP('Personnel Sheet'!B61,Reference!A$9:C$23,3,FALSE),0)","v":0},0]
[null,null,null,{"$f":"IF(B62=\"\",\"\",VLOOKUP(B62,Reference!A$9:B$23,2,FALSE))","v":""},null,null,null,"",null,null,null,null,null,null,0,{"$f":"IF(G62>0,VLOOKUP('Personnel Sheet'!B62,Reference!A$9:C$23,3,FALSE),0)","v":0},0]
[null,null,null,{"$f":"IF(B63=\"\",\"\",VLOOKUP(B63,Reference!A$9:B$23,2,FALSE))","v":""},null,null,null,"",null,null,null,null,null,null,0,{"$f":"IF(G63>0,VLOOKUP('Personnel Sheet'!B63,Reference!A$9:C$23,3,FALSE),0)","v":0},0]
[null,null,null,{"$f":"IF(B64=\"\",\"\",VLOOKUP(B64,Reference!A$9:B$23,2,FALSE))","v":""},null,null,null,"",null,null,null,{"$f":"IF(SUM(H45:H64)>0,1,0)","v":0},"Print check",null,0,{"$f":"IF(G64>0,VLOOKUP('Personnel Sheet'!B64,Reference!A$9:C$23,3,FALSE),0)","v":0},{"$f":"IF(G64>P64,P64,G64)","v":0}]
["*Only one individual can perform this duty for a specific time period."]
["**A limited number of hours is allowable for this position. "]

{"sheet":"Soil-Water Disposal","index":8,"n_rows":55,"n_cols":30,"rows_kept":55,"cut":false,"hidden":false,"merged":[[28,0,28,9],[29,0,29,9],[39,0,39,9],[31,0,31,5],[32,0,32,5],[35,0,35,9],[37,0,38,9],[33,0,34,9],[3,0,3,1],[27,0,27,6],[3,6,3,9],[12,0,12,9],[6,6,6,8],[7,6,7,8],[6,0,6,5],[4,6,4,8],[5,6,5,8],[5,0,5,5],[4,0,4,5],[7,0,7,5],[8,0,8,5],[9,0,9,5],[10,0,10,5],[11,0,11,5]]}
["PART 5.B",null,null,null,null,null,null,null,null,null,null,null,null,{"$f":"+N27+N55","v":0},"Total Print check"]
["SOIL/WATER DISPOSAL SUPPLEMENTARY SHEET"]
[]
[{"$f":"IF(SUM(T15:T27)>0,\"MISSING INFORMATION\",\"\")","v":""},null,null,null,null,null,"Costing Category Summary"]
["1.    The unit rate for purge water disposal for groundwater sampling events is $5.15/gal.",null,null,null,null,null,"Emergency/Initial",null,null,{"$f":"SUMIF($A$15:$A$27,G5,$J$15:$J$27)+SUMIF($A$43:$A$55,G5,$J$43:$J$55)","v":0}]
["2.    Addresses, manifests, bills of lading, etc. must be provided for disposal charges.",null,null,null,null,null,"Investigation",null,null,{"$f":"SUMIF($A$15:$A$27,G6,$J$15:$J$27)+SUMIF($A$43:$A$55,G6,$J$43:$J$55)","v":0}]
["3.    Purge water disposal not associated with groundwater sampling is reimbursed at ",null,null,null,null,null,"Interim Monitoring",null,null,{"$f":"SUMIF($A$15:$A$27,G7,$J$15:$J$27)+SUMIF($A$43:$A$55,G7,$J$43:$J$55)","v":0}]
["       invoice costs plus 10% markup not to exceed the maximum of $0.63/gal.",null,null,null,null,null,"Corrective Action Plan",null,null,{"$f":"SUMIF($A$15:$A$27,G8,$J$15:$J$27)+SUMIF($A$43:$A$55,G8,$J$43:$J$55)","v":0}]
["4.    RAC markups should not be addressed on this page.  Indicate markups on Part 5.H (1)."]
["5.    Soil drum disposal (not associated with excavation): $845.00 minimum, $338.00 for the first drum, $254.00 each additional drum."]
["6.    For excavation/transportation/disposal unit rates, please refer to the most recent  “Excavation Cost Evaluation Spreadsheet” \n       on http://www.deq.louisiana.gov/trustfund."]
["7.   For cost reductions associated with non-impacted soil and onsite, treated soil, enter the total tonnage removed in the upper section and \n      the appropriate tonnage value in the lower section."]
[]
["Costing Category","Disposal \nCategory Type","Source of Waste and Description","Disposal Date","RAC\nInvoice\nNo.","Outside\nInvoice\nNo.","Tons, Drums Units, or\nGallons","Quantity","Cost Per Unit ","TOTAL",null,null,null,null,null,"Soil Cuttings","UNIT","TONS","DRUMS","Test",null,null,null,null,null,null,null,"TONS","DRUMS","GALLONS"]
[null,null,null,null,null,null,null,null,null,{"$f":"IF(OR(G15=\"TONS\",G15=\"Unit\"),AB15*H15,IF(G15=\"DRUMS\",AC15,AD15))","v":0},null,null,null,null,null,"Water",null,"GALLONS",null,{"$f":"IF(B15<>\"\",IF(OR(A15=\"\",D15=\"\",E15=\"\",G15=\"\",H15=\"\"),1,0),0)","v":0},null,null,null,null,null,null,null,{"$f":"IF(AND(B15=\"Excavation\",G15=\"TONS\"),IF(I15>0,I15,VLOOKUP(INT(H15),ExcData!D$18:F$5017,2,FALSE)),IF(AND(OR(B15=\"Soil Cuttings\",B15=\"Other solid waste\"),OR(G15=\"Unit\",G15=\"Tons\")),I15,0))","v":0},{"$f":"IF(G15=\"DRUMS\",IF(IF(H15>1,Reference!B$296+(H15-1)*Reference!B$297,Reference!B$296)<Reference!B$298,Reference!B$298,IF(H15>1,Reference!B$296+(H15-1)*Reference!B$297,Reference!B$296)),0)","v":0},{"$f":"IF(G15=\"GALLONS\",I15*H15,0)","v":0}]
[null,null,null,null,null,null,null,null,null,{"$f":"IF(OR(G16=\"TONS\",G16=\"Unit\"),AB16*H16,IF(G16=\"DRUMS\",AC16,AD16))","v":0},null,null,null,null,null,"Excavation",null,"TONS",null,{"$f":"IF(B16<>\"\",IF(OR(A16=\"\",D16=\"\",E16=\"\",G16=\"\",H16=\"\"),1,0),0)","v":0},null,null,null,null,null,null,null,{"$f":"IF(AND(B16=\"Excavation\",G16=\"TONS\"),IF(I16>0,I16,VLOOKUP(INT(H16),ExcData!D$18:F$5017,2,FALSE)),IF(AND(OR(B16=\"Soil Cuttings\",B16=\"Other solid waste\"),OR(G16=\"Unit\",G16=\"Tons\")),I16,0))","v":0},{"$f":"IF(G16=\"DRUMS\",IF(IF(H16>1,Reference!B$296+(H16-1)*Reference!B$297,Reference!B$296)<Reference!B$298,Reference!B$298,IF(H16>1,Reference!B$296+(H16-1)*Reference!B$297,Reference!B$296)),0)","v":0},{"$f":"IF(G16=\"GALLONS\",I16*H16,0)","v":0}]
[null,null,null,null,null,null,null,null,null,0,null,null,null,null,null,"Other solid waste","UNIT","TONS","DRUMS",0,null,null,null,null,null,null,null,{"$f":"IF(AND(B17=\"Excavation\",G17=\"TONS\"),IF(I17>0,I17,VLOOKUP(INT(H17),ExcData!D$18:F$5017,2,FALSE)),IF(AND(OR(B17=\"Soil Cuttings\",B17=\"Other solid waste\"),OR(G17=\"Unit\",G17=\"Tons\")),I17,0))","v":0},{"$f":"IF(G17=\"DRUMS\",IF(IF(H17>1,Reference!B$296+(H17-1)*Reference!B$297,Reference!B$296)<Reference!B$298,Reference!B$298,IF(H17>1,Reference!B$296+(H17-1)*Reference!B$297,Reference!B$296)),0)","v":0},0]
[null,null,null,null,null,null,null,null,null,0,null,null,null,null,null,null,null,null,null,0,null,null,null,null,null,null,null,{"$f":"IF(AND(B18=\"Excavation\",G18=\"TONS\"),IF(I18>0,I18,VLOOKUP(INT(H18),ExcData!D$18:F$5017,2,FALSE)),IF(AND(OR(B18=\"Soil Cuttings\",B18=\"Other solid waste\"),OR(G18=\"Unit\",G18=\"Tons\")),I18,0))","v":0},{"$f":"IF(G18=\"DRUMS\",IF(IF(H18>1,Reference!B$296+(H18-1)*Reference!B$297,Reference!B$296)<Reference!B$298,Reference!B$298,IF(H18>1,Reference!B$296+(H18-1)*Reference!B$297,Reference!B$296)),0)","v":0},0]
[null,null,null,null,null,null,null,null,null,0,null,null,null,null,null,null,null,null,null,0,null,null,null,null,null,null,null,{"$f":"IF(AND(B19=\"Excavation\",G19=\"TONS\"),IF(I19>0,I19,VLOOKUP(INT(H19),ExcData!D$18:F$5017,2,FALSE)),IF(AND(OR(B19=\"Soil Cuttings\",B19=\"Other solid waste\"),OR(G19=\"Unit\",G19=\"Tons\")),I19,0))","v":0},{"$f":"IF(G19=\"DRUMS\",IF(IF(H19>1,Reference!B$296+(H19-1)*Reference!B$297,Reference!B$296)<Reference!B$298,Reference!B$298,IF(H19>1,Reference!B$296+(H19-1)*Reference!B$297,Reference!B$296)),0)","v":0},0]
[null,null,null,null,null,null,null,null,null,0,null,null,null,null,null,null,null,null,null,0,null,null,null,null,null,null,null,{"$f":"IF(AND(B20=\"Excavation\",G20=\"TONS\"),IF(I20>0,I20,VLOOKUP(INT(H20),ExcData!D$18:F$5017,2,FALSE)),IF(AND(OR(B20=\"Soil Cuttings\",B20=\"Other solid waste\"),OR(G20=\"Unit\",G20=\"Tons\")),I20,0))","v":0},{"$f":"IF(G20=\"DRUMS\",IF(IF(H20>1,Reference!B$296+(H20-1)*Reference!B$297,Reference!B$296)<Reference!B$298,Reference!B$298,IF(H20>1,Reference!B$296+(H20-1)*Reference!B$297,Reference!B$296)),0)","v":0},0]
[null,null,null,null,null,null,null,null,null,0,null,null,null,null,null,null,null,null,null,0,null,null,null,null,null,null,null,{"$f":"IF(AND(B21=\"Excavation\",G21=\"TONS\"),IF(I21>0,I21,VLOOKUP(INT(H21),ExcData!D$18:F$5017,2,FALSE)),IF(AND(OR(B21=\"Soil Cuttings\",B21=\"Other solid waste\"),OR(G21=\"Unit\",G21=\"Tons\")),I21,0))","v":0},{"$f":"IF(G21=\"DRUMS\",IF(IF(H21>1,Reference!B$296+(H21-1)*Reference!B$297,Reference!B$296)<Reference!B$298,Reference!B$298,IF(H21>1,Reference!B$296+(H21-1)*Reference!B$297,Reference!B$296)),0)","v":0},{"$f":"IF(G21=\"GALLONS\",I21*H21,0)","v":0}]
[null,null,null,null,null,null,null,null,null,0,null,null,null,null,null,null,null,null,null,0,null,null,null,null,null,null,null,{"$f":"IF(AND(B22=\"Excavation\",G22=\"TONS\"),IF(I22>0,I22,VLOOKUP(INT(H22),ExcData!D$18:F$5017,2,FALSE)),IF(AND(OR(B22=\"Soil Cuttings\",B22=\"Other solid waste\"),OR(G22=\"Unit\",G22=\"Tons\")),I22,0))","v":0},{"$f":"IF(G22=\"DRUMS\",IF(IF(H22>1,Reference!B$296+(H22-1)*Reference!B$297,Reference!B$296)<Reference!B$298,Reference!B$298,IF(H22>1,Reference!B$296+(H22-1)*Reference!B$297,Reference!B$296)),0)","v":0},0]
[null,null,null,null,null,null,null,null,null,0,null,null,null,null,null,null,null,null,null,0,null,null,null,null,null,null,null,{"$f":"IF(AND(B23=\"Excavation\",G23=\"TONS\"),IF(I23>0,I23,VLOOKUP(INT(H23),ExcData!D$18:F$5017,2,FALSE)),IF(AND(OR(B23=\"Soil Cuttings\",B23=\"Other solid waste\"),OR(G23=\"Unit\",G23=\"Tons\")),I23,0))","v":0},{"$f":"IF(G23=\"DRUMS\",IF(IF(H23>1,Reference!B$296+(H23-1)*Reference!B$297,Reference!B$296)<Reference!B$298,Reference!B$298,IF(H23>1,Reference!B$296+(H23-1)*Reference!B$297,Reference!B$296)),0)","v":0},0]
[null,null,null,null,null,null,null,null,null,0,null,null,null,null,null,null,null,null,null,0,null,null,null,null,null,null,null,{"$f":"IF(AND(B24=\"Excavation\",G24=\"TONS\"),IF(I24>0,I24,VLOOKUP(INT(H24),ExcData!D$18:F$5017,2,FALSE)),IF(AND(OR(B24=\"Soil Cuttings\",B24=\"Other solid waste\"),OR(G24=\"Unit\",G24=\"Tons\")),I24,0))","v":0},{"$f":"IF(G24=\"DRUMS\",IF(IF(H24>1,Reference!B$296+(H24-1)*Reference!B$297,Reference!B$296)<Reference!B$298,Reference!B$298,IF(H24>1,Reference!B$296+(H24-1)*Reference!B$297,Reference!B$296)),0)","v":0},0]
[null,null,null,null,null,null,null,null,null,0,null,null,null,null,null,null,null,null,null,0,null,null,null,null,null,null,null,{"$f":"IF(AND(B25=\"Excavation\",G25=\"TONS\"),IF(I25>0,I25,VLOOKUP(INT(H25),ExcData!D$18:F$5017,2,FALSE)),IF(AND(OR(B25=\"Soil Cuttings\",B25=\"Other solid waste\"),OR(G25=\"Unit\",G25=\"Tons\")),I25,0))","v":0},{"$f":"IF(G25=\"DRUMS\",IF(IF(H25>1,Reference!B$296+(H25-1)*Reference!B$297,Reference!B$296)<Reference!B$298,Reference!B$298,IF(H25>1,Reference!B$296+(H25-1)*Reference!B$297,Reference!B$296)),0)","v":0},0]
[null,null,"Non-Impacted Soil",null,null,null,"TONS",null,-45,{"$f":"IF(A26=\"\",0,IF(H26=\"\",0,H26*I26))","v":0},null,null,null,null,null,null,null,null,null,{"$f":"IF(H26<>\"\",IF(OR(A26=\"\",D26=\"\",E26=\"\"),1,0),0)","v":0}]
[null,null,"Treated Soil",null,null,null,"TONS",null,-30,{"$f":"IF(A27=\"\",0,IF(H27=\"\",0,H27*I27))","v":0},null,null,null,{"$f":"IF(SUM(J15:J27)>0,1,0)","v":0},"Print check",null,null,null,null,{"$f":"IF(H27<>\"\",IF(OR(A27=\"\",D27=\"\",E27=\"\"),1,0),0)","v":0}]
[]
["PART 5.B"]
["SOIL/WATER DISPOSAL SUPPLEMENTARY SHEET"]
[]
["1.    The unit rate for purge water disposal for groundwater sampling events is $5.15/gal."]
["2.    Addresses, manifests, bills of lading, etc. must be provided for disposal charges."]
["3.    Purge water disposal not associated with groundwater sampling is reimbursed at invoice costs plus 10% markup not to exceed \n       the maximum of $0.63/gal."]
[]
["4.    RAC markups should not be addressed on this page.  Indicate markups on Part 5.H (1)."]
["5.    Soil drum disposal (not associated with excavation): $845.00 minimum, $338.00 for the first drum, $254.00 each additional drum."]
["6.    For excavation/transportation/disposal unit rates, please refer to the most recent  “Excavation Cost Evaluation Spreadsheet” \n       on http://www.deq.louisiana.gov/trustfund."]
[]
["7.   For cost reductions associated with non-impacted soil and onsite, treated soil, enter the total tonnage removed in the upper section and \n      the appropriate tonnage value in the lower section."]
[]
["Costing Category","Disposal \nCategory Type","Source of Waste and Description","Disposal Date","RAC\nInvoice\nNo.","Outside\nInvoice\nNo.","Tons, Drums Units, or\nGallons","Quantity","Cost Per Unit","TOTAL",null,null,null,null,null,null,null,null,null,"Test",null,null,null,null,null,null,null,"TONS","DRUMS","GALLONS"]
[null,null,null,null,null,null,null,null,null,{"$f":"IF(OR(G43=\"TONS\",G43=\"Unit\"),AB43*H43,IF(G43=\"DRUMS\",AC43,AD43))","v":0},null,null,null,null,null,null,null,null,null,{"$f":"IF(B43<>\"\",IF(OR(A43=\"\",D43=\"\",E43=\"\",G43=\"\",H43=\"\"),1,0),0)","v":0},null,null,null,null,null,null,null,{"$f":"IF(AND(B43=\"Excavation\",G43=\"TONS\"),IF(I43>0,I43,VLOOKUP(INT(H43),ExcData!D$18:F$5017,2,FALSE)),IF(AND(OR(B43=\"Soil Cuttings\",B43=\"Other solid waste\"),OR(G43=\"Unit\",G43=\"Tons\")),I43,0))","v":0},{"$f":"IF(G43=\"DRUMS\",IF(IF(H43>1,Reference!B$296+(H43-1)*Reference!B$297,Reference!B$296)<Reference!B$298,Reference!B$298,IF(H43>1,Reference!B$296+(H43-1)*Reference!B$297,Reference!B$296)),0)","v":0},{"$f":"IF(G43=\"GALLONS\",I43*H43,0)","v":0}]
[null,null,null,null,null,null,null,null,null,0,null,null,null,null,null,null,null,null,null,{"$f":"IF(B44<>\"\",IF(OR(A44=\"\",D44=\"\",E44=\"\",G44=\"\",H44=\"\"),1,0),0)","v":0},null,null,null,null,null,null,null,{"$f":"IF(AND(B44=\"Excavation\",G44=\"TONS\"),IF(I44>0,I44,VLOOKUP(INT(H44),ExcData!D$18:F$5017,2,FALSE)),IF(AND(OR(B44=\"Soil Cuttings\",B44=\"Other solid waste\"),OR(G44=\"Unit\",G44=\"Tons\")),I44,0))","v":0},{"$f":"IF(G44=\"DRUMS\",IF(IF(H44>1,Reference!B$296+(H44-1)*Reference!B$297,Reference!B$296)<Reference!B$298,Reference!B$298,IF(H44>1,Reference!B$296+(H44-1)*Reference!B$297,Reference!B$296)),0)","v":0},{"$f":"IF(G44=\"GALLONS\",I44*H44,0)","v":0}]
[null,null,null,null,null,null,null,null,null,0,null,null,null,null,null,null,null,null,null,0,null,null,null,null,null,null,null,{"$f":"IF(AND(B45=\"Excavation\",G45=\"TONS\"),IF(I45>0,I45,VLOOKUP(INT(H45),ExcData!D$18:F$5017,2,FALSE)),IF(AND(OR(B45=\"Soil Cuttings\",B45=\"Other solid waste\"),OR(G45=\"Unit\",G45=\"Tons\")),I45,0))","v":0},{"$f":"IF(G45=\"DRUMS\",IF(IF(H45>1,Reference!B$296+(H45-1)*Reference!B$297,Reference!B$296)<Reference!B$298,Reference!B$298,IF(H45>1,Reference!B$296+(H45-1)*Reference!B$297,Reference!B$296)),0)","v":0},0]
[null,null,null,null,null,null,null,null,null,0,null,null,null,null,null,null,null,null,null,0,null,null,null,null,null,null,null,{"$f":"IF(AND(B46=\"Excavation\",G46=\"TONS\"),IF(I46>0,I46,VLOOKUP(INT(H46),ExcData!D$18:F$5017,2,FALSE)),IF(AND(OR(B46=\"Soil Cuttings\",B46=\"Other solid waste\"),OR(G46=\"Unit\",G46=\"Tons\")),I46,0))","v":0},{"$f":"IF(G46=\"DRUMS\",IF(IF(H46>1,Reference!B$296+(H46-1)*Reference!B$297,Reference!B$296)<Reference!B$298,Reference!B$298,IF(H46>1,Reference!B$296+(H46-1)*Reference!B$297,Reference!B$296)),0)","v":0},0]
[null,null,null,null,null,null,null,null,null,0,null,null,null,null,null,null,null,null,null,0,null,null,null,null,null,null,null,{"$f":"IF(AND(B47=\"Excavation\",G47=\"TONS\"),IF(I47>0,I47,VLOOKUP(INT(H47),ExcData!D$18:F$5017,2,FALSE)),IF(AND(OR(B47=\"Soil Cuttings\",B47=\"Other solid waste\"),OR(G47=\"Unit\",G47=\"Tons\")),I47,0))","v":0},{"$f":"IF(G47=\"DRUMS\",IF(IF(H47>1,Reference!B$296+(H47-1)*Reference!B$297,Reference!B$296)<Reference!B$298,Reference!B$298,IF(H47>1,Reference!B$296+(H47-1)*Reference!B$297,Reference!B$296)),0)","v":0},0]
[null,null,null,null,null,null,null,null,null,0,null,null,null,null,null,null,null,null,null,0,null,null,null,null,null,null,null,{"$f":"IF(AND(B48=\"Excavation\",G48=\"TONS\"),IF(I48>0,I48,VLOOKUP(INT(H48),ExcData!D$18:F$5017,2,FALSE)),IF(AND(OR(B48=\"Soil Cuttings\",B48=\"Other solid waste\"),OR(G48=\"Unit\",G48=\"Tons\")),I48,0))","v":0},{"$f":"IF(G48=\"DRUMS\",IF(IF(H48>1,Reference!B$296+(H48-1)*Reference!B$297,Reference!B$296)<Reference!B$298,Reference!B$298,IF(H48>1,Reference!B$296+(H48-1)*Reference!B$297,Reference!B$296)),0)","v":0},0]
[null,null,null,null,null,null,null,null,null,0,null,null,null,null,null,null,null,null,null,0,null,null,null,null,null,null,null,{"$f":"IF(AND(B49=\"Excavation\",G49=\"TONS\"),IF(I49>0,I49,VLOOKUP(INT(H49),ExcData!D$18:F$5017,2,FALSE)),IF(AND(OR(B49=\"Soil Cuttings\",B49=\"Other solid waste\"),OR(G49=\"Unit\",G49=\"Tons\")),I49,0))","v":0},{"$f":"IF(G49=\"DRUMS\",IF(IF(H49>1,Reference!B$296+(H49-1)*Reference!B$297,Reference!B$296)<Reference!B$298,Reference!B$298,IF(H49>1,Reference!B$296+(H49-1)*Reference!B$297,Reference!B$296)),0)","v":0},0]
[null,null,null,null,null,null,null,null,null,0,null,null,null,null,null,null,null,null,null,0,null,null,null,null,null,null,null,{"$f":"IF(AND(B50=\"Excavation\",G50=\"TONS\"),IF(I50>0,I50,VLOOKUP(INT(H50),ExcData!D$18:F$5017,2,FALSE)),IF(AND(OR(B50=\"Soil Cuttings\",B50=\"Other solid waste\"),OR(G50=\"Unit\",G50=\"Tons\")),I50,0))","v":0},{"$f":"IF(G50=\"DRUMS\",IF(IF(H50>1,Reference!B$296+(H50-1)*Reference!B$297,Reference!B$296)<Reference!B$298,Reference!B$298,IF(H50>1,Reference!B$296+(H50-1)*Reference!B$297,Reference!B$296)),0)","v":0},0]
[null,null,null,null,null,null,null,null,null,0,null,null,null,null,null,null,null,null,null,0,null,null,null,null,null,null,null,{"$f":"IF(AND(B51=\"Excavation\",G51=\"TONS\"),IF(I51>0,I51,VLOOKUP(INT(H51),ExcData!D$18:F$5017,2,FALSE)),IF(AND(OR(B51=\"Soil Cuttings\",B51=\"Other solid waste\"),OR(G51=\"Unit\",G51=\"Tons\")),I51,0))","v":0},{"$f":"IF(G51=\"DRUMS\",IF(IF(H51>1,Reference!B$296+(H51-1)*Reference!B$297,Reference!B$296)<Reference!B$298,Reference!B$298,IF(H51>1,Reference!B$296+(H51-1)*Reference!B$297,Reference!B$296)),0)","v":0},0]
[null,null,null,null,null,null,null,null,null,0,null,null,null,null,null,null,null,null,null,0,null,null,null,null,null,null,null,{"$f":"IF(AND(B52=\"Excavation\",G52=\"TONS\"),IF(I52>0,I52,VLOOKUP(INT(H52),ExcData!D$18:F$5017,2,FALSE)),IF(AND(OR(B52=\"Soil Cuttings\",B52=\"Other solid waste\"),OR(G52=\"Unit\",G52=\"Tons\")),I52,0))","v":0},{"$f":"IF(G52=\"DRUMS\",IF(IF(H52>1,Reference!B$296+(H52-1)*Reference!B$297,Reference!B$296)<Reference!B$298,Reference!B$298,IF(H52>1,Reference!B$296+(H52-1)*Reference!B$297,Reference!B$296)),0)","v":0},0]
[null,null,null,null,null,null,null,null,null,0,null,null,null,null,null,null,null,null,null,0,null,null,null,null,null,null,null,{"$f":"IF(AND(B53=\"Excavation\",G53=\"TONS\"),IF(I53>0,I53,VLOOKUP(INT(H53),ExcData!D$18:F$5017,2,FALSE)),IF(AND(OR(B53=\"Soil Cuttings\",B53=\"Other solid waste\"),OR(G53=\"Unit\",G53=\"Tons\")),I53,0))","v":0},{"$f":"IF(G53=\"DRUMS\",IF(IF(H53>1,Reference!B$296+(H53-1)*Reference!B$297,Reference!B$296)<Reference!B$298,Reference!B$298,IF(H53>1,Reference!B$296+(H53-1)*Reference!B$297,Reference!B$296)),0)","v":0},0]
[null,null,"Non-Impacted Soil",null,null,null,"TONS",null,-45,{"$f":"IF(A54=\"\",0,IF(H54=\"\",0,H54*I54))","v":0},null,null,null,null,null,null,null,null,null,{"$f":"IF(H54<>\"\",IF(OR(A54=\"\",D54=\"\",E54=\"\"),1,0),0)","v":0}]
[null,null,"Treated Soil",null,null,null,"TONS",null,-30,{"$f":"IF(A55=\"\",0,IF(H55=\"\",0,H55*I55))","v":0},null,null,null,{"$f":"IF(SUM(J43:J55)>0,1,0)","v":0},"Print check",null,null,null,null,{"$f":"IF(H55<>\"\",IF(OR(A55=\"\",D55=\"\",E55=\"\"),1,0),0)","v":0}]

{"sheet":"Equipment Rent-Purchase","index":9,"n_rows":65,"n_cols":19,"rows_kept":65,"cut":false,"hidden":false,"merged":[[10,0,10,12],[8,11,8,12],[8,8,8,10],[4,8,4,12],[5,8,5,10],[6,8,6,10],[7,8,7,10],[5,11,5,12],[6,11,6,12],[7,11,7,12]]}
["PART 5.C",null,null,null,null,null,null,null,null,null,null,null,null,null,null,null,{"$f":"+Q32+Q65","v":0},"Total Print check"]
["EQUIPMENT RENTAL/PURCHASE SUPPLEMENTARY SHEET"]
[]
[null,{"$f":"IF(SUM(S15:S65)>0,\"MISSING INFORMATION\",\"\")","v":""}]
["1.    List all charges for outside rentals, contractor-owned rental equipment, and purchased equipment.",null,null,null,null,null,null,null,"Costing Category Summary"]
["2.    A completed Treatment System Tracking Form (Part 7) & Purchase Agreement Form (Part 8) must be provided for treatment units.",null,null,null,null,null,null,null,"Emergency/Initial",null,null,{"$f":"SUMIF(A$15:A$32,I6,M$15:M$32)+SUMIF(A$48:A$65,I6,M$48:M$65)","v":0}]
["3.    Vehicle rental charges are not reimbursable.",null,null,null,null,null,null,null,"Investigation",null,null,{"$f":"SUMIF(A$15:A$32,I7,M$15:M$32)+SUMIF(A$48:A$65,I7,M$48:M$65)","v":0}]
["4.    (No. of Units/Time Used At Site) X (Rental Rate) = (Total)",null,null,null,null,null,null,null,"Interim Monitoring",null,null,{"$f":"SUMIF(A$15:A$32,I8,M$15:M$32)+SUMIF(A$48:A$65,I8,M$48:M$65)","v":0}]
["5.    Equipment charges for work activities included in unit pricing should not be included on this form.",null,null,null,null,null,null,null,"Corrective Action Plan",null,null,{"$f":"SUMIF(A$15:A$32,I9,M$15:M$32)+SUMIF(A$48:A$65,I9,M$48:M$65)","v":0}]
["6.    Rental rates for contractor-owned equipment are listed in Appendix B, Table 2 of the Guidance Document."]
["7.    Weekly rate goes into effect when equipment is used at a site for more than three days in a week (Mon – Sun). Daily rates are based on an 8-hour day. Hourly rate must be utilized for more or less than an 8-hour day."]
["8.    The ratings for the following equipment must be provided:  air compressor – cfm, backhoe – bucket size, dump truck – yard capacity, trackhoe – horsepower, vacuum truck - horsepower."]
[]
["Costing Category","Equipment","Description","RAC\nInvoice\nNo.","Outside\nInvoice\nNo.","Dates\nEquipment \nUsed","10% Markup Applies \n(Yes/No)","Units","Time Used ","Outside Vendor Rate ($)","RAC Owned Rate ($)","Markup Subtotal ($)","TOTAL",null,null,null,null,null,"Test"]
[null,null,null,null,null,null,null,null,null,null,{"$f":"IF(B15=\"\",\"\",VLOOKUP(B15,Reference!A$28:E$71,IF(H15=\"Hourly\",2,IF(H15=\"Daily\",3,IF(H15=\"Weekly\",4,5))),FALSE))","v":""},{"$f":"IF(G15=\"Yes\",ROUND(IF(J15=\"\",I15*K15,J15*I15)*0.1,2),0)","v":0},{"$f":"IF(A15=\"\",0,IF(B15=\"\",\"\",IF(J15=\"\",I15*K15,J15*I15)+L15))","v":0},null,null,null,null,null,{"$f":"IF(B15<>\"\",IF(OR(A15=\"\",C15=\"\",F15=\"\",H15=\"\",I15=\"\",CONCATENATE(D15,E15)=\"\"),1,0),0)","v":0}]
[null,null,null,null,null,null,null,null,null,null,{"$f":"IF(B16=\"\",\"\",VLOOKUP(B16,Reference!A$28:E$71,IF(H16=\"Hourly\",2,IF(H16=\"Daily\",3,IF(H16=\"Weekly\",4,5))),FALSE))","v":""},{"$f":"IF(G16=\"Yes\",ROUND(IF(J16=\"\",I16*K16,J16*I16)*0.1,2),0)","v":0},{"$f":"IF(A16=\"\",0,IF(B16=\"\",\"\",IF(J16=\"\",I16*K16,J16*I16)+L16))","v":0},null,null,null,null,null,{"$f":"IF(B16<>\"\",IF(OR(A16=\"\",C16=\"\",F16=\"\",H16=\"\",I16=\"\",CONCATENATE(D16,E16)=\"\"),1,0),0)","v":0}]
[null,null,null,null,null,null,null,null,null,null,{"$f":"IF(B17=\"\",\"\",VLOOKUP(B17,Reference!A$28:E$71,IF(H17=\"Hourly\",2,IF(H17=\"Daily\",3,IF(H17=\"Weekly\",4,5))),FALSE))","v":""},0,0,null,null,null,null,null,0]
[null,null,null,null,null,null,null,null,null,null,{"$f":"IF(B18=\"\",\"\",VLOOKUP(B18,Reference!A$28:E$71,IF(H18=\"Hourly\",2,IF(H18=\"Daily\",3,IF(H18=\"Weekly\",4,5))),FALSE))","v":""},0,0,null,null,null,null,null,0]
[null,null,null,null,null,null,null,null,null,null,{"$f":"IF(B19=\"\",\"\",VLOOKUP(B19,Reference!A$28:E$71,IF(H19=\"Hourly\",2,IF(H19=\"Daily\",3,IF(H19=\"Weekly\",4,5))),FALSE))","v":""},0,0,null,null,null,null,null,0]
[null,null,null,null,null,null,null,null,null,null,{"$f":"IF(B20=\"\",\"\",VLOOKUP(B20,Reference!A$28:E$71,IF(H20=\"Hourly\",2,IF(H20=\"Daily\",3,IF(H20=\"Weekly\",4,5))),FALSE))","v":""},0,0,null,null,null,null,null,0]
[null,null,null,null,null,null,null,null,null,null,{"$f":"IF(B21=\"\",\"\",VLOOKUP(B21,Reference!A$28:E$71,IF(H21=\"Hourly\",2,IF(H21=\"Daily\",3,IF(H21=\"Weekly\",4,5))),FALSE))","v":""},0,0,null,null,null,null,null,0]
[null,null,null,null,null,null,null,null,null,null,{"$f":"IF(B22=\"\",\"\",VLOOKUP(B22,Reference!A$28:E$71,IF(H22=\"Hourly\",2,IF(H22=\"Daily\",3,IF(H22=\"Weekly\",4,5))),FALSE))","v":""},0,0,null,null,null,null,null,0]
[null,null,null,null,null,null,null,null,null,null,{"$f":"IF(B23=\"\",\"\",VLOOKUP(B23,Reference!A$28:E$71,IF(H23=\"Hourly\",2,IF(H23=\"Daily\",3,IF(H23=\"Weekly\",4,5))),FALSE))","v":""},0,0,null,null,null,null,null,0]
[null,null,null,null,null,null,null,null,null,null,{"$f":"IF(B24=\"\",\"\",VLOOKUP(B24,Reference!A$28:E$71,IF(H24=\"Hourly\",2,IF(H24=\"Daily\",3,IF(H24=\"Weekly\",4,5))),FALSE))","v":""},0,0,null,null,null,null,null,0]
[null,null,null,null,null,null,null,null,null,null,{"$f":"IF(B25=\"\",\"\",VLOOKUP(B25,Reference!A$28:E$71,IF(H25=\"Hourly\",2,IF(H25=\"Daily\",3,IF(H25=\"Weekly\",4,5))),FALSE))","v":""},0,0,null,null,null,null,null,0]
[null,null,null,null,null,null,null,null,null,null,{"$f":"IF(B26=\"\",\"\",VLOOKUP(B26,Reference!A$28:E$71,IF(H26=\"Hourly\",2,IF(H26=\"Daily\",3,IF(H26=\"Weekly\",4,5))),FALSE))","v":""},0,0,null,null,null,null,null,0]
[null,null,null,null,null,null,null,null,null,null,{"$f":"IF(B27=\"\",\"\",VLOOKUP(B27,Reference!A$28:E$71,IF(H27=\"Hourly\",2,IF(H27=\"Daily\",3,IF(H27=\"Weekly\",4,5))),FALSE))","v":""},0,0,null,null,null,null,null,0]
[null,null,null,null,null,null,null,null,null,null,{"$f":"IF(B28=\"\",\"\",VLOOKUP(B28,Reference!A$28:E$71,IF(H28=\"Hourly\",2,IF(H28=\"Daily\",3,IF(H28=\"Weekly\",4,5))),FALSE))","v":""},0,0,null,null,null,null,null,0]
[null,null,null,null,null,null,null,null,null,null,{"$f":"IF(B29=\"\",\"\",VLOOKUP(B29,Reference!A$28:E$71,IF(H29=\"Hourly\",2,IF(H29=\"Daily\",3,IF(H29=\"Weekly\",4,5))),FALSE))","v":""},0,0,null,null,null,null,null,0]
[null,null,null,null,null,null,null,null,null,null,{"$f":"IF(B30=\"\",\"\",VLOOKUP(B30,Reference!A$28:E$71,IF(H30=\"Hourly\",2,IF(H30=\"Daily\",3,IF(H30=\"Weekly\",4,5))),FALSE))","v":""},0,0,null,null,null,null,null,0]
[null,null,null,null,null,null,null,null,null,null,{"$f":"IF(B31=\"\",\"\",VLOOKUP(B31,Reference!A$28:E$71,IF(H31=\"Hourly\",2,IF(H31=\"Daily\",3,IF(H31=\"Weekly\",4,5))),FALSE))","v":""},0,0,null,null,null,null,null,0]
[null,null,null,null,null,null,null,null,null,null,{"$f":"IF(B32=\"\",\"\",VLOOKUP(B32,Reference!A$28:E$71,IF(H32=\"Hourly\",2,IF(H32=\"Daily\",3,IF(H32=\"Weekly\",4,5))),FALSE))","v":""},0,0,null,null,null,{"$f":"IF(SUM(M15:M32)>0,1,0)","v":0},"Print check",0]
[]
["PART 5.C"]
["EQUIPMENT RENTAL/PURCHASE SUPPLEMENTARY SHEET"]
[]
["1.    List all charges for outside rentals, contractor-owned rental equipment, and purchased equipment."]
["2.    A completed Treatment System Tracking Form (Part 7) & Purchase Agreement Form (Part 8) must be provided for treatment units."]
["3.    Vehicle rental charges are not reimbursable."]
["4.    (No. of Units/Time Used At Site) X (Rental Rate) = (Total)"]
["5.    Equipment charges for work activities included in unit pricing should not be included on this form."]
["6.    Rental rates for contractor-owned equipment are listed in Appendix B, Table 2 of the Guidance Document."]
["7.    Weekly rate goes into effect when equipment is used at a site for more than three days in a week (Monday – Sunday) .  Daily rates are based on an 8-hour day.  Equipment rental costs "]
["       for more or less than an 8-hour day must utilize the hourly rate."]
["8.    The ratings for the following equipment must be provided:  air compressor – cfm, backhoe – bucket size, dump truck – yard capacity, trackhoe – horsepower, vacuum truck - horsepower."]
[]
["Costing Category","Equipment","Description","RAC\nInvoice\nNo.","Outside\nInvoice\nNo.","Dates\nEquipment \nUsed","10% Markup Applies \n(Yes/No)","Units","Time Used ","Outside Vendor Rate ($)","RAC Owned Rate ($)","Markup Subtotal ($)","TOTAL",null,null,null,null,null,"Test"]
[null,null,null,null,null,null,null,null,null,null,{"$f":"IF(B48=\"\",\"\",VLOOKUP(B48,Reference!A$28:E$71,IF(H48=\"Hourly\",2,IF(H48=\"Daily\",3,IF(H48=\"Weekly\",4,5))),FALSE))","v":""},{"$f":"IF(G48=\"Yes\",ROUND(IF(J48=\"\",I48*K48,J48*I48)*0.1,2),0)","v":0},{"$f":"IF(A48=\"\",0,IF(B48=\"\",\"\",IF(J48=\"\",I48*K48,J48*I48)+L48))","v":0},null,null,null,null,null,{"$f":"IF(B48<>\"\",IF(OR(A48=\"\",C48=\"\",F48=\"\",H48=\"\",I48=\"\",CONCATENATE(D48,E48)=\"\"),1,0),0)","v":0}]
[null,null,null,null,null,null,null,null,null,null,{"$f":"IF(B49=\"\",\"\",VLOOKUP(B49,Reference!A$28:E$71,IF(H49=\"Hourly\",2,IF(H49=\"Daily\",3,IF(H49=\"Weekly\",4,5))),FALSE))","v":""},{"$f":"IF(G49=\"Yes\",ROUND(IF(J49=\"\",I49*K49,J49*I49)*0.1,2),0)","v":0},{"$f":"IF(A49=\"\",0,IF(B49=\"\",\"\",IF(J49=\"\",I49*K49,J49*I49)+L49))","v":0},null,null,null,null,null,{"$f":"IF(B49<>\"\",IF(OR(A49=\"\",C49=\"\",F49=\"\",H49=\"\",I49=\"\",CONCATENATE(D49,E49)=\"\"),1,0),0)","v":0}]
[null,null,null,null,null,null,null,null,null,null,{"$f":"IF(B50=\"\",\"\",VLOOKUP(B50,Reference!A$28:E$71,IF(H50=\"Hourly\",2,IF(H50=\"Daily\",3,IF(H50=\"Weekly\",4,5))),FALSE))","v":""},0,0,null,null,null,null,null,0]
[null,null,null,null,null,null,null,null,null,null,{"$f":"IF(B51=\"\",\"\",VLOOKUP(B51,Reference!A$28:E$71,IF(H51=\"Hourly\",2,IF(H51=\"Daily\",3,IF(H51=\"Weekly\",4,5))),FALSE))","v":""},0,0,null,null,null,null,null,0]
[null,null,null,null,null,null,null,null,null,null,{"$f":"IF(B52=\"\",\"\",VLOOKUP(B52,Reference!A$28:E$71,IF(H52=\"Hourly\",2,IF(H52=\"Daily\",3,IF(H52=\"Weekly\",4,5))),FALSE))","v":""},0,0,null,null,null,null,null,0]
[null,null,null,null,null,null,null,null,null,null,{"$f":"IF(B53=\"\",\"\",VLOOKUP(B53,Reference!A$28:E$71,IF(H53=\"Hourly\",2,IF(H53=\"Daily\",3,IF(H53=\"Weekly\",4,5))),FALSE))","v":""},0,0,null,null,null,null,null,0]
[null,null,null,null,null,null,null,null,null,null,{"$f":"IF(B54=\"\",\"\",VLOOKUP(B54,Reference!A$28:E$71,IF(H54=\"Hourly\",2,IF(H54=\"Daily\",3,IF(H54=\"Weekly\",4,5))),FALSE))","v":""},0,0,null,null,null,null,null,0]
[null,null,null,null,null,null,null,null,null,null,{"$f":"IF(B55=\"\",\"\",VLOOKUP(B55,Reference!A$28:E$71,IF(H55=\"Hourly\",2,IF(H55=\"Daily\",3,IF(H55=\"Weekly\",4,5))),FALSE))","v":""},0,0,null,null,null,null,null,0]
[null,null,null,null,null,null,null,null,null,null,{"$f":"IF(B56=\"\",\"\",VLOOKUP(B56,Reference!A$28:E$71,IF(H56=\"Hourly\",2,IF(H56=\"Daily\",3,IF(H56=\"Weekly\",4,5))),FALSE))","v":""},0,0,null,null,null,null,null,0]
[null,null,null,null,null,null,null,null,null,null,{"$f":"IF(B57=\"\",\"\",VLOOKUP(B57,Reference!A$28:E$71,IF(H57=\"Hourly\",2,IF(H57=\"Daily\",3,IF(H57=\"Weekly\",4,5))),FALSE))","v":""},0,0,null,null,null,null,null,0]
[null,null,null,null,null,null,null,null,null,null,{"$f":"IF(B58=\"\",\"\",VLOOKUP(B58,Reference!A$28:E$71,IF(H58=\"Hourly\",2,IF(H58=\"Daily\",3,IF(H58=\"Weekly\",4,5))),FALSE))","v":""},0,0,null,null,null,null,null,0]
[null,null,null,null,null,null,null,null,null,null,{"$f":"IF(B59=\"\",\"\",VLOOKUP(B59,Reference!A$28:E$71,IF(H59=\"Hourly\",2,IF(H59=\"Daily\",3,IF(H59=\"Weekly\",4,5))),FALSE))","v":""},0,0,null,null,null,null,null,0]
[null,null,null,null,null,null,null,null,null,null,{"$f":"IF(B60=\"\",\"\",VLOOKUP(B60,Reference!A$28:E$71,IF(H60=\"Hourly\",2,IF(H60=\"Daily\",3,IF(H60=\"Weekly\",4,5))),FALSE))","v":""},0,0,null,null,null,null,null,0]
[null,null,null,null,null,null,null,null,null,null,{"$f":"IF(B61=\"\",\"\",VLOOKUP(B61,Reference!A$28:E$71,IF(H61=\"Hourly\",2,IF(H61=\"Daily\",3,IF(H61=\"Weekly\",4,5))),FALSE))","v":""},0,0,null,null,null,null,null,0]
[null,null,null,null,null,null,null,null,null,null,{"$f":"IF(B62=\"\",\"\",VLOOKUP(B62,Reference!A$28:E$71,IF(H62=\"Hourly\",2,IF(H62=\"Daily\",3,IF(H62=\"Weekly\",4,5))),FALSE))","v":""},0,0,null,null,null,null,null,0]
[null,null,null,null,null,null,null,null,null,null,{"$f":"IF(B63=\"\",\"\",VLOOKUP(B63,Reference!A$28:E$71,IF(H63=\"Hourly\",2,IF(H63=\"Daily\",3,IF(H63=\"Weekly\",4,5))),FALSE))","v":""},0,0,null,null,null,null,null,0]
[null,null,null,null,null,null,null,null,null,null,{"$f":"IF(B64=\"\",\"\",VLOOKUP(B64,Reference!A$28:E$71,IF(H64=\"Hourly\",2,IF(H64=\"Daily\",3,IF(H64=\"Weekly\",4,5))),FALSE))","v":""},0,0,null,null,null,null,null,0]
[null,null,null,null,null,null,null,null,null,null,{"$f":"IF(B65=\"\",\"\",VLOOKUP(B65,Reference!A$28:E$71,IF(H65=\"Hourly\",2,IF(H65=\"Daily\",3,IF(H65=\"Weekly\",4,5))),FALSE))","v":""},0,0,null,null,null,{"$f":"IF(SUM(M48:M65)>0,1,0)","v":0},"Print check",0]

{"sheet":"Hotel & Food","index":10,"n_rows":97,"n_cols":16,"rows_kept":97,"cut":false,"hidden":false,"merged":[[18,3,20,3],[42,0,44,0],[21,0,23,0],[42,2,44,2],[42,3,44,3],[42,4,44,4],[39,6,41,6],[60,0,60,3],[27,3,29,3],[27,4,29,4],[39,2,41,2],[39,3,41,3],[24,2,26,2],[24,3,26,3],[27,2,29,2],[33,6,35,6],[36,6,38,6],[36,2,38,2],[36,3,38,3],[36,4,38,4],[30,2,32,2],[30,3,32,3],[30,4,32,4],[18,4,20,4],[73,6,75,6],[73,7,75,7],[73,8,75,8],[18,6,20,6],[45,9,47,9],[36,7,38,7],[36,8,38,8],[36,9,38,9],[42,9,44,9],[21,7,23,7],[27,9,29,9],[39,7,41,7],[39,8,41,8],[39,9,41,9],[42,7,44,7],[45,8,47,8],[45,7,47,7],[33,7,35,7],[33,8,35,8],[33,9,35,9],[24,7,26,7],[24,8,26,8],[64,0,64,3],[58,0,58,3],[59,0,59,3],[45,0,47,0],[45,2,47,2],[45,3,47,3],[56,0,56,1],[33,5,35,5],[36,5,38,5],[33,0,35,0],[36,0,38,0],[33,2,35,2],[33,3,35,3],[33,4,35,4],[39,4,41,4],[61,0,61,3],[62,0,62,3],[63,0,63,3],[21,4,23,4],[21,6,23,6],[24,4,26,4],[24,6,26,6],[21,8,23,8],[42,8,44,8],[42,5,44,5],[45,4,47,4],[45,6,47,6],[42,6,44,6],[45,5,47,5],[39,5,41,5],[27,6,29,6],[73,0,75,0],[73,2,75,2],[70,7,72,7],[70,8,72,8],[70,9,72,9],[67,0,69,0],[67,2,69,2],[73,3,75,3],[73,4,75,4],[73,5,75,5],[70,0,72,0],[70,2,72,2],[70,3,72,3],[70,4,72,4],[70,5,72,5],[67,6,69,6],[67,7,69,7],[67,8,69,8],[67,9,69,9],[70,6,72,6],[67,3,69,3],[67,4,69,4],[67,5,69,5],[73,9,75,9],[82,4,84,4],[82,5,84,5],[76,0,78,0],[76,2,78,2],[76,3,78,3],[76,4,78,4],[76,5,78,5],[76,6,78,6],[82,6,84,6],[79,6,81,6],[82,7,84,7],[82,8,84,8],[82,9,84,9],[82,0,84,0],[82,2,84,2],[88,0,90,0],[88,2,90,2],[88,3,90,3],[88,4,90,4],[88,5,90,5],[88,6,90,6],[88,7,90,7],[88,8,90,8],[88,9,90,9],[85,0,87,0],[85,2,87,2],[85,3,87,3],[85,4,87,4],[85,5,87,5],[85,6,87,6],[85,7,87,7],[85,8,87,8],[85,9,87,9],[82,3,84,3],[94,0,96,0],[94,2,96,2],[94,3,96,3],[94,4,96,4],[94,5,96,5],[94,6,96,6],[94,7,96,7],[94,8,96,8],[94,9,96,9],[91,6,93,6],[91,7,93,7],[91,8,93,8],[91,9,93,9],[91,0,93,0],[91,2,93,2],[91,3,93,3],[91,4,93,4],[91,5,93,5],[36,15,38,15],[39,15,41,15],[42,15,44,15],[45,15,47,15],[18,15,20,15],[21,15,23,15],[24,15,26,15],[27,15,29,15],[33,15,35,15],[30,15,32,15],[85,15,87,15],[88,15,90,15],[91,15,93,15],[94,15,96,15],[67,15,69,15],[70,15,72,15],[73,15,75,15],[76,15,78,15],[82,15,84,15],[79,15,81,15],[79,7,81,7],[79,8,81,8],[79,9,81,9],[79,0,81,0],[79,2,81,2],[79,3,81,3],[79,4,81,4],[79,5,81,5],[76,7,78,7],[76,8,78,8],[76,9,78,9],[4,5,4,8],[5,5,5,8],[6,5,6,8],[7,5,7,8],[2,5,2,9],[3,5,3,8],[30,5,32,5],[30,6,32,6],[30,7,32,7],[30,8,32,8],[30,9,32,9],[18,5,20,5],[21,5,23,5],[24,5,26,5],[27,5,29,5],[18,9,20,9],[24,9,26,9],[27,7,29,7],[27,8,29,8],[11,5,11,6],[18,7,20,7],[18,8,20,8],[21,9,23,9],[3,0,3,1],[4,0,4,1],[5,0,5,1],[6,0,6,1],[7,0,7,1],[52,0,52,1],[53,0,53,1],[54,0,54,1],[55,0,55,1],[24,0,26,0],[27,0,29,0],[39,0,41,0],[30,0,32,0],[9,0,9,3],[10,0,10,3],[11,0,11,3],[12,0,12,3],[13,0,13,3],[14,0,14,3],[15,0,15,3],[21,2,23,2],[21,3,23,3],[18,0,20,0],[18,2,20,2]]}
["PART 5.D (1)",null,null,null,null,null,null,null,null,null,null,null,null,{"$f":"+N48+N97","v":0},"Total Print check"]
["TRAVEL SUPPLEMENTARY SHEET - LODGING/MEALS"]
[null,null,null,null,null,"Costing Category Summary"]
["RATES DESCRIPTION",null,"MAXIMUM RATES",null,null,"Emergency/Initial",null,null,null,{"$f":"SUMIF(A$19:A$48,F4,J$19:J$48)+SUMIF(A$68:A$90,F4,J$68:J$90)","v":0}]
["Meals - Statewide",null,"$50/day ",null,null,"Investigation",null,null,null,{"$f":"SUMIF(A$19:A$48,F5,J$19:J$48)+SUMIF(A$68:A$90,F5,J$68:J$90)","v":0}]
["Meals - Gretna/Kenner/Metairie/New Orleans",null,"$55/day",null,null,"Interim Monitoring",null,null,null,{"$f":"SUMIF(A$19:A$48,F6,J$19:J$48)+SUMIF(A$68:A$90,F6,J$68:J$90)","v":0}]
["Hotel - Statewide",null,"$110/night (plus tax)",null,null,"Corrective Action Plan",null,null,null,{"$f":"SUMIF(A$19:A$48,F7,J$19:J$48)+SUMIF(A$68:A$90,F7,J$68:J$90)","v":0}]
["Hotel - Gretna/Kenner/Metairie/New Orleans",null,"$165/night (plus tax)",null,null,"Report Preparation",null,null,null,{"$f":"SUMIF(A$19:A$48,F8,J$19:J$48)+SUMIF(A$68:A$90,F8,J$68:J$90)","v":0}]
[]
["1.   Overnight charges (hotel or meals) are allowed for any activities when it is more cost effective than commuting."]
["2.   Meals are only reimbursable when overnight stay is required."]
["3.   Hotel charges must be accompanied by itemized bill/invoices with the guest name(s) printed by the hotel.",null,null,null,null,{"$f":"IF(SUM(P19:P90)>0,\"MISSING INFORMATION\",\"\")","v":""}]
["4.   No RAC markup allowed."]
["5.   Single site visits:  (Hotel Charges) + (Meal Charges) = Total"]
["6.   Multiple site visits:  [(Hotel Charges) + (Meal Charges)] ÷ (No. Of Sites Visited) = Total"]
["7.   Airfares, toll charges, and taxi charges are not reimbursable."]
[]
["Costing Category","Reason for Overnight Stay or Meals  \n(Select all options that apply)","Last Name of Person(s)","RAC\nInvoice\nNo.","Trip \nStart Date","Trip Return Date","Hotel\nCharges","Meal\nCharges","No. of\nSites\nVisited","TOTAL",null,null,null,null,null,"Test"]
[null,null,null,null,null,null,null,null,null,{"$f":"ROUND(IF(I19=0,SUM(G19+H19),((G19+H19)/I19)),2)","v":0},null,null,null,null,null,{"$f":"IF((G19+H19)>0,IF(OR(CONCATENATE(B19,B20,B21)=\"\",E19=\"\",D19=\"\",C19=\"\",F19=\"\",A19=\"\"),1,0),0)","v":0}]
[]
[]
[null,null,null,null,null,null,null,null,null,{"$f":"ROUND(IF(I22=0,SUM(G22+H22),((G22+H22)/I22)),2)","v":0},null,null,null,null,null,{"$f":"IF((G22+H22)>0,IF(OR(CONCATENATE(B22,B23,B24)=\"\",E22=\"\",D22=\"\",C22=\"\",F22=\"\",A22=\"\"),1,0),0)","v":0}]
[]
[]
[null,null,null,null,null,null,null,null,null,{"$f":"ROUND(IF(I25=0,SUM(G25+H25),((G25+H25)/I25)),2)","v":0},null,null,null,null,null,{"$f":"IF((G25+H25)>0,IF(OR(CONCATENATE(B25,B26,B27)=\"\",E25=\"\",D25=\"\",C25=\"\",F25=\"\",A25=\"\"),1,0),0)","v":0}]
[]
[]
[null,null,null,null,null,null,null,null,null,{"$f":"ROUND(IF(I28=0,SUM(G28+H28),((G28+H28)/I28)),2)","v":0},null,null,null,null,null,{"$f":"IF((G28+H28)>0,IF(OR(CONCATENATE(B28,B29,B30)=\"\",E28=\"\",D28=\"\",C28=\"\",F28=\"\",A28=\"\"),1,0),0)","v":0}]
[]
[]
[null,null,null,null,null,null,null,null,null,{"$f":"ROUND(IF(I31=0,SUM(G31+H31),((G31+H31)/I31)),2)","v":0},null,null,null,null,null,{"$f":"IF((G31+H31)>0,IF(OR(CONCATENATE(B31,B32,B33)=\"\",E31=\"\",D31=\"\",C31=\"\",F31=\"\",A31=\"\"),1,0),0)","v":0}]
[]
[]
[null,null,null,null,null,null,null,null,null,{"$f":"ROUND(IF(I34=0,SUM(G34+H34),((G34+H34)/I34)),2)","v":0},null,null,null,null,null,{"$f":"IF((G34+H34)>0,IF(OR(CONCATENATE(B34,B35,B36)=\"\",E34=\"\",D34=\"\",C34=\"\",F34=\"\",A34=\"\"),1,0),0)","v":0}]
[]
[]
[null,null,null,null,null,null,null,null,null,{"$f":"ROUND(IF(I37=0,SUM(G37+H37),((G37+H37)/I37)),2)","v":0},null,null,null,null,null,{"$f":"IF((G37+H37)>0,IF(OR(CONCATENATE(B37,B38,B39)=\"\",E37=\"\",D37=\"\",C37=\"\",F37=\"\",A37=\"\"),1,0),0)","v":0}]
[]
[]
[null,null,null,null,null,null,null,null,null,{"$f":"ROUND(IF(I40=0,SUM(G40+H40),((G40+H40)/I40)),2)","v":0},null,null,null,null,null,{"$f":"IF((G40+H40)>0,IF(OR(CONCATENATE(B40,B41,B42)=\"\",E40=\"\",D40=\"\",C40=\"\",F40=\"\",A40=\"\"),1,0),0)","v":0}]
[]
[]
[null,null,null,null,null,null,null,null,null,{"$f":"ROUND(IF(I43=0,SUM(G43+H43),((G43+H43)/I43)),2)","v":0},null,null,null,null,null,{"$f":"IF((G43+H43)>0,IF(OR(CONCATENATE(B43,B44,B45)=\"\",E43=\"\",D43=\"\",C43=\"\",F43=\"\",A43=\"\"),1,0),0)","v":0}]
[]
[]
[null,null,null,null,null,null,null,null,null,{"$f":"ROUND(IF(I46=0,SUM(G46+H46),((G46+H46)/I46)),2)","v":0},null,null,null,null,null,{"$f":"IF((G46+H46)>0,IF(OR(CONCATENATE(B46,B47,B48)=\"\",E46=\"\",D46=\"\",C46=\"\",F46=\"\",A46=\"\"),1,0),0)","v":0}]
[]
[null,null,null,null,null,null,null,null,null,null,null,null,null,{"$f":"IF(SUM(J19:J48)>0,1,0)","v":0},"Print check"]
[]
["PART 5.D (1)"]
["TRAVEL SUPPLEMENTARY SHEET - LODGING/MEALS"]
[]
["RATES DESCRIPTION",null,"MAXIMUM RATES"]
["Meals - Statewide",null,"$50/day "]
["Meals - Gretna/Kenner/Metairie/New Orleans",null,"$55/day"]
["Hotel - Statewide",null,"$110/night (plus tax)"]
["Hotel - Gretna/Kenner/Metairie/New Orleans",null,"$165/night (plus tax)"]
[]
["1.   Overnight charges (hotel or meals) are allowed for any activities when it is more cost effective than commuting."]
["2.   Meals are only reimbursable when overnight stay is required."]
["3.   Hotel charges must be accompanied by itemized bill/invoices with the guest name(s) printed by the hotel."]
["4.   No RAC markup allowed."]
["5.   Single site visits:  (Hotel Charges) + (Meal Charges) = Total"]
["6.   Multiple site visits:  [(Hotel Charges) + (Meal Charges)] ÷ (No. Of Sites Visited) = Total"]
["7.   Airfares, toll charges, and taxi charges are not reimbursable."]
[]
["Costing Category","Reason for Overnight Stay or Meals  \n(Select all options that apply)","Last Name of Person(s)","RAC\nInvoice\nNo.","Trip \nStart Date","Trip Return Date","Hotel\nCharges","Meal\nCharges","No. of\nSites\nVisited","TOTAL",null,null,null,null,null,"Test"]
[null,null,null,null,null,null,null,null,null,{"$f":"ROUND(IF(I68=0,SUM(G68+H68),((G68+H68)/I68)),2)","v":0},null,null,null,null,null,{"$f":"IF((G68+H68)>0,IF(OR(CONCATENATE(B68,B69,B70)=\"\",E68=\"\",D68=\"\",C68=\"\",F68=\"\",A68=\"\"),1,0),0)","v":0}]
[]
[]
[null,null,null,null,null,null,null,null,null,{"$f":"ROUND(IF(I71=0,SUM(G71+H71),((G71+H71)/I71)),2)","v":0},null,null,null,null,null,{"$f":"IF((G71+H71)>0,IF(OR(CONCATENATE(B71,B72,B73)=\"\",E71=\"\",D71=\"\",C71=\"\",F71=\"\",A71=\"\"),1,0),0)","v":0}]
[]
[]
[null,null,null,null,null,null,null,null,null,{"$f":"ROUND(IF(I74=0,SUM(G74+H74),((G74+H74)/I74)),2)","v":0},null,null,null,null,null,{"$f":"IF((G74+H74)>0,IF(OR(CONCATENATE(B74,B75,B76)=\"\",E74=\"\",D74=\"\",C74=\"\",F74=\"\",A74=\"\"),1,0),0)","v":0}]
[]
[]
[null,null,null,null,null,null,null,null,null,{"$f":"ROUND(IF(I77=0,SUM(G77+H77),((G77+H77)/I77)),2)","v":0},null,null,null,null,null,{"$f":"IF((G77+H77)>0,IF(OR(CONCATENATE(B77,B78,B79)=\"\",E77=\"\",D77=\"\",C77=\"\",F77=\"\",A77=\"\"),1,0),0)","v":0}]
[]
[]
[null,null,null,null,null,null,null,null,null,{"$f":"ROUND(IF(I80=0,SUM(G80+H80),((G80+H80)/I80)),2)","v":0},null,null,null,null,null,{"$f":"IF((G80+H80)>0,IF(OR(CONCATENATE(B80,B81,B82)=\"\",E80=\"\",D80=\"\",C80=\"\",F80=\"\",A80=\"\"),1,0),0)","v":0}]
[]
[]
[null,null,null,null,null,null,null,null,null,{"$f":"ROUND(IF(I83=0,SUM(G83+H83),((G83+H83)/I83)),2)","v":0},null,null,null,null,null,{"$f":"IF((G83+H83)>0,IF(OR(CONCATENATE(B83,B84,B85)=\"\",E83=\"\",D83=\"\",C83=\"\",F83=\"\",A83=\"\"),1,0),0)","v":0}]
[]
[]
[null,null,null,null,null,null,null,null,null,{"$f":"ROUND(IF(I86=0,SUM(G86+H86),((G86+H86)/I86)),2)","v":0},null,null,null,null,null,{"$f":"IF((G86+H86)>0,IF(OR(CONCATENATE(B86,B87,B88)=\"\",E86=\"\",D86=\"\",C86=\"\",F86=\"\",A86=\"\"),1,0),0)","v":0}]
[]
[]
[null,null,null,null,null,null,null,null,null,{"$f":"ROUND(IF(I89=0,SUM(G89+H89),((G89+H89)/I89)),2)","v":0},null,null,null,null,null,{"$f":"IF((G89+H89)>0,IF(OR(CONCATENATE(B89,B90,B91)=\"\",E89=\"\",D89=\"\",C89=\"\",F89=\"\",A89=\"\"),1,0),0)","v":0}]
[]
[]
[null,null,null,null,null,null,null,null,null,{"$f":"ROUND(IF(I92=0,SUM(G92+H92),((G92+H92)/I92)),2)","v":0},null,null,null,null,null,{"$f":"IF((G92+H92)>0,IF(OR(CONCATENATE(B92,B93,B94)=\"\",E92=\"\",D92=\"\",C92=\"\",F92=\"\",A92=\"\"),1,0),0)","v":0}]
[]
[]
[null,null,null,null,null,null,null,null,null,{"$f":"ROUND(IF(I95=0,SUM(G95+H95),((G95+H95)/I95)),2)","v":0},null,null,null,null,null,{"$f":"IF((G95+H95)>0,IF(OR(CONCATENATE(B95,B96,B97)=\"\",E95=\"\",D95=\"\",C95=\"\",F95=\"\",A95=\"\"),1,0),0)","v":0}]
[]
[null,null,null,null,null,null,null,null,null,null,null,null,null,{"$f":"IF(SUM(J68:J97)>0,1,0)","v":0},"Print check"]

{"sheet":"Travel","index":11,"n_rows":148,"n_cols":16,"rows_kept":148,"cut":false,"hidden":false,"merged":[[55,0,55,7],[4,0,4,3],[5,0,5,3],[6,0,6,3],[56,0,56,3],[57,0,57,3],[105,0,105,3],[93,0,95,0],[93,2,95,2],[93,3,95,3],[90,0,92,0],[90,2,92,2],[90,3,92,3],[87,2,89,2],[87,3,89,3],[84,0,86,0],[84,2,86,2],[84,3,86,3],[78,0,80,0],[78,2,80,2],[78,3,80,3],[47,0,49,0],[90,4,92,4],[90,5,92,5],[96,15,98,15],[93,6,95,6],[93,7,95,7],[93,8,95,8],[93,9,95,9],[96,0,98,0],[96,2,98,2],[96,3,98,3],[96,4,98,4],[96,5,98,5],[96,6,98,6],[96,7,98,7],[96,8,98,8],[96,9,98,9],[93,4,95,4],[93,5,95,5],[93,15,95,15],[90,6,92,6],[90,7,92,7],[90,8,92,8],[90,9,92,9],[87,15,89,15],[90,15,92,15],[87,6,89,6],[87,7,89,7],[87,8,89,8],[87,9,89,9],[81,15,83,15],[78,6,80,6],[78,7,80,7],[84,7,86,7],[84,8,86,8],[84,9,86,9],[84,15,86,15],[78,8,80,8],[78,9,80,9],[81,7,83,7],[81,8,83,8],[81,9,83,9],[78,15,80,15],[87,0,89,0],[81,0,83,0],[81,2,83,2],[81,3,83,3],[81,4,83,4],[81,5,83,5],[81,6,83,6],[78,4,80,4],[78,5,80,5],[87,4,89,4],[87,5,89,5],[84,4,86,4],[84,5,86,5],[72,15,74,15],[75,0,77,0],[75,2,77,2],[75,3,77,3],[75,4,77,4],[75,5,77,5],[75,6,77,6],[75,7,77,7],[75,8,77,8],[75,9,77,9],[75,15,77,15],[72,6,74,6],[72,7,74,7],[72,8,74,8],[72,9,74,9],[72,0,74,0],[47,2,49,2],[72,2,74,2],[72,3,74,3],[66,15,68,15],[69,0,71,0],[69,2,71,2],[69,3,71,3],[69,4,71,4],[69,5,71,5],[69,6,71,6],[69,7,71,7],[69,8,71,8],[69,9,71,9],[69,15,71,15],[66,6,68,6],[66,7,68,7],[66,8,68,8],[66,9,68,9],[66,0,68,0],[66,2,68,2],[66,3,68,3],[72,4,74,4],[47,9,49,9],[47,15,49,15],[44,0,46,0],[17,6,19,6],[26,15,28,15],[35,9,37,9],[63,0,65,0],[63,2,65,2],[63,3,65,3],[63,4,65,4],[63,5,65,5],[63,6,65,6],[63,7,65,7],[63,8,65,8],[63,9,65,9],[60,0,62,0],[60,15,62,15],[63,15,65,15],[60,6,62,6],[60,7,62,7],[60,8,62,8],[60,9,62,9],[60,2,62,2],[60,3,62,3],[60,4,62,4],[60,5,62,5],[20,15,22,15],[23,15,25,15],[20,6,22,6],[20,7,22,7],[20,8,22,8],[20,9,22,9],[44,15,46,15],[23,6,25,6],[23,7,25,7],[23,8,25,8],[23,9,25,9],[35,15,37,15],[35,6,37,6],[35,7,37,7],[35,8,37,8],[29,15,31,15],[32,15,34,15],[29,6,31,6],[29,7,31,7],[26,8,28,8],[38,15,40,15],[41,15,43,15],[38,6,40,6],[38,7,40,7],[41,2,43,2],[41,3,43,3],[41,4,43,4],[41,7,43,7],[41,8,43,8],[41,9,43,9],[44,6,46,6],[44,7,46,7],[44,8,46,8],[44,9,46,9],[44,3,46,3],[44,4,46,4],[44,5,46,5],[38,8,40,8],[38,9,40,9],[11,0,13,0],[11,2,13,2],[11,3,13,3],[11,4,13,4],[26,5,28,5],[26,6,28,6],[26,7,28,7],[20,0,22,0],[20,2,22,2],[20,3,22,3],[20,4,22,4],[20,5,22,5],[11,5,13,5],[17,7,19,7],[17,0,19,0],[17,2,19,2],[17,3,19,3],[17,4,19,4],[17,5,19,5],[23,0,25,0],[23,2,25,2],[23,3,25,3],[9,1,10,1],[9,2,10,2],[9,3,10,3],[9,4,10,4],[9,5,10,5],[9,6,9,7],[9,8,10,8],[17,8,19,8],[17,9,19,9],[58,15,59,15],[9,9,10,9],[58,5,59,5],[58,6,58,7],[58,8,59,8],[58,9,59,9],[11,15,13,15],[14,2,16,2],[14,3,16,3],[14,4,16,4],[14,5,16,5],[14,15,16,15],[26,2,28,2],[26,3,28,3],[9,15,10,15],[17,15,19,15],[32,2,34,2],[32,3,34,3],[32,4,34,4],[32,5,34,5],[32,6,34,6],[32,7,34,7],[32,8,34,8],[32,9,34,9],[9,0,10,0],[14,0,16,0],[14,6,16,6],[14,7,16,7],[11,6,13,6],[11,7,13,7],[38,0,40,0],[38,2,40,2],[38,3,40,3],[38,4,40,4],[38,5,40,5],[26,0,28,0],[26,4,28,4],[23,4,25,4],[23,5,25,5],[29,0,31,0],[29,2,31,2],[29,3,31,3],[29,4,31,4],[29,5,31,5],[35,0,37,0],[35,2,37,2],[35,3,37,3],[35,4,37,4],[26,9,28,9],[66,4,68,4],[66,5,68,5],[72,5,74,5],[84,6,86,6],[58,0,59,0],[58,1,59,1],[58,2,59,2],[58,3,59,3],[58,4,59,4],[41,0,43,0],[41,5,43,5],[41,6,43,6],[29,8,31,8],[29,9,31,9],[47,3,49,3],[47,4,49,4],[47,5,49,5],[47,6,49,6],[47,7,49,7],[47,8,49,8],[35,5,37,5],[32,0,34,0],[44,2,46,2],[1,6,1,9],[2,6,2,8],[3,6,3,8],[4,6,4,8],[5,6,5,8],[6,6,6,8],[14,8,16,8],[14,9,16,9],[11,8,13,8],[11,9,13,9],[107,15,108,15],[109,0,111,0],[109,2,111,2],[109,3,111,3],[109,4,111,4],[109,5,111,5],[109,6,111,6],[109,7,111,7],[109,8,111,8],[109,9,111,9],[109,15,111,15],[107,0,108,0],[107,1,108,1],[107,2,108,2],[107,3,108,3],[107,4,108,4],[107,5,108,5],[107,6,107,7],[107,8,108,8],[107,9,108,9],[112,15,114,15],[115,0,117,0],[115,2,117,2],[115,3,117,3],[115,4,117,4],[115,5,117,5],[115,6,117,6],[115,7,117,7],[115,8,117,8],[115,9,117,9],[115,15,117,15],[112,0,114,0],[112,2,114,2],[112,3,114,3],[112,4,114,4],[112,5,114,5],[112,6,114,6],[112,7,114,7],[112,8,114,8],[112,9,114,9],[121,15,123,15],[118,0,120,0],[118,2,120,2],[118,3,120,3],[118,4,120,4],[118,5,120,5],[118,6,120,6],[118,7,120,7],[124,15,126,15],[121,0,123,0],[121,2,123,2],[121,3,123,3],[121,4,123,4],[121,5,123,5],[121,6,123,6],[121,7,123,7],[121,8,123,8],[121,9,123,9],[118,8,120,8],[118,9,120,9],[118,15,120,15],[127,15,129,15],[124,0,126,0],[124,2,126,2],[124,3,126,3],[124,4,126,4],[124,5,126,5],[124,6,126,6],[124,7,126,7],[124,8,126,8],[124,9,126,9],[127,0,129,0],[127,2,129,2],[127,3,129,3],[127,4,129,4],[127,5,129,5],[127,6,129,6],[127,7,129,7],[127,8,129,8],[127,9,129,9],[130,15,132,15],[133,0,135,0],[133,2,135,2],[133,3,135,3],[133,4,135,4],[133,5,135,5],[133,6,135,6],[133,7,135,7],[133,8,135,8],[133,9,135,9],[133,15,135,15],[130,0,132,0],[130,2,132,2],[130,3,132,3],[130,4,132,4],[130,5,132,5],[130,6,132,6],[130,7,132,7],[130,8,132,8],[130,9,132,9],[136,15,138,15],[139,0,141,0],[139,2,141,2],[139,3,141,3],[139,4,141,4],[139,5,141,5],[139,6,141,6],[139,7,141,7],[139,8,141,8],[139,9,141,9],[139,15,141,15],[136,0,138,0],[136,2,138,2],[136,3,138,3],[136,4,138,4],[136,5,138,5],[136,6,138,6],[136,7,138,7],[136,8,138,8],[136,9,138,9],[145,15,147,15],[142,0,144,0],[142,2,144,2],[142,3,144,3],[142,4,144,4],[142,5,144,5],[142,6,144,6],[142,7,144,7],[145,0,147,0],[145,2,147,2],[145,3,147,3],[145,4,147,4],[145,5,147,5],[145,6,147,6],[145,7,147,7],[145,8,147,8],[145,9,147,9],[142,8,144,8],[142,9,144,9],[142,15,144,15]]}
["PART 5.D (2)",null,null,null,null,null,null,null,null,null,null,null,null,{"$f":"+N50+N99+N148","v":0},"Total Print check"]
["TRAVEL SUPPLEMENTARY SHEET - UNIT PRICE TRAVEL",null,null,null,null,null,"Costing Category Summary"]
["(The mileage unit price includes costs for fuel and personnel travel time.)",null,null,{"$f":"IF(SUM(P12:P87)>0,\"MISSING INFORMATION\",\"\")","v":""},null,null,"Emergency/Initial",null,null,{"$f":"SUMIF(A$12:A$50,G3,J$12:J$50)+SUMIF(A$61:A$99,G3,J$61:J$99)+SUMIF(A$110:A$148,G3,J$110:J$148)","v":0}]
[null,null,null,null,null,null,"Investigation",null,null,{"$f":"SUMIF(A$12:A$50,G4,J$12:J$50)+SUMIF(A$61:A$99,G4,J$61:J$99)+SUMIF(A$110:A$148,G4,J$110:J$148)","v":0}]
["1.   When multiple sites are visited in a single day, the total mileage must be divided by the number of sites visited. Total mileage ",null,null,null,null,null,"Interim Monitoring",null,null,0]
["       should be rounded UP to a whole number. ",null,null,null,null,null,"Corrective Action Plan",null,null,0]
["2.   Travel charges for work activities included in unit pricing should not be addressed on this form.",null,null,null,null,null,"Report Preparation",null,null,0]
[]
[]
["Costing Category","Activities Performed \n(Select all options that apply)","Date\nSort By Oldest to Newest","Destination\nInclude Beginning, Interim, \nand Ending Areas Traveled \n(Ex: BR, Rayne, Lafayette, BR)","RAC\nInvoice\nNo.","Total \nMileage","Complete these columns only when multiple site visits occurred",null,"RATE","TOTAL",null,null,null,null,null,"Test"]
[null,null,null,null,null,null,"No. of\nSites\nVisited","Adusted Mileage"]
[null,null,null,null,null,null,null,{"$f":"IF(G12=0,\"\",ROUND(F12/G12,2))","v":""},{"$f":"IF(A12=\"\",0,Reference!B$74)","v":0},{"$f":"ROUND(IF(G12=0,F12*I12,H12*I12),2)","v":0},null,null,null,null,null,{"$f":"IF(F12>0,IF(OR(A12=\"\",CONCATENATE(B12,B13,B14)=\"\",C12=\"\",D12=\"\",E12=\"\"),1,0),0)","v":0}]
[]
[]
[null,null,null,null,null,null,null,{"$f":"IF(G15=0,\"\",ROUND(F15/G15,2))","v":""},{"$f":"IF(A15=\"\",0,Reference!B$74)","v":0},{"$f":"ROUND(IF(G15=0,F15*I15,H15*I15),2)","v":0},null,null,null,null,null,{"$f":"IF(F15>0,IF(OR(A15=\"\",CONCATENATE(B15,B16,B17)=\"\",C15=\"\",D15=\"\",E15=\"\"),1,0),0)","v":0}]
[]
[]
[null,null,null,null,null,null,null,{"$f":"IF(G18=0,\"\",ROUND(F18/G18,2))","v":""},{"$f":"IF(A18=\"\",0,Reference!B$74)","v":0},{"$f":"ROUND(IF(G18=0,F18*I18,H18*I18),2)","v":0},null,null,null,null,null,{"$f":"IF(F18>0,IF(OR(A18=\"\",CONCATENATE(B18,B19,B20)=\"\",C18=\"\",D18=\"\",E18=\"\"),1,0),0)","v":0}]
[]
[]
[null,null,null,null,null,null,null,{"$f":"IF(G21=0,\"\",ROUND(F21/G21,2))","v":""},{"$f":"IF(A21=\"\",0,Reference!B$74)","v":0},{"$f":"ROUND(IF(G21=0,F21*I21,H21*I21),2)","v":0},null,null,null,null,null,{"$f":"IF(F21>0,IF(OR(A21=\"\",CONCATENATE(B21,B22,B23)=\"\",C21=\"\",D21=\"\",E21=\"\"),1,0),0)","v":0}]
[]
[]
[null,null,null,null,null,null,null,{"$f":"IF(G24=0,\"\",ROUND(F24/G24,2))","v":""},{"$f":"IF(A24=\"\",0,Reference!B$74)","v":0},{"$f":"ROUND(IF(G24=0,F24*I24,H24*I24),2)","v":0},null,null,null,null,null,{"$f":"IF(F24>0,IF(OR(A24=\"\",CONCATENATE(B24,B25,B26)=\"\",C24=\"\",D24=\"\",E24=\"\"),1,0),0)","v":0}]
[]
[]
[null,null,null,null,null,null,null,{"$f":"IF(G27=0,\"\",ROUND(F27/G27,2))","v":""},{"$f":"IF(A27=\"\",0,Reference!B$74)","v":0},{"$f":"ROUND(IF(G27=0,F27*I27,H27*I27),2)","v":0},null,null,null,null,null,{"$f":"IF(F27>0,IF(OR(A27=\"\",CONCATENATE(B27,B28,B29)=\"\",C27=\"\",D27=\"\",E27=\"\"),1,0),0)","v":0}]
[]
[]
[null,null,null,null,null,null,null,{"$f":"IF(G30=0,\"\",ROUND(F30/G30,2))","v":""},{"$f":"IF(A30=\"\",0,Reference!B$74)","v":0},{"$f":"ROUND(IF(G30=0,F30*I30,H30*I30),2)","v":0},null,null,null,null,null,{"$f":"IF(F30>0,IF(OR(A30=\"\",CONCATENATE(B30,B31,B32)=\"\",C30=\"\",D30=\"\",E30=\"\"),1,0),0)","v":0}]
[]
[]
[null,null,null,null,null,null,null,{"$f":"IF(G33=0,\"\",ROUND(F33/G33,2))","v":""},{"$f":"IF(A33=\"\",0,Reference!B$74)","v":0},{"$f":"ROUND(IF(G33=0,F33*I33,H33*I33),2)","v":0},null,null,null,null,null,{"$f":"IF(F33>0,IF(OR(A33=\"\",CONCATENATE(B33,B34,B35)=\"\",C33=\"\",D33=\"\",E33=\"\"),1,0),0)","v":0}]
[]
[]
[null,null,null,null,null,null,null,{"$f":"IF(G36=0,\"\",ROUND(F36/G36,2))","v":""},{"$f":"IF(A36=\"\",0,Reference!B$74)","v":0},{"$f":"ROUND(IF(G36=0,F36*I36,H36*I36),2)","v":0},null,null,null,null,null,{"$f":"IF(F36>0,IF(OR(A36=\"\",CONCATENATE(B36,B37,B38)=\"\",C36=\"\",D36=\"\",E36=\"\"),1,0),0)","v":0}]
[]
[]
[null,null,null,null,null,null,null,{"$f":"IF(G39=0,\"\",ROUND(F39/G39,2))","v":""},{"$f":"IF(A39=\"\",0,Reference!B$74)","v":0},{"$f":"ROUND(IF(G39=0,F39*I39,H39*I39),2)","v":0},null,null,null,null,null,{"$f":"IF(F39>0,IF(OR(A39=\"\",CONCATENATE(B39,B40,B41)=\"\",C39=\"\",D39=\"\",E39=\"\"),1,0),0)","v":0}]
[]
[]
[null,null,null,null,null,null,null,{"$f":"IF(G42=0,\"\",ROUND(F42/G42,2))","v":""},{"$f":"IF(A42=\"\",0,Reference!B$74)","v":0},{"$f":"ROUND(IF(G42=0,F42*I42,H42*I42),2)","v":0},null,null,null,null,null,{"$f":"IF(F42>0,IF(OR(A42=\"\",CONCATENATE(B42,B43,B44)=\"\",C42=\"\",D42=\"\",E42=\"\"),1,0),0)","v":0}]
[]
[]
[null,null,null,null,null,null,null,{"$f":"IF(G45=0,\"\",ROUND(F45/G45,2))","v":""},{"$f":"IF(A45=\"\",0,Reference!B$74)","v":0},{"$f":"ROUND(IF(G45=0,F45*I45,H45*I45),2)","v":0},null,null,null,null,null,{"$f":"IF(F45>0,IF(OR(A45=\"\",CONCATENATE(B45,B46,B47)=\"\",C45=\"\",D45=\"\",E45=\"\"),1,0),0)","v":0}]
[]
[]
[null,null,null,null,null,null,null,{"$f":"IF(G48=0,\"\",ROUND(F48/G48,2))","v":""},{"$f":"IF(A48=\"\",0,Reference!B$74)","v":0},{"$f":"ROUND(IF(G48=0,F48*I48,H48*I48),2)","v":0},null,null,null,null,null,{"$f":"IF(F48>0,IF(OR(A48=\"\",CONCATENATE(B48,B49,B50)=\"\",C48=\"\",D48=\"\",E48=\"\"),1,0),0)","v":0}]
[]
[null,null,null,null,null,null,null,null,null,null,null,null,null,{"$f":"IF(SUM(J12:J50)>0,1,0)","v":0},"Print check"]
[]
["PART 5.D (2)"]
["TRAVEL SUPPLEMENTARY SHEET - UNIT PRICE TRAVEL"]
["(The unit price addresses costs associated with vehicle mileage and employees’ travel time)"]
[]
["1.   When multiple sites are visited in a single day, the total mileage must be divided by the number of sites visited. Total mileage should be rounded UP to a whole number. "]
["2.   Travel charges for work activities included in unit pricing should not be addressed on this form."]
[]
["Costing Category","Activities Performed \n(Select all options that apply)","Date\nSort By Oldest to Newest","Destination\nInclude Beginning, Interim, \nand Ending Areas Traveled\n(Ex: BR, Rayne, Lafayette, BR)","RAC\nInvoice\nNo.","Total \nMileage","Complete these columns only when multiple site visits occurred",null,"RATE","TOTAL",null,null,null,null,null,"Test"]
[null,null,null,null,null,null,"No. of\nSites\nVisited","Adusted Mileage"]
[null,null,null,null,null,null,null,{"$f":"IF(G61=0,\"\",ROUND(F61/G61,2))","v":""},{"$f":"IF(A61=\"\",0,Reference!B$74)","v":0},{"$f":"ROUND(IF(G61=0,F61*I61,H61*I61),2)","v":0},null,null,null,null,null,{"$f":"IF(F61>0,IF(OR(A61=\"\",CONCATENATE(B61,B62,B63)=\"\",C61=\"\",D61=\"\",E61=\"\"),1,0),0)","v":0}]
[]
[]
[null,null,null,null,null,null,null,{"$f":"IF(G64=0,\"\",ROUND(F64/G64,2))","v":""},{"$f":"IF(A64=\"\",0,Reference!B$74)","v":0},{"$f":"ROUND(IF(G64=0,F64*I64,H64*I64),2)","v":0},null,null,null,null,null,{"$f":"IF(F64>0,IF(OR(A64=\"\",CONCATENATE(B64,B65,B66)=\"\",C64=\"\",D64=\"\",E64=\"\"),1,0),0)","v":0}]
[]
[]
[null,null,null,null,null,null,null,{"$f":"IF(G67=0,\"\",ROUND(F67/G67,2))","v":""},{"$f":"IF(A67=\"\",0,Reference!B$74)","v":0},{"$f":"ROUND(IF(G67=0,F67*I67,H67*I67),2)","v":0},null,null,null,null,null,{"$f":"IF(F67>0,IF(OR(A67=\"\",CONCATENATE(B67,B68,B69)=\"\",C67=\"\",D67=\"\",E67=\"\"),1,0),0)","v":0}]
[]
[]
[null,null,null,null,null,null,null,{"$f":"IF(G70=0,\"\",ROUND(F70/G70,2))","v":""},{"$f":"IF(A70=\"\",0,Reference!B$74)","v":0},{"$f":"ROUND(IF(G70=0,F70*I70,H70*I70),2)","v":0},null,null,null,null,null,{"$f":"IF(F70>0,IF(OR(A70=\"\",CONCATENATE(B70,B71,B72)=\"\",C70=\"\",D70=\"\",E70=\"\"),1,0),0)","v":0}]
[]
[]
[null,null,null,null,null,null,null,{"$f":"IF(G73=0,\"\",ROUND(F73/G73,2))","v":""},{"$f":"IF(A73=\"\",0,Reference!B$74)","v":0},{"$f":"ROUND(IF(G73=0,F73*I73,H73*I73),2)","v":0},null,null,null,null,null,{"$f":"IF(F73>0,IF(OR(A73=\"\",CONCATENATE(B73,B74,B75)=\"\",C73=\"\",D73=\"\",E73=\"\"),1,0),0)","v":0}]
[]
[]
[null,null,null,null,null,null,null,{"$f":"IF(G76=0,\"\",ROUND(F76/G76,2))","v":""},{"$f":"IF(A76=\"\",0,Reference!B$74)","v":0},{"$f":"ROUND(IF(G76=0,F76*I76,H76*I76),2)","v":0},null,null,null,null,null,{"$f":"IF(F76>0,IF(OR(A76=\"\",CONCATENATE(B76,B77,B78)=\"\",C76=\"\",D76=\"\",E76=\"\"),1,0),0)","v":0}]
[]
[]
[null,null,null,null,null,null,null,{"$f":"IF(G79=0,\"\",ROUND(F79/G79,2))","v":""},{"$f":"IF(A79=\"\",0,Reference!B$74)","v":0},{"$f":"ROUND(IF(G79=0,F79*I79,H79*I79),2)","v":0},null,null,null,null,null,{"$f":"IF(F79>0,IF(OR(A79=\"\",CONCATENATE(B79,B80,B81)=\"\",C79=\"\",D79=\"\",E79=\"\"),1,0),0)","v":0}]
[]
[]
[null,null,null,null,null,null,null,{"$f":"IF(G82=0,\"\",ROUND(F82/G82,2))","v":""},{"$f":"IF(A82=\"\",0,Reference!B$74)","v":0},{"$f":"ROUND(IF(G82=0,F82*I82,H82*I82),2)","v":0},null,null,null,null,null,{"$f":"IF(F82>0,IF(OR(A82=\"\",CONCATENATE(B82,B83,B84)=\"\",C82=\"\",D82=\"\",E82=\"\"),1,0),0)","v":0}]
[]
[]
[null,null,null,null,null,null,null,{"$f":"IF(G85=0,\"\",ROUND(F85/G85,2))","v":""},{"$f":"IF(A85=\"\",0,Reference!B$74)","v":0},{"$f":"ROUND(IF(G85=0,F85*I85,H85*I85),2)","v":0},null,null,null,null,null,{"$f":"IF(F85>0,IF(OR(A85=\"\",CONCATENATE(B85,B86,B87)=\"\",C85=\"\",D85=\"\",E85=\"\"),1,0),0)","v":0}]
[]
[]
[null,null,null,null,null,null,null,{"$f":"IF(G88=0,\"\",ROUND(F88/G88,2))","v":""},{"$f":"IF(A88=\"\",0,Reference!B$74)","v":0},{"$f":"ROUND(IF(G88=0,F88*I88,H88*I88),2)","v":0},null,null,null,null,null,{"$f":"IF(F88>0,IF(OR(A88=\"\",CONCATENATE(B88,B89,B90)=\"\",C88=\"\",D88=\"\",E88=\"\"),1,0),0)","v":0}]
[]
[]
[null,null,null,null,null,null,null,{"$f":"IF(G91=0,\"\",ROUND(F91/G91,2))","v":""},{"$f":"IF(A91=\"\",0,Reference!B$74)","v":0},{"$f":"ROUND(IF(G91=0,F91*I91,H91*I91),2)","v":0},null,null,null,null,null,{"$f":"IF(F91>0,IF(OR(A91=\"\",CONCATENATE(B91,B92,B93)=\"\",C91=\"\",D91=\"\",E91=\"\"),1,0),0)","v":0}]
[]
[]
[null,null,null,null,null,null,null,{"$f":"IF(G94=0,\"\",ROUND(F94/G94,2))","v":""},{"$f":"IF(A94=\"\",0,Reference!B$74)","v":0},{"$f":"ROUND(IF(G94=0,F94*I94,H94*I94),2)","v":0},null,null,null,null,null,{"$f":"IF(F94>0,IF(OR(A94=\"\",CONCATENATE(B94,B95,B96)=\"\",C94=\"\",D94=\"\",E94=\"\"),1,0),0)","v":0}]
[]
[]
[null,null,null,null,null,null,null,{"$f":"IF(G97=0,\"\",ROUND(F97/G97,2))","v":""},{"$f":"IF(A97=\"\",0,Reference!B$74)","v":0},{"$f":"ROUND(IF(G97=0,F97*I97,H97*I97),2)","v":0},null,null,null,null,null,{"$f":"IF(F97>0,IF(OR(A97=\"\",CONCATENATE(B97,B98,B99)=\"\",C97=\"\",D97=\"\",E97=\"\"),1,0),0)","v":0}]
[]
[null,null,null,null,null,null,null,null,null,null,null,null,null,{"$f":"IF(SUM(J61:J99)>0,1,0)","v":0},"Print check"]
[]
["PART 5.D (2)"]
["TRAVEL SUPPLEMENTARY SHEET - UNIT PRICE TRAVEL"]
["(The unit price addresses costs associated with vehicle mileage and employees’ travel time)"]
[]
["1.   When multiple sites are visited in a single day, the total mileage must be divided by the number of sites visited. Total mileage should be rounded UP to a whole number.  "]
["2.   Travel charges for work activities included in unit pricing should not be addressed on this form."]
[]
["Costing Category","Activities Performed \n(Select all options that apply)","Date\nSort By Oldest to Newest","Destination\nInclude Beginning, Interim, \nand Ending Areas Traveled\n(Ex: BR, Rayne, Lafayette, BR)","RAC\nInvoice\nNo.","Total \nMileage","Complete these columns only when multiple site visits occurred",null,"RATE","TOTAL",null,null,null,null,null,"Test"]
[null,null,null,null,null,null,"No. of\nSites\nVisited","Adusted Mileage"]
[null,null,null,null,null,null,null,{"$f":"IF(G110=0,\"\",ROUND(F110/G110,2))","v":""},{"$f":"IF(A110=\"\",0,Reference!B$74)","v":0},{"$f":"ROUND(IF(G110=0,F110*I110,H110*I110),2)","v":0},null,null,null,null,null,{"$f":"IF(F110>0,IF(OR(A110=\"\",CONCATENATE(B110,B111,B112)=\"\",C110=\"\",D110=\"\",E110=\"\"),1,0),0)","v":0}]
[]
[]
[null,null,null,null,null,null,null,{"$f":"IF(G113=0,\"\",ROUND(F113/G113,2))","v":""},{"$f":"IF(A113=\"\",0,Reference!B$74)","v":0},{"$f":"ROUND(IF(G113=0,F113*I113,H113*I113),2)","v":0},null,null,null,null,null,{"$f":"IF(F113>0,IF(OR(A113=\"\",CONCATENATE(B113,B114,B115)=\"\",C113=\"\",D113=\"\",E113=\"\"),1,0),0)","v":0}]
[]
[]
[null,null,null,null,null,null,null,{"$f":"IF(G116=0,\"\",ROUND(F116/G116,2))","v":""},{"$f":"IF(A116=\"\",0,Reference!B$74)","v":0},{"$f":"ROUND(IF(G116=0,F116*I116,H116*I116),2)","v":0},null,null,null,null,null,{"$f":"IF(F116>0,IF(OR(A116=\"\",CONCATENATE(B116,B117,B118)=\"\",C116=\"\",D116=\"\",E116=\"\"),1,0),0)","v":0}]
[]
[]
[null,null,null,null,null,null,null,{"$f":"IF(G119=0,\"\",ROUND(F119/G119,2))","v":""},{"$f":"IF(A119=\"\",0,Reference!B$74)","v":0},{"$f":"ROUND(IF(G119=0,F119*I119,H119*I119),2)","v":0},null,null,null,null,null,{"$f":"IF(F119>0,IF(OR(A119=\"\",CONCATENATE(B119,B120,B121)=\"\",C119=\"\",D119=\"\",E119=\"\"),1,0),0)","v":0}]
[]
[]
[null,null,null,null,null,null,null,{"$f":"IF(G122=0,\"\",ROUND(F122/G122,2))","v":""},{"$f":"IF(A122=\"\",0,Reference!B$74)","v":0},{"$f":"ROUND(IF(G122=0,F122*I122,H122*I122),2)","v":0},null,null,null,null,null,{"$f":"IF(F122>0,IF(OR(A122=\"\",CONCATENATE(B122,B123,B124)=\"\",C122=\"\",D122=\"\",E122=\"\"),1,0),0)","v":0}]
[]
[]
[null,null,null,null,null,null,null,{"$f":"IF(G125=0,\"\",ROUND(F125/G125,2))","v":""},{"$f":"IF(A125=\"\",0,Reference!B$74)","v":0},{"$f":"ROUND(IF(G125=0,F125*I125,H125*I125),2)","v":0},null,null,null,null,null,{"$f":"IF(F125>0,IF(OR(A125=\"\",CONCATENATE(B125,B126,B127)=\"\",C125=\"\",D125=\"\",E125=\"\"),1,0),0)","v":0}]
[]
[]
[null,null,null,null,null,null,null,{"$f":"IF(G128=0,\"\",ROUND(F128/G128,2))","v":""},{"$f":"IF(A128=\"\",0,Reference!B$74)","v":0},{"$f":"ROUND(IF(G128=0,F128*I128,H128*I128),2)","v":0},null,null,null,null,null,{"$f":"IF(F128>0,IF(OR(A128=\"\",CONCATENATE(B128,B129,B130)=\"\",C128=\"\",D128=\"\",E128=\"\"),1,0),0)","v":0}]
[]
[]
[null,null,null,null,null,null,null,{"$f":"IF(G131=0,\"\",ROUND(F131/G131,2))","v":""},{"$f":"IF(A131=\"\",0,Reference!B$74)","v":0},{"$f":"ROUND(IF(G131=0,F131*I131,H131*I131),2)","v":0},null,null,null,null,null,{"$f":"IF(F131>0,IF(OR(A131=\"\",CONCATENATE(B131,B132,B133)=\"\",C131=\"\",D131=\"\",E131=\"\"),1,0),0)","v":0}]
[]
[]
[null,null,null,null,null,null,null,{"$f":"IF(G134=0,\"\",ROUND(F134/G134,2))","v":""},{"$f":"IF(A134=\"\",0,Reference!B$74)","v":0},{"$f":"ROUND(IF(G134=0,F134*I134,H134*I134),2)","v":0},null,null,null,null,null,{"$f":"IF(F134>0,IF(OR(A134=\"\",CONCATENATE(B134,B135,B136)=\"\",C134=\"\",D134=\"\",E134=\"\"),1,0),0)","v":0}]
[]
[]
[null,null,null,null,null,null,null,{"$f":"IF(G137=0,\"\",ROUND(F137/G137,2))","v":""},{"$f":"IF(A137=\"\",0,Reference!B$74)","v":0},{"$f":"ROUND(IF(G137=0,F137*I137,H137*I137),2)","v":0},null,null,null,null,null,{"$f":"IF(F137>0,IF(OR(A137=\"\",CONCATENATE(B137,B138,B139)=\"\",C137=\"\",D137=\"\",E137=\"\"),1,0),0)","v":0}]
[]
[]
[null,null,null,null,null,null,null,{"$f":"IF(G140=0,\"\",ROUND(F140/G140,2))","v":""},{"$f":"IF(A140=\"\",0,Reference!B$74)","v":0},{"$f":"ROUND(IF(G140=0,F140*I140,H140*I140),2)","v":0},null,null,null,null,null,{"$f":"IF(F140>0,IF(OR(A140=\"\",CONCATENATE(B140,B141,B142)=\"\",C140=\"\",D140=\"\",E140=\"\"),1,0),0)","v":0}]
[]
[]
[null,null,null,null,null,null,null,{"$f":"IF(G143=0,\"\",ROUND(F143/G143,2))","v":""},{"$f":"IF(A143=\"\",0,Reference!B$74)","v":0},{"$f":"ROUND(IF(G143=0,F143*I143,H143*I143),2)","v":0},null,null,null,null,null,{"$f":"IF(F143>0,IF(OR(A143=\"\",CONCATENATE(B143,B144,B145)=\"\",C143=\"\",D143=\"\",E143=\"\"),1,0),0)","v":0}]
[]
[]
[null,null,null,null,null,null,null,{"$f":"IF(G146=0,\"\",ROUND(F146/G146,2))","v":""},{"$f":"IF(A146=\"\",0,Reference!B$74)","v":0},{"$f":"ROUND(IF(G146=0,F146*I146,H146*I146),2)","v":0},null,null,null,null,null,{"$f":"IF(F146>0,IF(OR(A146=\"\",CONCATENATE(B146,B147,B148)=\"\",C146=\"\",D146=\"\",E146=\"\"),1,0),0)","v":0}]
[]
[null,null,null,null,null,null,null,null,null,null,null,null,null,{"$f":"IF(SUM(J110:J148)>0,1,0)","v":0},"Print check"]

{"sheet":"Transportation&Shipping","index":12,"n_rows":73,"n_cols":14,"rows_kept":73,"cut":false,"hidden":false,"merged":[[6,3,6,5],[7,3,7,5],[6,6,6,7],[7,6,7,7],[3,3,3,7],[4,3,4,5],[5,3,5,5],[4,6,4,7],[5,6,5,7]]}
["PART 5.E",null,null,null,null,null,null,null,null,null,null,{"$f":"+L37+L73","v":0},"Total Print check"]
["TRANSPORTATION/SHIPPING SUPPLEMENTARY SHEET"]
[null,{"$f":"IF(SUM(N13:N73)>0,\"MISSING INFORMATION\",\"\")","v":""}]
[null,null,null,"Costing Category Summary"]
[null,null,null,"Emergency/Initial",null,null,{"$f":"SUMIF(A$13:A$37,D5,H$13:H$37)+SUMIF(A$49:A$73,D5,H$49:H$73)","v":0}]
["1.    List shipping charges for contaminated soils and/or water and equipment used for activities other than well drilling, P&A, and geoprobe work.",null,null,"Investigation",null,null,{"$f":"SUMIF(A$13:A$37,D6,H$13:H$37)+SUMIF(A$49:A$73,D6,H$49:H$73)","v":0}]
["2.    If a single invoice addresses charges for multiple sites, indicate each site name and the amount charged to each site on the invoice.",null,null,"Interim Monitoring",null,null,{"$f":"SUMIF(A$13:A$37,D7,H$13:H$37)+SUMIF(A$49:A$73,D7,H$49:H$73)","v":0}]
["3.    Rush charges not required by DEQ will not be reimbursed.",null,null,"Corrective Action Plan",null,null,{"$f":"SUMIF(A$13:A$37,D8,H$13:H$37)+SUMIF(A$49:A$73,D8,H$49:H$73)","v":0}]
["4.    Transportation charges for work activities included in unit pricing should not be addressed on this form."]
[]
[]
["Costing Category","Description of Each Item Shipped","RAC\nInvoice\nNo.","Outside\nInvoice\nNo.","10% Markup Applies \n(Yes/No)","Shipping\n Cost  \n($)","Markup Subtotal\n($)","TOTAL",null,null,null,null,null,"Test"]
[null,null,null,null,null,null,{"$f":"IF(E13=\"Yes\",H13-F13,0)","v":0},{"$f":"IF(F13<>0,IF(E13=\"Yes\",F13*1.1,F13),0)","v":0},null,null,null,null,null,{"$f":"IF(H13>0,IF(OR(A13=\"\",B13=\"\",C13=\"\",D13=\"\"),1,0),0)","v":0}]
[null,null,null,null,null,null,{"$f":"IF(E14=\"Yes\",H14-F14,0)","v":0},{"$f":"IF(F14<>0,IF(E14=\"Yes\",F14*1.1,F14),0)","v":0},null,null,null,null,null,{"$f":"IF(H14>0,IF(OR(A14=\"\",B14=\"\",C14=\"\",D14=\"\"),1,0),0)","v":0}]
[null,null,null,null,null,null,0,0,null,null,null,null,null,0]
[null,null,null,null,null,null,0,0,null,null,null,null,null,0]
[null,null,null,null,null,null,0,0,null,null,null,null,null,0]
[null,null,null,null,null,null,0,0,null,null,null,null,null,0]
[null,null,null,null,null,null,0,0,null,null,null,null,null,0]
[null,null,null,null,null,null,0,0,null,null,null,null,null,0]
[null,null,null,null,null,null,0,0,null,null,null,null,null,0]
[null,null,null,null,null,null,0,0,null,null,null,null,null,0]
[null,null,null,null,null,null,0,0,null,null,null,null,null,0]
[null,null,null,null,null,null,0,0,null,null,null,null,null,0]
[null,null,null,null,null,null,0,0,null,null,null,null,null,0]
[null,null,null,null,null,null,0,0,null,null,null,null,null,0]
[null,null,null,null,null,null,0,0,null,null,null,null,null,0]
[null,null,null,null,null,null,0,0,null,null,null,null,null,0]
[null,null,null,null,null,null,0,0,null,null,null,null,null,0]
[null,null,null,null,null,null,0,0,null,null,null,null,null,0]
[null,null,null,null,null,null,0,0,null,null,null,null,null,0]
[null,null,null,null,null,null,0,0,null,null,null,null,null,0]
[null,null,null,null,null,null,0,0,null,null,null,null,null,0]
[null,null,null,null,null,null,0,0,null,null,null,null,null,0]
[null,null,null,null,null,null,0,0,null,null,null,null,null,0]
[null,null,null,null,null,null,0,0,null,null,null,null,null,0]
[null,null,null,null,null,null,0,0,null,null,null,{"$f":"IF(SUM(H13:H37)>0,1,0)","v":0},"Print check",0]
[]
["PART 5.E"]
["TRANSPORTATION/SHIPPING SUPPLEMENTARY SHEET"]
[]
["1.    List shipping charges for contaminated soils and/or water and equipment used for activities other than well drilling, P&A, and geoprobe work."]
["2.    If a single invoice addresses charges for multiple sites, indicate each site name and the amount charged to each site on the invoice."]
["3.    Rush charges not required by DEQ will not be reimbursed."]
["4.    Transportation charges for work activities included in unit pricing should not be addressed on this form."]
[]
[]
["Costing Category","Description of Each Item Shipped","RAC\nInvoice\nNo.","Outside\nInvoice\nNo.","10% Markup Applies \n(Yes/No)","Shipping\n Cost  \n($)","Markup Subtotal\n($)","TOTAL",null,null,null,null,null,"Test"]
[null,null,null,null,null,null,{"$f":"IF(E49=\"Yes\",H49-F49,0)","v":0},{"$f":"IF(F49<>0,IF(E49=\"Yes\",F49*1.1,F49),0)","v":0},null,null,null,null,null,{"$f":"IF(H49>0,IF(OR(A49=\"\",B49=\"\",C49=\"\",D49=\"\"),1,0),0)","v":0}]
[null,null,null,null,null,null,{"$f":"IF(E50=\"Yes\",H50-F50,0)","v":0},0,null,null,null,null,null,{"$f":"IF(H50>0,IF(OR(A50=\"\",B50=\"\",C50=\"\",D50=\"\"),1,0),0)","v":0}]
[null,null,null,null,null,null,0,0,null,null,null,null,null,0]
[null,null,null,null,null,null,0,0,null,null,null,null,null,0]
[null,null,null,null,null,null,0,0,null,null,null,null,null,0]
[null,null,null,null,null,null,0,0,null,null,null,null,null,0]
[null,null,null,null,null,null,0,0,null,null,null,null,null,0]
[null,null,null,null,null,null,0,0,null,null,null,null,null,0]
[null,null,null,null,null,null,0,0,null,null,null,null,null,0]
[null,null,null,null,null,null,0,0,null,null,null,null,null,0]
[null,null,null,null,null,null,0,0,null,null,null,null,null,0]
[null,null,null,null,null,null,0,0,null,null,null,null,null,0]
[null,null,null,null,null,null,0,0,null,null,null,null,null,0]
[null,null,null,null,null,null,0,0,null,null,null,null,null,0]
[null,null,null,null,null,null,0,0,null,null,null,null,null,0]
[null,null,null,null,null,null,0,0,null,null,null,null,null,0]
[null,null,null,null,null,null,0,0,null,null,null,null,null,0]
[null,null,null,null,null,null,0,0,null,null,null,null,null,0]
[null,null,null,null,null,null,0,0,null,null,null,null,null,0]
[null,null,null,null,null,null,0,0,null,null,null,null,null,0]
[null,null,null,null,null,null,0,0,null,null,null,null,null,0]
[null,null,null,null,null,null,0,0,null,null,null,null,null,0]
[null,null,null,null,null,null,0,0,null,null,null,null,null,0]
[null,null,null,null,null,null,0,0,null,null,null,null,null,0]
[null,null,null,null,null,null,0,0,null,null,null,{"$f":"IF(SUM(H49:H73)>0,1,0)","v":0},"Print check",0]

{"sheet":"Drilling-P&A","index":13,"n_rows":79,"n_cols":17,"rows_kept":79,"cut":false,"hidden":false,"merged":[[7,5,7,8],[8,5,8,7],[9,5,9,7],[10,5,10,7],[11,5,11,7],[33,0,33,8],[73,0,73,8],[78,6,78,7],[75,6,75,7],[76,6,76,7],[77,6,77,7],[34,6,34,7],[35,6,35,7],[74,6,74,7],[36,6,36,7],[37,6,37,7],[38,6,38,7]]}
["PART 5.F",null,null,{"$f":"IF(SUM(Q18:Q79)>0,\"MISSING INFORMATION\",\"\")","v":""},null,null,null,null,null,null,null,null,{"$f":"+M39+M79","v":0},"Total Print check"]
["DRILLING/PLUGGING & ABANDONMENT SUPPLEMENTARY SHEET"]
[]
[]
[]
["1.  The per foot rates include all costs associated with drilling or P&A of wells and borings with the exceptions of mileage, mob/demob unit price, analysis, and disposal of cuttings."]
["2.   (Depth of Boring or Well) X (Cost Per Foot) = (Total)"]
["3.   When a boring is converted to a monitoring well, only the monitoring well rate is reimbursable.",null,null,null,null,"Costing Category Summary"]
["4.   Drilling logs, well registrations, and P&A forms must be provided.",null,null,null,null,"Emergency/Initial",null,null,{"$f":"SUMIF(A$18:A$39,F9,I$18:I$39)+SUMIF(A$58:A$79,F9,I$58:I$79)","v":0}]
["5.   In the “Activity Type” column, enter one of the following P&A methods:",null,null,null,null,"Investigation",null,null,{"$f":"SUMIF(A$18:A$39,F10,I$18:I$39)+SUMIF(A$58:A$79,F10,I$58:I$79)","v":0}]
["                    P&A-1     =  Overdrilling ",null,null,null,null,"Interim Monitoring",null,null,{"$f":"SUMIF(A$18:A$39,F11,I$18:I$39)+SUMIF(A$58:A$79,F11,I$58:I$79)","v":0}]
["                    P&A-2     =  Pulling casing/screen and grouting",null,null,null,null,"Corrective Action Plan",null,null,{"$f":"SUMIF(A$18:A$39,F12,I$18:I$39)+SUMIF(A$58:A$79,F12,I$58:I$79)","v":0}]
["                    P&A-3     =  Grouting only"]
["6.   If a minimum rate or per-day rate for chemical injection is being charged, indicate the number of events next to the appropriate activity. All well/activity information "]
["      must be documented, excluding the Cost Per Foot Rate and including the dates of chemical injection events."]
[]
["Costing Category","Well/Boring\nIdentification Numbers\n(As shown in technical\nreports to DEQ) ","Activity Date","Well Type, Activity, and \nDiameter (inches)","RAC\nInvoice\nNo.","Activity Type\n[New well or P&A \n(1, 2, or 3);\nsee note 5]","Depth \n(feet)","Cost Per\nFoot\nRate ","TOTAL",null,null,null,null,null,"New Well ($/ft)","P&A ($/ft)","Test"]
[null,null,null,null,null,null,null,{"$f":"IF(D18=\"\",0,IF(F18=\"New well\",O18,IF(LEFT(F18,3)=\"P&A\",P18,0)))","v":0},{"$f":"ROUND((G18*H18),2)","v":0},null,null,null,null,null,{"$f":"IF(F18=\"New well\",VLOOKUP('Drilling-P&A'!D18,Reference!A$106:E$117,5,FALSE),0)","v":0},{"$f":"IF(F18=\"P&A-1\",VLOOKUP(D18,Reference!A$106:I$117,7,FALSE),IF(F18=\"P&A-2\",VLOOKUP(D18,Reference!A$106:I$117,8,FALSE),IF(F18=\"P&A-3\",VLOOKUP(D18,Reference!A$106:I$117,9,FALSE),0)))","v":0},{"$f":"IF(D18<>\"\",IF(OR(A18=\"\",B18=\"\",C18=\"\",E18=\"\",F18=\"\",G18=\"\"),1,0),0)","v":0}]
[null,null,null,null,null,null,null,{"$f":"IF(D19=\"\",0,IF(F19=\"New well\",O19,IF(LEFT(F19,3)=\"P&A\",P19,0)))","v":0},{"$f":"ROUND((G19*H19),2)","v":0},null,null,null,null,null,{"$f":"IF(F19=\"New well\",VLOOKUP('Drilling-P&A'!D19,Reference!A$106:E$117,5,FALSE),0)","v":0},{"$f":"IF(F19=\"P&A-1\",VLOOKUP(D19,Reference!A$106:I$117,7,FALSE),IF(F19=\"P&A-2\",VLOOKUP(D19,Reference!A$106:I$117,8,FALSE),IF(F19=\"P&A-3\",VLOOKUP(D19,Reference!A$106:I$117,9,FALSE),0)))","v":0},{"$f":"IF(D19<>\"\",IF(OR(A19=\"\",B19=\"\",C19=\"\",E19=\"\",F19=\"\",G19=\"\"),1,0),0)","v":0}]
[null,null,null,null,null,null,null,0,0,null,null,null,null,null,{"$f":"IF(F20=\"New well\",VLOOKUP('Drilling-P&A'!D20,Reference!A$106:E$117,5,FALSE),0)","v":0},{"$f":"IF(F20=\"P&A-1\",VLOOKUP(D20,Reference!A$106:I$117,7,FALSE),IF(F20=\"P&A-2\",VLOOKUP(D20,Reference!A$106:I$117,8,FALSE),IF(F20=\"P&A-3\",VLOOKUP(D20,Reference!A$106:I$117,9,FALSE),0)))","v":0},0]
[null,null,null,null,null,null,null,0,0,null,null,null,null,null,{"$f":"IF(F21=\"New well\",VLOOKUP('Drilling-P&A'!D21,Reference!A$106:E$117,5,FALSE),0)","v":0},{"$f":"IF(F21=\"P&A-1\",VLOOKUP(D21,Reference!A$106:I$117,7,FALSE),IF(F21=\"P&A-2\",VLOOKUP(D21,Reference!A$106:I$117,8,FALSE),IF(F21=\"P&A-3\",VLOOKUP(D21,Reference!A$106:I$117,9,FALSE),0)))","v":0},0]
[null,null,null,null,null,null,null,0,0,null,null,null,null,null,{"$f":"IF(F22=\"New well\",VLOOKUP('Drilling-P&A'!D22,Reference!A$106:E$117,5,FALSE),0)","v":0},{"$f":"IF(F22=\"P&A-1\",VLOOKUP(D22,Reference!A$106:I$117,7,FALSE),IF(F22=\"P&A-2\",VLOOKUP(D22,Reference!A$106:I$117,8,FALSE),IF(F22=\"P&A-3\",VLOOKUP(D22,Reference!A$106:I$117,9,FALSE),0)))","v":0},0]
[null,null,null,null,null,null,null,0,{"$f":"ROUND((G23*H23),2)","v":0},null,null,null,null,null,{"$f":"IF(F23=\"New well\",VLOOKUP('Drilling-P&A'!D23,Reference!A$106:E$117,5,FALSE),0)","v":0},{"$f":"IF(F23=\"P&A-1\",VLOOKUP(D23,Reference!A$106:I$117,7,FALSE),IF(F23=\"P&A-2\",VLOOKUP(D23,Reference!A$106:I$117,8,FALSE),IF(F23=\"P&A-3\",VLOOKUP(D23,Reference!A$106:I$117,9,FALSE),0)))","v":0},0]
[null,null,null,null,null,null,null,0,{"$f":"ROUND((G24*H24),2)","v":0},null,null,null,null,null,{"$f":"IF(F24=\"New well\",VLOOKUP('Drilling-P&A'!D24,Reference!A$106:E$117,5,FALSE),0)","v":0},{"$f":"IF(F24=\"P&A-1\",VLOOKUP(D24,Reference!A$106:I$117,7,FALSE),IF(F24=\"P&A-2\",VLOOKUP(D24,Reference!A$106:I$117,8,FALSE),IF(F24=\"P&A-3\",VLOOKUP(D24,Reference!A$106:I$117,9,FALSE),0)))","v":0},0]
[null,null,null,null,null,null,null,0,0,null,null,null,null,null,{"$f":"IF(F25=\"New well\",VLOOKUP('Drilling-P&A'!D25,Reference!A$106:E$117,5,FALSE),0)","v":0},{"$f":"IF(F25=\"P&A-1\",VLOOKUP(D25,Reference!A$106:I$117,7,FALSE),IF(F25=\"P&A-2\",VLOOKUP(D25,Reference!A$106:I$117,8,FALSE),IF(F25=\"P&A-3\",VLOOKUP(D25,Reference!A$106:I$117,9,FALSE),0)))","v":0},0]
[null,null,null,null,null,null,null,0,0,null,null,null,null,null,{"$f":"IF(F26=\"New well\",VLOOKUP('Drilling-P&A'!D26,Reference!A$106:E$117,5,FALSE),0)","v":0},{"$f":"IF(F26=\"P&A-1\",VLOOKUP(D26,Reference!A$106:I$117,7,FALSE),IF(F26=\"P&A-2\",VLOOKUP(D26,Reference!A$106:I$117,8,FALSE),IF(F26=\"P&A-3\",VLOOKUP(D26,Reference!A$106:I$117,9,FALSE),0)))","v":0},0]
[null,null,null,null,null,null,null,0,0,null,null,null,null,null,{"$f":"IF(F27=\"New well\",VLOOKUP('Drilling-P&A'!D27,Reference!A$106:E$117,5,FALSE),0)","v":0},{"$f":"IF(F27=\"P&A-1\",VLOOKUP(D27,Reference!A$106:I$117,7,FALSE),IF(F27=\"P&A-2\",VLOOKUP(D27,Reference!A$106:I$117,8,FALSE),IF(F27=\"P&A-3\",VLOOKUP(D27,Reference!A$106:I$117,9,FALSE),0)))","v":0},0]
[null,null,null,null,null,null,null,0,0,null,null,null,null,null,{"$f":"IF(F28=\"New well\",VLOOKUP('Drilling-P&A'!D28,Reference!A$106:E$117,5,FALSE),0)","v":0},{"$f":"IF(F28=\"P&A-1\",VLOOKUP(D28,Reference!A$106:I$117,7,FALSE),IF(F28=\"P&A-2\",VLOOKUP(D28,Reference!A$106:I$117,8,FALSE),IF(F28=\"P&A-3\",VLOOKUP(D28,Reference!A$106:I$117,9,FALSE),0)))","v":0},0]
[null,null,null,null,null,null,null,0,0,null,null,null,null,null,{"$f":"IF(F29=\"New well\",VLOOKUP('Drilling-P&A'!D29,Reference!A$106:E$117,5,FALSE),0)","v":0},{"$f":"IF(F29=\"P&A-1\",VLOOKUP(D29,Reference!A$106:I$117,7,FALSE),IF(F29=\"P&A-2\",VLOOKUP(D29,Reference!A$106:I$117,8,FALSE),IF(F29=\"P&A-3\",VLOOKUP(D29,Reference!A$106:I$117,9,FALSE),0)))","v":0},0]
[null,null,null,null,null,null,null,0,0,null,null,null,null,null,{"$f":"IF(F30=\"New well\",VLOOKUP('Drilling-P&A'!D30,Reference!A$106:E$117,5,FALSE),0)","v":0},{"$f":"IF(F30=\"P&A-1\",VLOOKUP(D30,Reference!A$106:I$117,7,FALSE),IF(F30=\"P&A-2\",VLOOKUP(D30,Reference!A$106:I$117,8,FALSE),IF(F30=\"P&A-3\",VLOOKUP(D30,Reference!A$106:I$117,9,FALSE),0)))","v":0},0]
[null,null,null,null,null,null,null,0,0,null,null,null,null,null,{"$f":"IF(F31=\"New well\",VLOOKUP('Drilling-P&A'!D31,Reference!A$106:E$117,5,FALSE),0)","v":0},{"$f":"IF(F31=\"P&A-1\",VLOOKUP(D31,Reference!A$106:I$117,7,FALSE),IF(F31=\"P&A-2\",VLOOKUP(D31,Reference!A$106:I$117,8,FALSE),IF(F31=\"P&A-3\",VLOOKUP(D31,Reference!A$106:I$117,9,FALSE),0)))","v":0},0]
[null,null,null,null,null,null,null,0,0,null,null,null,null,null,{"$f":"IF(F32=\"New well\",VLOOKUP('Drilling-P&A'!D32,Reference!A$106:E$117,5,FALSE),0)","v":0},{"$f":"IF(F32=\"P&A-1\",VLOOKUP(D32,Reference!A$106:I$117,7,FALSE),IF(F32=\"P&A-2\",VLOOKUP(D32,Reference!A$106:I$117,8,FALSE),IF(F32=\"P&A-3\",VLOOKUP(D32,Reference!A$106:I$117,9,FALSE),0)))","v":0},0]
[null,null,null,null,null,null,null,0,0,null,null,null,null,null,{"$f":"IF(F33=\"New well\",VLOOKUP('Drilling-P&A'!D33,Reference!A$106:E$117,5,FALSE),0)","v":0},{"$f":"IF(F33=\"P&A-1\",VLOOKUP(D33,Reference!A$106:I$117,7,FALSE),IF(F33=\"P&A-2\",VLOOKUP(D33,Reference!A$106:I$117,8,FALSE),IF(F33=\"P&A-3\",VLOOKUP(D33,Reference!A$106:I$117,9,FALSE),0)))","v":0},0]
["MINIMUM APPLIED RATES"]
["Costing Category","Well/Boring\nIdentification Numbers","Activity Date","Activity Type","RAC Invoice No.","No. of Events",null,null,"TOTAL"]
[null,null,null,null,null,null,null,null,{"$f":"IF(D36=\"\",0,VLOOKUP(D36,Reference!A$120:B$123,2,FALSE))*F36","v":0},null,null,null,null,null,null,null,{"$f":"IF(D36<>\"\",IF(OR(A36=\"\",B36=\"\",C36=\"\",E36=\"\",F36=\"\"),1,0),0)","v":0}]
[null,null,null,null,null,null,null,null,{"$f":"IF(D37=\"\",0,VLOOKUP(D37,Reference!A$120:B$123,2,FALSE))*F37","v":0},null,null,null,null,null,null,null,{"$f":"IF(D37<>\"\",IF(OR(A37=\"\",B37=\"\",C37=\"\",E37=\"\",F37=\"\"),1,0),0)","v":0}]
[null,null,null,null,null,null,null,null,{"$f":"IF(D38=\"\",0,VLOOKUP(D38,Reference!A$120:B$123,2,FALSE))*F38","v":0},null,null,null,null,null,null,null,{"$f":"IF(D38<>\"\",IF(OR(A38=\"\",B38=\"\",C38=\"\",E38=\"\",F38=\"\"),1,0),0)","v":0}]
[null,null,null,null,null,null,null,null,{"$f":"IF(D39=\"\",0,VLOOKUP(D39,Reference!A$120:B$123,2,FALSE))*F39","v":0},null,null,null,{"$f":"IF(SUM(I18:I33,I36:I39)>0,1,0)","v":0},"Print check",null,null,{"$f":"IF(D39<>\"\",IF(OR(A39=\"\",B39=\"\",C39=\"\",E39=\"\",F39=\"\"),1,0),0)","v":0}]
[]
["PART 5.F"]
["DRILLING/PLUGGING & ABANDONMENT SUPPLEMENTARY SHEET"]
[]
["1.  The per foot rates include all costs associated with drilling or P&A of wells and borings with the exceptions of mileage, mob/demob unit price, analysis, and disposal of cuttings."]
["2.   (Depth of Boring or Well) X (Cost Per Foot) = (Total)"]
["3.   When a boring is converted to a monitoring well, only the monitoring well rate is reimbursable."]
["4.   Drilling logs, well registrations, and P&A forms must be provided."]
["5.   In the “Activity Type” column, enter one of the following P&A methods:"]
["                    P&A-1     =  Overdrilling "]
["                    P&A-2     =  Pulling casing/screen and grouting"]
["                    P&A-3     =  Grouting only"]
["6.   If a minimum rate or per-day rate for chemical injection is being charged, indicate the number of events next to the appropriate activity. All well/activity information "]
["      must be documented, excluding the Cost Per Foot Rate and including the dates of chemical injection events."]
[]
[]
[]
["Costing Category","Well/Boring\nIdentification Numbers\n(As shown in technical\nreports to DEQ) ","Activity Date","Well Type, Activity, and \nDiameter (inches)","RAC\nInvoice\nNo.","Activity Type\n[New well or P&A \n(1, 2, or 3);\nsee note 5]","Depth \n(feet)","Cost Per\nFoot\nRate ","TOTAL",null,null,null,null,null,"New Well ($/ft)","P&A ($/ft)","Test"]
[null,null,null,null,null,null,null,{"$f":"IF(D58=\"\",0,IF(F58=\"New well\",O58,IF(LEFT(F58,3)=\"P&A\",P58,0)))","v":0},{"$f":"ROUND((G58*H58),2)","v":0},null,null,null,null,null,{"$f":"IF(F58=\"New well\",VLOOKUP('Drilling-P&A'!D58,Reference!A$106:E$117,5,FALSE),0)","v":0},{"$f":"IF(F58=\"P&A-1\",VLOOKUP(D58,Reference!A$106:I$117,7,FALSE),IF(F58=\"P&A-2\",VLOOKUP(D58,Reference!A$106:I$117,8,FALSE),IF(F58=\"P&A-3\",VLOOKUP(D58,Reference!A$106:I$117,9,FALSE),0)))","v":0},{"$f":"IF(D58<>\"\",IF(OR(A58=\"\",B58=\"\",C58=\"\",E58=\"\",F58=\"\",G58=\"\"),1,0),0)","v":0}]
[null,null,null,null,null,null,null,{"$f":"IF(D59=\"\",0,IF(F59=\"New well\",O59,IF(LEFT(F59,3)=\"P&A\",P59,0)))","v":0},{"$f":"ROUND((G59*H59),2)","v":0},null,null,null,null,null,{"$f":"IF(F59=\"New well\",VLOOKUP('Drilling-P&A'!D59,Reference!A$106:E$117,5,FALSE),0)","v":0},{"$f":"IF(F59=\"P&A-1\",VLOOKUP(D59,Reference!A$106:I$117,7,FALSE),IF(F59=\"P&A-2\",VLOOKUP(D59,Reference!A$106:I$117,8,FALSE),IF(F59=\"P&A-3\",VLOOKUP(D59,Reference!A$106:I$117,9,FALSE),0)))","v":0},{"$f":"IF(D59<>\"\",IF(OR(A59=\"\",B59=\"\",C59=\"\",E59=\"\",F59=\"\",G59=\"\"),1,0),0)","v":0}]
[null,null,null,null,null,null,null,0,0,null,null,null,null,null,{"$f":"IF(F60=\"New well\",VLOOKUP('Drilling-P&A'!D60,Reference!A$106:E$117,5,FALSE),0)","v":0},{"$f":"IF(F60=\"P&A-1\",VLOOKUP(D60,Reference!A$106:I$117,7,FALSE),IF(F60=\"P&A-2\",VLOOKUP(D60,Reference!A$106:I$117,8,FALSE),IF(F60=\"P&A-3\",VLOOKUP(D60,Reference!A$106:I$117,9,FALSE),0)))","v":0},0]
[null,null,null,null,null,null,null,0,0,null,null,null,null,null,{"$f":"IF(F61=\"New well\",VLOOKUP('Drilling-P&A'!D61,Reference!A$106:E$117,5,FALSE),0)","v":0},{"$f":"IF(F61=\"P&A-1\",VLOOKUP(D61,Reference!A$106:I$117,7,FALSE),IF(F61=\"P&A-2\",VLOOKUP(D61,Reference!A$106:I$117,8,FALSE),IF(F61=\"P&A-3\",VLOOKUP(D61,Reference!A$106:I$117,9,FALSE),0)))","v":0},0]
[null,null,null,null,null,null,null,0,0,null,null,null,null,null,{"$f":"IF(F62=\"New well\",VLOOKUP('Drilling-P&A'!D62,Reference!A$106:E$117,5,FALSE),0)","v":0},{"$f":"IF(F62=\"P&A-1\",VLOOKUP(D62,Reference!A$106:I$117,7,FALSE),IF(F62=\"P&A-2\",VLOOKUP(D62,Reference!A$106:I$117,8,FALSE),IF(F62=\"P&A-3\",VLOOKUP(D62,Reference!A$106:I$117,9,FALSE),0)))","v":0},0]
[null,null,null,null,null,null,null,0,0,null,null,null,null,null,{"$f":"IF(F63=\"New well\",VLOOKUP('Drilling-P&A'!D63,Reference!A$106:E$117,5,FALSE),0)","v":0},{"$f":"IF(F63=\"P&A-1\",VLOOKUP(D63,Reference!A$106:I$117,7,FALSE),IF(F63=\"P&A-2\",VLOOKUP(D63,Reference!A$106:I$117,8,FALSE),IF(F63=\"P&A-3\",VLOOKUP(D63,Reference!A$106:I$117,9,FALSE),0)))","v":0},0]
[null,null,null,null,null,null,null,0,0,null,null,null,null,null,{"$f":"IF(F64=\"New well\",VLOOKUP('Drilling-P&A'!D64,Reference!A$106:E$117,5,FALSE),0)","v":0},{"$f":"IF(F64=\"P&A-1\",VLOOKUP(D64,Reference!A$106:I$117,7,FALSE),IF(F64=\"P&A-2\",VLOOKUP(D64,Reference!A$106:I$117,8,FALSE),IF(F64=\"P&A-3\",VLOOKUP(D64,Reference!A$106:I$117,9,FALSE),0)))","v":0},0]
[null,null,null,null,null,null,null,0,0,null,null,null,null,null,{"$f":"IF(F65=\"New well\",VLOOKUP('Drilling-P&A'!D65,Reference!A$106:E$117,5,FALSE),0)","v":0},{"$f":"IF(F65=\"P&A-1\",VLOOKUP(D65,Reference!A$106:I$117,7,FALSE),IF(F65=\"P&A-2\",VLOOKUP(D65,Reference!A$106:I$117,8,FALSE),IF(F65=\"P&A-3\",VLOOKUP(D65,Reference!A$106:I$117,9,FALSE),0)))","v":0},0]
[null,null,null,null,null,null,null,0,0,null,null,null,null,null,{"$f":"IF(F66=\"New well\",VLOOKUP('Drilling-P&A'!D66,Reference!A$106:E$117,5,FALSE),0)","v":0},{"$f":"IF(F66=\"P&A-1\",VLOOKUP(D66,Reference!A$106:I$117,7,FALSE),IF(F66=\"P&A-2\",VLOOKUP(D66,Reference!A$106:I$117,8,FALSE),IF(F66=\"P&A-3\",VLOOKUP(D66,Reference!A$106:I$117,9,FALSE),0)))","v":0},0]
[null,null,null,null,null,null,null,0,0,null,null,null,null,null,{"$f":"IF(F67=\"New well\",VLOOKUP('Drilling-P&A'!D67,Reference!A$106:E$117,5,FALSE),0)","v":0},{"$f":"IF(F67=\"P&A-1\",VLOOKUP(D67,Reference!A$106:I$117,7,FALSE),IF(F67=\"P&A-2\",VLOOKUP(D67,Reference!A$106:I$117,8,FALSE),IF(F67=\"P&A-3\",VLOOKUP(D67,Reference!A$106:I$117,9,FALSE),0)))","v":0},0]
[null,null,null,null,null,null,null,0,0,null,null,null,null,null,{"$f":"IF(F68=\"New well\",VLOOKUP('Drilling-P&A'!D68,Reference!A$106:E$117,5,FALSE),0)","v":0},{"$f":"IF(F68=\"P&A-1\",VLOOKUP(D68,Reference!A$106:I$117,7,FALSE),IF(F68=\"P&A-2\",VLOOKUP(D68,Reference!A$106:I$117,8,FALSE),IF(F68=\"P&A-3\",VLOOKUP(D68,Reference!A$106:I$117,9,FALSE),0)))","v":0},0]
[null,null,null,null,null,null,null,0,0,null,null,null,null,null,{"$f":"IF(F69=\"New well\",VLOOKUP('Drilling-P&A'!D69,Reference!A$106:E$117,5,FALSE),0)","v":0},{"$f":"IF(F69=\"P&A-1\",VLOOKUP(D69,Reference!A$106:I$117,7,FALSE),IF(F69=\"P&A-2\",VLOOKUP(D69,Reference!A$106:I$117,8,FALSE),IF(F69=\"P&A-3\",VLOOKUP(D69,Reference!A$106:I$117,9,FALSE),0)))","v":0},0]
[null,null,null,null,null,null,null,0,0,null,null,null,null,null,{"$f":"IF(F70=\"New well\",VLOOKUP('Drilling-P&A'!D70,Reference!A$106:E$117,5,FALSE),0)","v":0},{"$f":"IF(F70=\"P&A-1\",VLOOKUP(D70,Reference!A$106:I$117,7,FALSE),IF(F70=\"P&A-2\",VLOOKUP(D70,Reference!A$106:I$117,8,FALSE),IF(F70=\"P&A-3\",VLOOKUP(D70,Reference!A$106:I$117,9,FALSE),0)))","v":0},0]
[null,null,null,null,null,null,null,0,0,null,null,null,null,null,{"$f":"IF(F71=\"New well\",VLOOKUP('Drilling-P&A'!D71,Reference!A$106:E$117,5,FALSE),0)","v":0},{"$f":"IF(F71=\"P&A-1\",VLOOKUP(D71,Reference!A$106:I$117,7,FALSE),IF(F71=\"P&A-2\",VLOOKUP(D71,Reference!A$106:I$117,8,FALSE),IF(F71=\"P&A-3\",VLOOKUP(D71,Reference!A$106:I$117,9,FALSE),0)))","v":0},0]
[null,null,null,null,null,null,null,0,0,null,null,null,null,null,{"$f":"IF(F72=\"New well\",VLOOKUP('Drilling-P&A'!D72,Reference!A$106:E$117,5,FALSE),0)","v":0},{"$f":"IF(F72=\"P&A-1\",VLOOKUP(D72,Reference!A$106:I$117,7,FALSE),IF(F72=\"P&A-2\",VLOOKUP(D72,Reference!A$106:I$117,8,FALSE),IF(F72=\"P&A-3\",VLOOKUP(D72,Reference!A$106:I$117,9,FALSE),0)))","v":0},0]
[null,null,null,null,null,null,null,0,0,null,null,null,null,null,{"$f":"IF(F73=\"New well\",VLOOKUP('Drilling-P&A'!D73,Reference!A$106:E$117,5,FALSE),0)","v":0},{"$f":"IF(F73=\"P&A-1\",VLOOKUP(D73,Reference!A$106:I$117,7,FALSE),IF(F73=\"P&A-2\",VLOOKUP(D73,Reference!A$106:I$117,8,FALSE),IF(F73=\"P&A-3\",VLOOKUP(D73,Reference!A$106:I$117,9,FALSE),0)))","v":0},0]
["MINIMUM APPLIED RATES"]
["Costing Category","Well/Boring\nIdentification Numbers","Activity Date","Activity Type","RAC Invoice No.","No. of Events",null,null,"TOTAL"]
[null,null,null,null,null,null,null,null,{"$f":"IF(D76=\"\",0,VLOOKUP(D76,Reference!A$120:B$123,2,FALSE))*F76","v":0},null,null,null,null,null,null,null,{"$f":"IF(D76<>\"\",IF(OR(A76=\"\",B76=\"\",C76=\"\",E76=\"\",F76=\"\"),1,0),0)","v":0}]
[null,null,null,null,null,null,null,null,{"$f":"IF(D77=\"\",0,VLOOKUP(D77,Reference!A$120:B$123,2,FALSE))*F77","v":0},null,null,null,null,null,null,null,{"$f":"IF(D77<>\"\",IF(OR(A77=\"\",B77=\"\",C77=\"\",E77=\"\",F77=\"\"),1,0),0)","v":0}]
[null,null,null,null,null,null,null,null,{"$f":"IF(D78=\"\",0,VLOOKUP(D78,Reference!A$120:B$123,2,FALSE))*F78","v":0},null,null,null,null,null,null,null,0]
[null,null,null,null,null,null,null,null,{"$f":"IF(D79=\"\",0,VLOOKUP(D79,Reference!A$120:B$123,2,FALSE))*F79","v":0},null,null,null,{"$f":"IF(SUM(I58:I73,I76:I79)>0,1,0)","v":0},"Print check",null,null,0]

{"sheet":"Analysis","index":14,"n_rows":99,"n_cols":21,"rows_kept":99,"cut":false,"hidden":false,"merged":[[63,7,63,8],[56,0,56,6],[56,7,56,8],[1,6,1,10],[2,6,2,9],[3,6,3,9],[4,6,4,9],[5,6,5,9],[25,7,25,8],[26,7,26,8],[59,7,59,8],[60,7,60,8],[96,7,96,8],[97,7,97,8],[98,7,98,8],[9,1,9,10],[23,0,23,6],[23,7,23,8],[24,7,24,8],[27,7,27,8],[28,7,28,8],[29,7,29,8],[30,7,30,8],[61,7,61,8],[42,1,42,10],[57,7,57,8],[58,7,58,8],[62,7,62,8],[94,7,94,8],[95,7,95,8],[77,1,77,10],[91,0,91,6],[91,7,91,8],[92,7,92,8],[93,7,93,8]]}
["PART 5.G",null,null,null,null,null,null,null,null,null,null,{"$f":"+L31+L64+L99","v":0},"Total Print check"]
["ANALYSIS SUPPLEMENTARY SHEET",null,null,null,{"$f":"IF(SUM(N12:N99)>0,\"MISSING INFORMATION\",\"\")","v":""},null,"Costing Category Summary"]
[null,null,null,null,null,null,"Emergency/Initial",null,null,null,{"$f":"SUMIF(A$12:A$31,G3,K$12:K$31)+SUMIF(A$45:A$64,G3,K$45:K$64)+SUMIF(A$80:A$99,G3,K$80:K$99)","v":0}]
[null,null,null,null,null,null,"Investigation",null,null,null,{"$f":"SUMIF(A$12:A$31,G4,K$12:K$31)+SUMIF(A$45:A$64,G4,K$45:K$64)+SUMIF(A$80:A$99,G4,K$80:K$99)","v":0}]
["1.   Refer to Appendix B, Table 4 of the Guidance Document for analysis rates.",null,null,null,null,null,"Interim Monitoring",null,null,null,{"$f":"SUMIF(A$12:A$31,G5,K$12:K$31)+SUMIF(A$45:A$64,G5,K$45:K$64)+SUMIF(A$80:A$99,G5,K$80:K$99)","v":0}]
["2.   Purchase of sampling equipment (EnCores, preserved vials, etc.) should be addressed on the Part 5.H (1).",null,null,null,null,null,"Corrective Action Plan",null,null,null,{"$f":"SUMIF(A$12:A$31,G6,K$12:K$31)+SUMIF(A$45:A$64,G6,K$45:K$64)+SUMIF(A$80:A$99,G6,K$80:K$99)","v":0}]
["3.   (No. of Test) X (Cost Per Test) = (Total)"]
["4.   Rush charges applied by the laboratory can be added on the same row as the parameter or selected from the parameter dropdown on a separate row. These charges will not be reimbursed without approval. "]
["5.   Markup can be added on the same row as the parameter or selected from the parameter dropdown on a separate row.  If the owner is directly billed for analysis, no markup is allowed."]
[]
["Costing Category","RAC\nInvoice\nNo.","Outside\nInvoice\nNo.","Parameter\n(Ex.:  BTEX, TPH-G, etc.)","Method Used","Medium Analyzed","No. of Tests","Unit Rate - \n($) Per\nTest","Non-Unit Rate - \n($) Per Test\n","Markup or Rush Charges\n($)","TOTAL",null,null,"Test",null,"Analysis cost + other cost","RAC Mark up","Lab Rush cost",null,"Subtest 1","Subtest 2"]
[null,null,null,null,{"$f":"IF(D12=\"\",\"\",VLOOKUP(D12,Reference!A$127:C$169,3,FALSE))","v":""},null,null,{"$f":"IF(D12=\"\",0,VLOOKUP(D12,Reference!A$127:C$169,2,FALSE))","v":0},0,0,{"$f":"ROUND(IF(D12<>\"\",(+P12),0),2)","v":0},null,null,{"$f":"IF(OR(D12=\"RAC Analysis Markup\",D12=\"Lab Rush Charges\"),U12,T12)","v":0},null,{"$f":"ROUND(IF(OR(D12=\"RAC Analysis Markup\",D12=\"Lab Rush Charges\"),0,IF(D12<>\"\",IF(I12>0,(I12*G12)+J12,(G12*H12)+J12),0)),2)+Q12+R12","v":0},{"$f":"IF(D12=\"RAC Analysis Markup\",J12,0)","v":0},{"$f":"IF(D12=\"Lab Rush Charges\",J12,0)","v":0},null,{"$f":"IF(D12<>\"\",IF(OR(A12=\"\",B12=\"\",C12=\"\",G12=\"\",F12=\"\"),1,0),0)","v":0},{"$f":"IF(D12<>\"\",IF(OR(A12=\"\",B12=\"\",C12=\"\",J12=0),1,0),0)","v":0}]
[null,null,null,null,{"$f":"IF(D13=\"\",\"\",VLOOKUP(D13,Reference!A$127:C$169,3,FALSE))","v":""},null,null,{"$f":"IF(D13=\"\",0,VLOOKUP(D13,Reference!A$127:C$169,2,FALSE))","v":0},0,0,0,null,null,0,null,{"$f":"ROUND(IF(OR(D13=\"RAC Analysis Markup\",D13=\"Lab Rush Charges\"),0,IF(D13<>\"\",IF(I13>0,(I13*G13)+J13,(G13*H13)+J13),0)),2)+Q13+R13","v":0},{"$f":"IF(D13=\"RAC Analysis Markup\",J13,0)","v":0},{"$f":"IF(D13=\"Lab Rush Charges\",J13,0)","v":0},null,0,{"$f":"IF(D13<>\"\",IF(OR(A13=\"\",B13=\"\",C13=\"\",J13=0),1,0),0)","v":0}]
[null,null,null,null,{"$f":"IF(D14=\"\",\"\",VLOOKUP(D14,Reference!A$127:C$169,3,FALSE))","v":""},null,null,{"$f":"IF(D14=\"\",0,VLOOKUP(D14,Reference!A$127:C$169,2,FALSE))","v":0},0,0,0,null,null,0,null,0,0,0,null,0,0]
[null,null,null,null,{"$f":"IF(D15=\"\",\"\",VLOOKUP(D15,Reference!A$127:C$169,3,FALSE))","v":""},null,null,{"$f":"IF(D15=\"\",0,VLOOKUP(D15,Reference!A$127:C$169,2,FALSE))","v":0},0,0,0,null,null,0,null,0,0,0,null,0,0]
[null,null,null,null,{"$f":"IF(D16=\"\",\"\",VLOOKUP(D16,Reference!A$127:C$169,3,FALSE))","v":""},null,null,{"$f":"IF(D16=\"\",0,VLOOKUP(D16,Reference!A$127:C$169,2,FALSE))","v":0},0,0,0,null,null,0,null,0,0,0,null,0,0]
[null,null,null,null,{"$f":"IF(D17=\"\",\"\",VLOOKUP(D17,Reference!A$127:C$169,3,FALSE))","v":""},null,null,{"$f":"IF(D17=\"\",0,VLOOKUP(D17,Reference!A$127:C$169,2,FALSE))","v":0},0,0,0,null,null,0,null,0,0,0,null,0,0]
[null,null,null,null,{"$f":"IF(D18=\"\",\"\",VLOOKUP(D18,Reference!A$127:C$169,3,FALSE))","v":""},null,null,{"$f":"IF(D18=\"\",0,VLOOKUP(D18,Reference!A$127:C$169,2,FALSE))","v":0},0,0,0,null,null,0,null,0,0,0,null,0,0]
[null,null,null,null,{"$f":"IF(D19=\"\",\"\",VLOOKUP(D19,Reference!A$127:C$169,3,FALSE))","v":""},null,null,{"$f":"IF(D19=\"\",0,VLOOKUP(D19,Reference!A$127:C$169,2,FALSE))","v":0},0,0,0,null,null,0,null,0,0,0,null,0,0]
[null,null,null,null,{"$f":"IF(D20=\"\",\"\",VLOOKUP(D20,Reference!A$127:C$169,3,FALSE))","v":""},null,null,{"$f":"IF(D20=\"\",0,VLOOKUP(D20,Reference!A$127:C$169,2,FALSE))","v":0},0,0,0,null,null,0,null,0,0,0,null,0,0]
[null,null,null,null,{"$f":"IF(D21=\"\",\"\",VLOOKUP(D21,Reference!A$127:C$169,3,FALSE))","v":""},null,null,{"$f":"IF(D21=\"\",0,VLOOKUP(D21,Reference!A$127:C$169,2,FALSE))","v":0},0,0,0,null,null,0,null,0,0,0,null,0,0]
[null,null,null,null,{"$f":"IF(D22=\"\",\"\",VLOOKUP(D22,Reference!A$127:C$169,3,FALSE))","v":""},null,null,{"$f":"IF(D22=\"\",0,VLOOKUP(D22,Reference!A$127:C$169,2,FALSE))","v":0},0,0,0,null,null,0,null,0,0,0,null,0,0]
[null,null,null,null,{"$f":"IF(D23=\"\",\"\",VLOOKUP(D23,Reference!A$127:C$169,3,FALSE))","v":""},null,null,{"$f":"IF(D23=\"\",0,VLOOKUP(D23,Reference!A$127:C$169,2,FALSE))","v":0},0,0,0,null,null,0,null,0,0,0,null,0,0]
["USE SPACE BELOW FOR PARAMETERS/METHODS/RATES NOT LISTED/POPULATED ABOVE",null,null,null,null,null,null,"Costs Per Test ($)",null,null,"TOTAL"]
[null,null,null,null,null,null,null,0,null,0,{"$f":"ROUND(IF(H25>0,(+P25),0),2)","v":0},null,null,{"$f":"IF(G25>0,IF(OR(A25=\"\",B25=\"\",C25=\"\",E25=\"\",D25=\"\",F25=\"\",H25=\"\"),1,0),0)","v":0},null,{"$f":"ROUND(IF(D25<>\"\",(G25*H25)+J25,0),2)","v":0}]
[null,null,null,null,null,null,null,0,null,0,{"$f":"ROUND(IF(H26>0,(+P26),0),2)","v":0},null,null,{"$f":"IF(G26>0,IF(OR(A26=\"\",B26=\"\",C26=\"\",E26=\"\",D26=\"\",F26=\"\",H26=\"\"),1,0),0)","v":0},null,{"$f":"ROUND(IF(D26<>\"\",(G26*H26)+J26,0),2)","v":0}]
[null,null,null,null,null,null,null,0,null,0,0,null,null,0,null,0]
[null,null,null,null,null,null,null,0,null,0,{"$f":"ROUND(IF(H28>0,(+P28),0),2)","v":0},null,null,{"$f":"IF(G28>0,IF(OR(A28=\"\",B28=\"\",C28=\"\",E28=\"\",D28=\"\",F28=\"\",H28=\"\"),1,0),0)","v":0},null,{"$f":"ROUND(IF(D28<>\"\",(G28*H28)+J28,0),2)","v":0}]
[null,null,null,null,null,null,null,0,null,0,{"$f":"ROUND(IF(H29>0,(+P29),0),2)","v":0},null,null,{"$f":"IF(G29>0,IF(OR(A29=\"\",B29=\"\",C29=\"\",E29=\"\",D29=\"\",F29=\"\",H29=\"\"),1,0),0)","v":0},null,0]
[null,null,null,null,null,null,null,0,null,0,{"$f":"ROUND(IF(H30>0,(+P30),0),2)","v":0},null,null,{"$f":"IF(G30>0,IF(OR(A30=\"\",B30=\"\",C30=\"\",E30=\"\",D30=\"\",F30=\"\",H30=\"\"),1,0),0)","v":0},null,0]
[null,null,null,null,null,null,null,0,null,0,0,{"$f":"IF(SUM(K25:K31,K12:K23)>0,1,0)","v":0},"Print check",{"$f":"IF(G31>0,IF(OR(A31=\"\",B31=\"\",C31=\"\",E31=\"\",D31=\"\",F31=\"\",H31=\"\"),1,0),0)","v":0},null,0]
[]
["PART 5.G"]
["ANALYSIS SUPPLEMENTARY SHEET"]
[]
[]
[]
["1.   Refer to Appendix B, Table 4 of the Guidance Document for analysis rates."]
["2.   Purchase of sampling equipment (EnCores, preserved vials, etc.) should be addressed on the Part 5.H (1)."]
["3.   (No. of Test) X (Cost Per Test) = (Total)"]
["4.   Rush charges applied by the laboratory can be added on the same row as the parameter or selected from the parameter dropdown on a separate row. These charges will not be reimbursed without approval. "]
["5.   Markup can be added on the same row as the parameter or selected from the parameter dropdown on a separate row.  If the owner is directly billed for analysis, no markup is allowed."]
[]
["Costing Category","RAC\nInvoice\nNo.","Outside\nInvoice\nNo.","Parameter\n(Ex.:  BTEX, TPH-G, etc.)","Method Used","Medium Analyzed","No. of Tests","Unit Rate - \n($) Per\nTest","Non-Unit Rate -\n($) Per Test\n","Markup or Rush Charges\n($)","TOTAL",null,null,"Test",null,"Analysis cost","RAC Mark up","Lab Rush cost",null,"Subtest 1","Subtest 2"]
[null,null,null,null,{"$f":"IF(D45=\"\",\"\",VLOOKUP(D45,Reference!A$127:C$169,3,FALSE))","v":""},null,null,{"$f":"IF(D45=\"\",0,VLOOKUP(D45,Reference!A$127:C$169,2,FALSE))","v":0},0,0,{"$f":"ROUND(IF(D45>0,(+P45),0),2)","v":0},null,null,{"$f":"IF(OR(D45=\"RAC Analysis Markup\",D45=\"Lab Rush Charges\"),U45,T45)","v":0},null,{"$f":"ROUND(IF(OR(D45=\"RAC Analysis Markup\",D45=\"Lab Rush Charges\"),0,IF(D45<>\"\",IF(I45>0,(I45*G45)+J45,(G45*H45)+J45),0)),2)+Q45+R45","v":0},{"$f":"IF(D45=\"RAC Analysis Markup\",J45,0)","v":0},{"$f":"IF(D45=\"Lab Rush Charges\",J45,0)","v":0},null,{"$f":"IF(D45<>\"\",IF(OR(A45=\"\",B45=\"\",C45=\"\",G45=\"\",F45=\"\"),1,0),0)","v":0},{"$f":"IF(D45<>\"\",IF(OR(A45=\"\",B45=\"\",C45=\"\",I45=0),1,0),0)","v":0}]
[null,null,null,null,{"$f":"IF(D46=\"\",\"\",VLOOKUP(D46,Reference!A$127:C$169,3,FALSE))","v":""},null,null,{"$f":"IF(D46=\"\",0,VLOOKUP(D46,Reference!A$127:C$169,2,FALSE))","v":0},0,0,0,null,null,0,null,{"$f":"ROUND(IF(OR(D46=\"RAC Analysis Markup\",D46=\"Lab Rush Charges\"),0,IF(D46<>\"\",IF(I46>0,(I46*G46)+J46,(G46*H46)+J46),0)),2)+Q46+R46","v":0},{"$f":"IF(D46=\"RAC Analysis Markup\",J46,0)","v":0},{"$f":"IF(D46=\"Lab Rush Charges\",J46,0)","v":0},null,0,0]
[null,null,null,null,{"$f":"IF(D47=\"\",\"\",VLOOKUP(D47,Reference!A$127:C$169,3,FALSE))","v":""},null,null,{"$f":"IF(D47=\"\",0,VLOOKUP(D47,Reference!A$127:C$169,2,FALSE))","v":0},0,0,0,null,null,0,null,0,0,0,null,0,0]
[null,null,null,null,{"$f":"IF(D48=\"\",\"\",VLOOKUP(D48,Reference!A$127:C$169,3,FALSE))","v":""},null,null,{"$f":"IF(D48=\"\",0,VLOOKUP(D48,Reference!A$127:C$169,2,FALSE))","v":0},0,0,0,null,null,0,null,0,0,0,null,0,0]
[null,null,null,null,{"$f":"IF(D49=\"\",\"\",VLOOKUP(D49,Reference!A$127:C$169,3,FALSE))","v":""},null,null,{"$f":"IF(D49=\"\",0,VLOOKUP(D49,Reference!A$127:C$169,2,FALSE))","v":0},0,0,0,null,null,0,null,0,0,0,null,0,0]
[null,null,null,null,{"$f":"IF(D50=\"\",\"\",VLOOKUP(D50,Reference!A$127:C$169,3,FALSE))","v":""},null,null,{"$f":"IF(D50=\"\",0,VLOOKUP(D50,Reference!A$127:C$169,2,FALSE))","v":0},0,0,0,null,null,0,null,0,0,0,null,0,0]
[null,null,null,null,{"$f":"IF(D51=\"\",\"\",VLOOKUP(D51,Reference!A$127:C$169,3,FALSE))","v":""},null,null,{"$f":"IF(D51=\"\",0,VLOOKUP(D51,Reference!A$127:C$169,2,FALSE))","v":0},0,0,0,null,null,0,null,0,0,0,null,0,0]
[null,null,null,null,{"$f":"IF(D52=\"\",\"\",VLOOKUP(D52,Reference!A$127:C$169,3,FALSE))","v":""},null,null,{"$f":"IF(D52=\"\",0,VLOOKUP(D52,Reference!A$127:C$169,2,FALSE))","v":0},0,0,0,null,null,0,null,0,0,0,null,0,0]
[null,null,null,null,{"$f":"IF(D53=\"\",\"\",VLOOKUP(D53,Reference!A$127:C$169,3,FALSE))","v":""},null,null,{"$f":"IF(D53=\"\",0,VLOOKUP(D53,Reference!A$127:C$169,2,FALSE))","v":0},0,0,0,null,null,0,null,0,0,0,null,0,0]
[null,null,null,null,{"$f":"IF(D54=\"\",\"\",VLOOKUP(D54,Reference!A$127:C$169,3,FALSE))","v":""},null,null,{"$f":"IF(D54=\"\",0,VLOOKUP(D54,Reference!A$127:C$169,2,FALSE))","v":0},0,0,0,null,null,0,null,0,0,0,null,0,0]
[null,null,null,null,{"$f":"IF(D55=\"\",\"\",VLOOKUP(D55,Reference!A$127:C$169,3,FALSE))","v":""},null,null,{"$f":"IF(D55=\"\",0,VLOOKUP(D55,Reference!A$127:C$169,2,FALSE))","v":0},0,0,0,null,null,0,null,0,0,0,null,0,0]
[null,null,null,null,{"$f":"IF(D56=\"\",\"\",VLOOKUP(D56,Reference!A$127:C$169,3,FALSE))","v":""},null,null,{"$f":"IF(D56=\"\",0,VLOOKUP(D56,Reference!A$127:C$169,2,FALSE))","v":0},0,0,0,null,null,0,null,0,0,0,null,0,0]
["USE SPACE BELOW FOR PARAMETERS/METHODS/RATES NOT LISTED/POPULATED ABOVE",null,null,null,null,null,null,"Costs Per Test ($)",null,null,"TOTAL"]
[null,null,null,null,null,null,null,0,null,0,{"$f":"ROUND(IF(H58>0,(+P58),0),2)","v":0},null,null,{"$f":"IF(G58>0,IF(OR(A58=\"\",B58=\"\",C58=\"\",E58=\"\",D58=\"\",F58=\"\",H58=\"\"),1,0),0)","v":0},null,{"$f":"ROUND(IF(D58<>\"\",(G58*H58)+J58,0),2)","v":0}]
[null,null,null,null,null,null,null,0,null,0,{"$f":"ROUND(IF(H59>0,(+P59),0),2)","v":0},null,null,{"$f":"IF(G59>0,IF(OR(A59=\"\",B59=\"\",C59=\"\",E59=\"\",D59=\"\",F59=\"\",H59=\"\"),1,0),0)","v":0},null,{"$f":"ROUND(IF(D59<>\"\",(G59*H59)+J59,0),2)","v":0}]
[null,null,null,null,null,null,null,0,null,0,{"$f":"ROUND(IF(H60>0,(+P60),0),2)","v":0},null,null,{"$f":"IF(G60>0,IF(OR(A60=\"\",B60=\"\",C60=\"\",E60=\"\",D60=\"\",F60=\"\",H60=\"\"),1,0),0)","v":0},null,0]
[null,null,null,null,null,null,null,0,null,0,0,null,null,0,null,0]
[null,null,null,null,null,null,null,0,null,0,{"$f":"ROUND(IF(H62>0,(+P62),0),2)","v":0},null,null,{"$f":"IF(G62>0,IF(OR(A62=\"\",B62=\"\",C62=\"\",E62=\"\",D62=\"\",F62=\"\",H62=\"\"),1,0),0)","v":0},null,0]
[null,null,null,null,null,null,null,0,null,0,{"$f":"ROUND(IF(H63>0,(+P63),0),2)","v":0},null,null,{"$f":"IF(G63>0,IF(OR(A63=\"\",B63=\"\",C63=\"\",E63=\"\",D63=\"\",F63=\"\",H63=\"\"),1,0),0)","v":0},null,0]
[null,null,null,null,null,null,null,0,null,0,{"$f":"ROUND(IF(H64>0,(+P64),0),2)","v":0},{"$f":"IF(SUM(K58:K64,K45:K56)>0,1,0)","v":0},"Print check",{"$f":"IF(G64>0,IF(OR(A64=\"\",B64=\"\",C64=\"\",E64=\"\",D64=\"\",F64=\"\",H64=\"\"),1,0),0)","v":0},null,0]
[]
[]
[]
["PART 5.G"]
["ANALYSIS SUPPLEMENTARY SHEET"]
[]
[]
[]
["1.   Refer to Appendix B, Table 4 of the Guidance Document for analysis rates."]
["2.   Purchase of sampling equipment (EnCores, preserved vials, etc.) should be addressed on the Part 5.H (1)."]
["3.   (No. of Test) X (Cost Per Test) = (Total)"]
["4.   Rush charges applied by the laboratory can be added on the same row as the parameter or selected from the parameter dropdown on a separate row. These charges will not be reimbursed without approval. "]
["5.   Markup can be added on the same row as the parameter or selected from the parameter dropdown on a separate row.  If the owner is directly billed for analysis, no markup is allowed."]
[]
["Costing Category","RAC\nInvoice\nNo.","Outside\nInvoice\nNo.","Parameter\n(Ex.:  BTEX, TPH-G, etc.)","Method Used","Medium Analyzed","No. of Tests","Unit Rate - \n($) Per\nTest","Non-Unit Rate-\n($) Per Test\n","Markup or Rush Charges\n($)","TOTAL",null,null,"Test",null,"Analysis cost","RAC Mark up","Lab Rush cost",null,"Subtest 1","Subtest 2"]
[null,null,null,null,{"$f":"IF(D80=\"\",\"\",VLOOKUP(D80,Reference!A$127:C$169,3,FALSE))","v":""},null,null,{"$f":"IF(D80=\"\",0,VLOOKUP(D80,Reference!A$127:C$169,2,FALSE))","v":0},0,0,{"$f":"ROUND(IF(D80>0,(+P80),0),2)","v":0},null,null,{"$f":"IF(OR(D80=\"RAC Analysis Markup\",D80=\"Lab Rush Charges\"),U80,T80)","v":0},null,{"$f":"ROUND(IF(OR(D80=\"RAC Analysis Markup\",D80=\"Lab Rush Charges\"),0,IF(D80<>\"\",IF(I80>0,(I80*G80)+J80,(G80*H80)+J80),0)),2)+Q80+R80","v":0},{"$f":"IF(D80=\"RAC Analysis Markup\",J80,0)","v":0},{"$f":"IF(D80=\"Lab Rush Charges\",J80,0)","v":0},null,{"$f":"IF(D80<>\"\",IF(OR(A80=\"\",B80=\"\",C80=\"\",G80=\"\",F80=\"\"),1,0),0)","v":0},{"$f":"IF(D80<>\"\",IF(OR(A80=\"\",B80=\"\",C80=\"\",I80=0),1,0),0)","v":0}]
[null,null,null,null,{"$f":"IF(D81=\"\",\"\",VLOOKUP(D81,Reference!A$127:C$169,3,FALSE))","v":""},null,null,{"$f":"IF(D81=\"\",0,VLOOKUP(D81,Reference!A$127:C$169,2,FALSE))","v":0},0,0,0,null,null,0,null,{"$f":"ROUND(IF(OR(D81=\"RAC Analysis Markup\",D81=\"Lab Rush Charges\"),0,IF(D81<>\"\",IF(I81>0,(I81*G81)+J81,(G81*H81)+J81),0)),2)+Q81+R81","v":0},{"$f":"IF(D81=\"RAC Analysis Markup\",J81,0)","v":0},{"$f":"IF(D81=\"Lab Rush Charges\",J81,0)","v":0},null,0,0]
[null,null,null,null,{"$f":"IF(D82=\"\",\"\",VLOOKUP(D82,Reference!A$127:C$169,3,FALSE))","v":""},null,null,{"$f":"IF(D82=\"\",0,VLOOKUP(D82,Reference!A$127:C$169,2,FALSE))","v":0},0,0,0,null,null,0,null,0,0,0,null,0,0]
[null,null,null,null,{"$f":"IF(D83=\"\",\"\",VLOOKUP(D83,Reference!A$127:C$169,3,FALSE))","v":""},null,null,{"$f":"IF(D83=\"\",0,VLOOKUP(D83,Reference!A$127:C$169,2,FALSE))","v":0},0,0,0,null,null,0,null,0,0,0,null,0,0]
[null,null,null,null,{"$f":"IF(D84=\"\",\"\",VLOOKUP(D84,Reference!A$127:C$169,3,FALSE))","v":""},null,null,{"$f":"IF(D84=\"\",0,VLOOKUP(D84,Reference!A$127:C$169,2,FALSE))","v":0},0,0,0,null,null,0,null,0,0,0,null,0,0]
[null,null,null,null,{"$f":"IF(D85=\"\",\"\",VLOOKUP(D85,Reference!A$127:C$169,3,FALSE))","v":""},null,null,{"$f":"IF(D85=\"\",0,VLOOKUP(D85,Reference!A$127:C$169,2,FALSE))","v":0},0,0,0,null,null,0,null,0,0,0,null,0,0]
[null,null,null,null,{"$f":"IF(D86=\"\",\"\",VLOOKUP(D86,Reference!A$127:C$169,3,FALSE))","v":""},null,null,{"$f":"IF(D86=\"\",0,VLOOKUP(D86,Reference!A$127:C$169,2,FALSE))","v":0},0,0,0,null,null,0,null,0,0,0,null,0,0]
[null,null,null,null,{"$f":"IF(D87=\"\",\"\",VLOOKUP(D87,Reference!A$127:C$169,3,FALSE))","v":""},null,null,{"$f":"IF(D87=\"\",0,VLOOKUP(D87,Reference!A$127:C$169,2,FALSE))","v":0},0,0,0,null,null,0,null,0,0,0,null,0,0]
[null,null,null,null,{"$f":"IF(D88=\"\",\"\",VLOOKUP(D88,Reference!A$127:C$169,3,FALSE))","v":""},null,null,{"$f":"IF(D88=\"\",0,VLOOKUP(D88,Reference!A$127:C$169,2,FALSE))","v":0},0,0,0,null,null,0,null,0,0,0,null,0,0]
[null,null,null,null,{"$f":"IF(D89=\"\",\"\",VLOOKUP(D89,Reference!A$127:C$169,3,FALSE))","v":""},null,null,{"$f":"IF(D89=\"\",0,VLOOKUP(D89,Reference!A$127:C$169,2,FALSE))","v":0},0,0,0,null,null,0,null,0,0,0,null,0,0]
[null,null,null,null,{"$f":"IF(D90=\"\",\"\",VLOOKUP(D90,Reference!A$127:C$169,3,FALSE))","v":""},null,null,{"$f":"IF(D90=\"\",0,VLOOKUP(D90,Reference!A$127:C$169,2,FALSE))","v":0},0,0,0,null,null,0,null,0,0,0,null,0,0]
[null,null,null,null,{"$f":"IF(D91=\"\",\"\",VLOOKUP(D91,Reference!A$127:C$169,3,FALSE))","v":""},null,null,{"$f":"IF(D91=\"\",0,VLOOKUP(D91,Reference!A$127:C$169,2,FALSE))","v":0},0,0,0,null,null,0,null,0,0,0,null,0,0]
["USE SPACE BELOW FOR PARAMETERS/METHODS/RATES NOT LISTED/POPULATED ABOVE",null,null,null,null,null,null,"Costs Per Test ($)",null,null,"TOTAL"]
[null,null,null,null,null,null,null,0,null,0,{"$f":"ROUND(IF(H93>0,(+P93),0),2)","v":0},null,null,{"$f":"IF(G93>0,IF(OR(A93=\"\",B93=\"\",C93=\"\",E93=\"\",D93=\"\",F93=\"\",H93=\"\"),1,0),0)","v":0},null,{"$f":"ROUND(IF(D93<>\"\",(G93*H93)+J93,0),2)","v":0}]
[null,null,null,null,null,null,null,0,null,0,{"$f":"ROUND(IF(H94>0,(+P94),0),2)","v":0},null,null,{"$f":"IF(G94>0,IF(OR(A94=\"\",B94=\"\",C94=\"\",E94=\"\",D94=\"\",F94=\"\",H94=\"\"),1,0),0)","v":0},null,{"$f":"ROUND(IF(D94<>\"\",(G94*H94)+J94,0),2)","v":0}]
[null,null,null,null,null,null,null,0,null,0,{"$f":"ROUND(IF(H95>0,(+P95),0),2)","v":0},null,null,0,null,{"$f":"ROUND(IF(D95<>\"\",(G95*H95)+J95,0),2)","v":0}]
[null,null,null,null,null,null,null,0,null,0,0,null,null,0,null,0]
[null,null,null,null,null,null,null,0,null,0,{"$f":"ROUND(IF(H97>0,(+P97),0),2)","v":0},null,null,0,null,{"$f":"ROUND(IF(D97<>\"\",(G97*H97)+J97,0),2)","v":0}]
[null,null,null,null,null,null,null,0,null,0,{"$f":"ROUND(IF(H98>0,(+P98),0),2)","v":0},null,null,0,null,0]
[null,null,null,null,null,null,null,0,null,0,{"$f":"ROUND(IF(H99>0,(+P99),0),2)","v":0},{"$f":"IF(SUM(K93:K99,K80:K91)>0,1,0)","v":0},"Print check",0,null,0]

{"sheet":"Miscellaneous 1","index":15,"n_rows":107,"n_cols":14,"rows_kept":107,"cut":false,"hidden":false,"merged":[[7,4,7,6],[2,4,2,7],[3,4,3,6],[4,4,4,6],[5,4,5,6],[6,4,6,6]]}
["PART 5.H (1)",null,null,null,null,null,null,null,null,null,null,{"$f":"+L35+L71+L107","v":0},"Total Print check"]
["MISCELLANEOUS SUPPLEMENTARY SHEET"]
[null,{"$f":"IF(SUM(N11:N107)>0,\"MISSING INFORMATION\",\"\")","v":""},null,null,"Costing Category Summary"]
[null,null,null,null,"Emergency/Initial",null,null,{"$f":"SUMIF($A$11:$A$35,$E4,H$11:H$35)+SUMIF($A$46:$A$71,$E4,H$46:H$71)+SUMIF($A$82:$A$107,$E4,H$82:H$107)","v":0}]
["1. All costs not associated with the previous categories must be listed here.",null,null,null,"Investigation",null,null,{"$f":"SUMIF(A$11:A$35,E5,H$11:H$35)+SUMIF(A$46:A$71,E5,H$46:H$71)+SUMIF(A$82:A$107,E5,H$82:H$107)","v":0}]
["2. Miscellaneous charges for work activities included in unit pricing should not be ",null,null,null,"Interim Monitoring",null,null,{"$f":"SUMIF(A$11:A$35,E6,H$11:H$35)+SUMIF(A$46:A$71,E6,H$46:H$71)+SUMIF(A$82:A$107,E6,H$82:H$107)","v":0}]
["    addressed on this form.",null,null,null,"Corrective Action Plan",null,null,{"$f":"SUMIF(A$11:A$35,E7,H$11:H$35)+SUMIF(A$46:A$71,E7,H$46:H$71)+SUMIF(A$82:A$107,E7,H$82:H$107)","v":0}]
["3. All RAC markups not denoted on other pages must be listed on this form.",null,null,null,"Report Preparation",null,null,{"$f":"SUMIF(A$11:A$35,E8,H$11:H$35)+SUMIF(A$46:A$71,E8,H$46:H$71)+SUMIF(A$82:A$107,E8,H$82:H$107)","v":0}]
[]
["Costing Category","Description and Quantity of Each Miscellaneous Item","RAC\nInvoice\nNo.","Outside\nInvoice\nNo.","Item's Cost\n ($)","10% Markup Applies \n(Yes/No)","Markup Subtotal\n($)","TOTAL",null,null,null,null,null,"Test"]
[null,null,null,null,null,null,{"$f":"IF(F11=\"Yes\",E11*0.1,0)","v":0},{"$f":"ROUND(IF(E11<>\"\",E11+G11,0),2)","v":0},null,null,null,null,null,{"$f":"IF(H11<>0,IF(OR(E11=\"\",C11=\"\",B11=\"\",A11=\"\"),1,0),0)","v":0}]
[null,null,null,null,null,null,{"$f":"IF(F12=\"Yes\",E12*0.1,0)","v":0},{"$f":"ROUND(IF(E12<>\"\",E12+G12,0),2)","v":0},null,null,null,null,null,{"$f":"IF(H12<>0,IF(OR(E12=\"\",C12=\"\",B12=\"\",A12=\"\"),1,0),0)","v":0}]
[null,null,null,null,null,null,0,0,null,null,null,null,null,0]
[null,null,null,null,null,null,0,0,null,null,null,null,null,0]
[null,null,null,null,null,null,0,0,null,null,null,null,null,0]
[null,null,null,null,null,null,0,0,null,null,null,null,null,0]
[null,null,null,null,null,null,0,0,null,null,null,null,null,0]
[null,null,null,null,null,null,0,0,null,null,null,null,null,0]
[null,null,null,null,null,null,0,0,null,null,null,null,null,0]
[null,null,null,null,null,null,0,0,null,null,null,null,null,0]
[null,null,null,null,null,null,0,0,null,null,null,null,null,0]
[null,null,null,null,null,null,0,0,null,null,null,null,null,0]
[null,null,null,null,null,null,0,0,null,null,null,null,null,0]
[null,null,null,null,null,null,0,0,null,null,null,null,null,0]
[null,null,null,null,null,null,0,0,null,null,null,null,null,0]
[null,null,null,null,null,null,0,0,null,null,null,null,null,0]
[null,null,null,null,null,null,0,0,null,null,null,null,null,0]
[null,null,null,null,null,null,0,0,null,null,null,null,null,0]
[null,null,null,null,null,null,0,0,null,null,null,null,null,0]
[null,null,null,null,null,null,0,0,null,null,null,null,null,0]
[null,null,null,null,null,null,0,0,null,null,null,null,null,0]
[null,null,null,null,null,null,0,0,null,null,null,null,null,0]
[null,null,null,null,null,null,0,0,null,null,null,null,null,0]
[null,null,null,null,null,null,0,0,null,null,null,null,null,0]
[null,null,null,null,null,null,0,0,null,null,null,{"$f":"IF(SUM(H11:H35)>0,1,0)","v":0},"Print check",0]
[]
["PART 5.H (1)"]
["MISCELLANEOUS SUPPLEMENTARY SHEET"]
[]
[]
["1. All costs not associated with the previous categories must be listed here."]
["2. Miscellaneous charges for work activities included in unit pricing should not be addressed on this form."]
["3. All RAC markups not denoted on other pages must be listed on this form."]
[]
["Costing Category","Description and Quantity of Each Miscellaneous Item","RAC\nInvoice\nNo.","Outside\nInvoice\nNo.","Item's Cost\n ($)","10% Markup Applies \n(Yes/No)","Markup Subtotal\n($)","TOTAL",null,null,null,null,null,"Test"]
[null,null,null,null,null,null,{"$f":"IF(F46=\"Yes\",E46*0.1,0)","v":0},{"$f":"ROUND(IF(E46<>\"\",E46+G46,0),2)","v":0},null,null,null,null,null,{"$f":"IF(H46<>0,IF(OR(E46=\"\",C46=\"\",B46=\"\",A46=\"\"),1,0),0)","v":0}]
[null,null,null,null,null,null,{"$f":"IF(F47=\"Yes\",E47*0.1,0)","v":0},{"$f":"ROUND(IF(E47<>\"\",E47+G47,0),2)","v":0},null,null,null,null,null,{"$f":"IF(H47<>0,IF(OR(E47=\"\",C47=\"\",B47=\"\",A47=\"\"),1,0),0)","v":0}]
[null,null,null,null,null,null,0,0,null,null,null,null,null,0]
[null,null,null,null,null,null,0,0,null,null,null,null,null,0]
[null,null,null,null,null,null,0,0,null,null,null,null,null,0]
[null,null,null,null,null,null,0,0,null,null,null,null,null,0]
[null,null,null,null,null,null,0,0,null,null,null,null,null,0]
[null,null,null,null,null,null,0,0,null,null,null,null,null,0]
[null,null,null,null,null,null,0,0,null,null,null,null,null,0]
[null,null,null,null,null,null,0,0,null,null,null,null,null,0]
[null,null,null,null,null,null,0,0,null,null,null,null,null,0]
[null,null,null,null,null,null,0,0,null,null,null,null,null,0]
[null,null,null,null,null,null,0,0,null,null,null,null,null,0]
[null,null,null,null,null,null,0,0,null,null,null,null,null,0]
[null,null,null,null,null,null,0,0,null,null,null,null,null,0]
[null,null,null,null,null,null,0,0,null,null,null,null,null,0]
[null,null,null,null,null,null,0,0,null,null,null,null,null,0]
[null,null,null,null,null,null,0,0,null,null,null,null,null,0]
[null,null,null,null,null,null,0,0,null,null,null,null,null,0]
[null,null,null,null,null,null,0,0,null,null,null,null,null,0]
[null,null,null,null,null,null,0,0,null,null,null,null,null,0]
[null,null,null,null,null,null,0,0,null,null,null,null,null,0]
[null,null,null,null,null,null,{"$f":"IF(F68=\"Yes\",E68*0.1,0)","v":0},0,null,null,null,null,null,0]
[null,null,null,null,null,null,0,0,null,null,null,null,null,0]
[null,null,null,null,null,null,0,0,null,null,null,null,null,0]
[null,null,null,null,null,null,0,0,null,null,null,{"$f":"IF(SUM(H46:H71)>0,1,0)","v":0},"Print check",0]
[]
["PART 5.H (1)"]
["MISCELLANEOUS SUPPLEMENTARY SHEET"]
[]
[]
["1. All costs not associated with the previous categories must be listed here."]
["2. Miscellaneous charges for work activities included in unit pricing should not be addressed on this form."]
["3. All RAC markups not denoted on other pages must be listed on this form."]
[]
["Costing Category","Description and Quantity of Each Miscellaneous Item","RAC\nInvoice\nNo.","Outside\nInvoice\nNo.","Item's Cost\n ($)","10% Markup Applies \n(Yes/No)","Markup Subtotal\n($)","TOTAL",null,null,null,null,null,"Test"]
[null,null,null,null,null,null,{"$f":"IF(F82=\"Yes\",E82*0.1,0)","v":0},{"$f":"ROUND(IF(E82<>\"\",E82+G82,0),2)","v":0},null,null,null,null,null,{"$f":"IF(H82<>0,IF(OR(E82=\"\",C82=\"\",B82=\"\",A82=\"\"),1,0),0)","v":0}]
[null,null,null,null,null,null,{"$f":"IF(F83=\"Yes\",E83*0.1,0)","v":0},{"$f":"ROUND(IF(E83<>\"\",E83+G83,0),2)","v":0},null,null,null,null,null,{"$f":"IF(H83<>0,IF(OR(E83=\"\",C83=\"\",B83=\"\",A83=\"\"),1,0),0)","v":0}]
[null,null,null,null,null,null,0,0,null,null,null,null,null,0]
[null,null,null,null,null,null,0,0,null,null,null,null,null,0]
[null,null,null,null,null,null,0,0,null,null,null,null,null,0]
[null,null,null,null,null,null,0,0,null,null,null,null,null,0]
[null,null,null,null,null,null,0,0,null,null,null,null,null,0]
[null,null,null,null,null,null,0,0,null,null,null,null,null,0]
[null,null,null,null,null,null,0,0,null,null,null,null,null,0]
[null,null,null,null,null,null,0,0,null,null,null,null,null,0]
[null,null,null,null,null,null,0,0,null,null,null,null,null,0]
[null,null,null,null,null,null,0,0,null,null,null,null,null,0]
[null,null,null,null,null,null,0,0,null,null,null,null,null,0]
[null,null,null,null,null,null,0,0,null,null,null,null,null,0]
[null,null,null,null,null,null,0,0,null,null,null,null,null,0]
[null,null,null,null,null,null,0,0,null,null,null,null,null,0]
[null,null,null,null,null,null,0,0,null,null,null,null,null,0]
[null,null,null,null,null,null,0,0,null,null,null,null,null,0]
[null,null,null,null,null,null,0,0,null,null,null,null,null,0]
[null,null,null,null,null,null,0,0,null,null,null,null,null,0]
[null,null,null,null,null,null,0,0,null,null,null,null,null,0]
[null,null,null,null,null,null,0,0,null,null,null,null,null,0]
[null,null,null,null,null,null,0,0,null,null,null,null,null,0]
[null,null,null,null,null,null,0,0,null,null,null,null,null,0]
[null,null,null,null,null,null,{"$f":"IF(F106=\"Yes\",E106*0.1,0)","v":0},0,null,null,null,null,null,0]
[null,null,null,null,null,null,0,0,null,null,null,{"$f":"IF(SUM(H82:H107)>0,1,0)","v":0},"Print check",0]

{"sheet":"Miscellaneous 2","index":16,"n_rows":122,"n_cols":17,"rows_kept":122,"cut":false,"hidden":false,"merged":[[27,3,27,7],[32,2,32,7],[24,3,24,7],[25,3,25,7],[22,3,23,7],[90,1,90,7],[86,0,86,2],[73,9,76,9],[73,2,73,7],[63,2,64,2],[79,9,80,9],[66,3,66,7],[67,3,67,7],[77,2,77,3],[77,4,77,7],[78,2,78,3],[78,4,78,7],[79,1,79,4],[79,5,79,7],[80,2,80,7],[9,4,10,7],[11,4,11,7],[63,10,64,10],[50,10,51,10],[57,10,58,10],[9,10,10,10],[16,8,17,8],[16,10,17,10],[60,4,60,7],[61,4,61,7],[62,4,62,7],[55,4,55,7],[56,4,56,7],[18,4,18,7],[19,4,19,7],[20,4,20,7],[34,2,34,7],[35,2,35,7],[16,9,17,9],[63,9,68,9],[65,3,65,7],[28,9,31,9],[12,9,13,9],[14,9,15,9],[12,4,12,7],[63,8,64,8],[16,3,17,3],[16,4,17,7],[26,3,26,7],[57,1,58,1],[45,0,45,2],[63,0,64,0],[37,4,37,7],[36,2,36,3],[36,4,36,7],[37,2,37,3],[39,2,39,7],[38,1,38,4],[38,5,38,7],[21,4,21,7],[14,4,14,7],[15,4,15,7],[50,3,51,3],[50,4,51,7],[52,4,52,7],[53,4,53,7],[33,2,33,7],[54,4,54,7],[9,16,10,16],[16,16,17,16],[22,16,23,16],[38,16,39,16],[91,10,92,10],[57,9,58,9],[57,3,58,3],[57,4,58,7],[32,9,35,9],[28,1,28,7],[57,2,58,2],[82,0,82,9],[83,0,83,9],[84,0,84,9],[9,1,10,1],[9,3,10,3],[9,2,10,2],[22,1,23,1],[22,2,23,2],[19,9,21,9],[13,4,13,7],[22,10,23,10],[74,2,74,7],[75,2,75,7],[120,16,121,16],[50,16,51,16],[57,16,58,16],[63,16,64,16],[79,16,80,16],[91,16,92,16],[98,16,99,16],[104,16,105,16],[120,9,121,9],[104,10,105,10],[98,10,99,10],[50,9,52,9],[104,9,109,9],[101,9,103,9],[69,9,72,9],[53,9,54,9],[55,9,56,9],[94,9,95,9],[96,9,97,9],[120,8,121,8],[114,9,117,9],[110,1,110,7],[110,9,113,9],[114,2,114,7],[115,2,115,7],[116,2,116,7],[117,2,117,7],[118,2,118,3],[118,4,118,7],[119,2,119,3],[119,4,119,7],[120,1,120,4],[120,5,120,7],[121,2,121,7],[104,0,105,0],[104,1,105,1],[104,2,105,2],[106,3,106,7],[107,3,107,7],[108,3,108,7],[109,3,109,7],[104,8,105,8],[91,4,92,7],[93,4,93,7],[94,4,94,7],[95,4,95,7],[96,4,96,7],[97,4,97,7],[91,2,92,2],[104,3,105,7],[101,4,101,7],[98,0,99,0],[98,1,99,1],[98,2,99,2],[91,8,92,8],[98,8,99,8],[9,9,11,9],[3,1,3,5],[79,8,80,8],[4,0,4,2],[102,4,102,7],[103,4,103,7],[91,3,92,3],[91,9,93,9],[91,1,92,1],[38,8,39,8],[57,8,58,8],[63,3,64,7],[38,9,39,9],[68,3,68,7],[60,9,62,9],[59,4,59,7],[91,0,92,0],[98,3,99,3],[98,4,99,7],[98,9,99,9],[100,4,100,7],[76,2,76,7],[69,1,69,7],[63,1,64,1],[0,0,0,9],[57,0,58,0],[49,1,49,7],[43,0,43,9],[50,0,51,0],[50,1,51,1],[50,2,51,2],[50,8,51,8],[16,1,17,1],[16,2,17,2],[41,0,41,9],[42,0,42,9],[8,1,8,7],[9,8,10,8],[22,8,23,8],[22,9,27,9],[1,7,1,10],[2,7,2,9],[3,7,3,9],[4,7,4,9],[9,0,10,0],[22,0,23,0],[16,0,17,0],[5,7,5,9]]}
["PART 5.H (2)",null,null,null,null,null,null,null,null,null,null,null,null,null,{"$f":"+O40+O81+O122","v":0},"Total Print check"]
["MISCELLANEOUS SUPPLEMENTARY SHEET",null,null,null,null,null,null,"Costing Category Summary"]
["UNIT PRICING FORM",null,null,null,null,null,null,"Emergency/Initial",null,null,{"$f":"SUMIF(A$10:A$40,H3,K$10:K$40)+SUMIF(A$51:A$81,H3,K$51:K$81)+SUMIF(A$92:A$122,H3,K$92:K$122)","v":0}]
[null,{"$f":"IF(SUM(Q10:Q122)>0,\"MISSING INFORMATION\",\"\")","v":""},null,null,null,null,null,"Investigation",null,null,{"$f":"SUMIF(A$10:A$40,H4,K$10:K$40)+SUMIF(A$51:A$81,H4,K$51:K$81)+SUMIF(A$92:A$122,H4,K$92:K$122)","v":0}]
["Unit pricing for these activities must be utilized.",null,null,null,null,null,null,"Interim Monitoring",null,null,{"$f":"SUMIF(A$10:A$40,H5,K$10:K$40)+SUMIF(A$51:A$81,H5,K$51:K$81)+SUMIF(A$92:A$122,H5,K$92:K$122)","v":0}]
[null,null,null,null,null,null,null,"Corrective Action Plan",null,null,{"$f":"SUMIF(A$10:A$40,H6,K$10:K$40)+SUMIF(A$51:A$81,H6,K$51:K$81)+SUMIF(A$92:A$122,H6,K$92:K$122)","v":0}]
[]
[]
["Costing Category","Unit Price Activities",null,null,null,null,null,null,"RAC\nInvoice\nNo.","Unit Rates","TOTAL",null,null,null,null,null,"Test"]
["Groundwater Sampling","Event Date","1st Well Count","Add. Well Count","Well Numbers \n(separate with comma)"]
[]
[null,null,null,null,null,null,null,null,null,null,{"$f":"ROUND(IF(B12=\"\",0,(C12*Reference!B$176+D12*Reference!C$176)),2)","v":0},null,null,null,null,null,{"$f":"IF(C12>0,IF(OR(A12=\"\",B12=\"\",D12=\"\",E12=\"\",I12=\"\"),1,0),0)","v":0}]
[null,null,null,null,null,null,null,null,null,{"$f":"CONCATENATE(\"$\",Reference!B$176,\".00 - 1st well per sample event\")","v":"$720.00 - 1st well per sample event"},{"$f":"ROUND(IF(B13=\"\",0,(C13*Reference!B$176+D13*Reference!C$176)),2)","v":0},null,null,null,null,null,{"$f":"IF(C13>0,IF(OR(A13=\"\",B13=\"\",D13=\"\",E13=\"\",I13=\"\"),1,0),0)","v":0}]
[null,null,null,null,null,null,null,null,null,null,{"$f":"ROUND(IF(B14=\"\",0,(C14*Reference!B$176+D14*Reference!C$176)),2)","v":0},null,null,null,null,null,0]
[null,null,null,null,null,null,null,null,null,{"$f":"CONCATENATE(\"$\",Reference!C$176,\".00 -  additional wells\")","v":"$224.00 -  additional wells"},{"$f":"ROUND(IF(B15=\"\",0,(C15*Reference!B$176+D15*Reference!C$176)),2)","v":0},null,null,null,null,null,0]
[null,null,null,null,null,null,null,null,null,null,{"$f":"ROUND(IF(B16=\"\",0,(C16*Reference!B$176+D16*Reference!C$176)),2)","v":0},null,null,null,null,null,0]
["Free Product Recovery","Event Date","1st Well Count","Add. Well Count","Well Numbers \n(separate with comma)",null,null,null,null,{"$f":"CONCATENATE(\"$\",Reference!B$177,\".00 - 1st well per event\")","v":"$218.00 - 1st well per event"}]
[]
[null,null,null,null,null,null,null,null,null,{"$f":"CONCATENATE(\"$\",Reference!C$177,\".00 - additional wells\")","v":"$72.00 - additional wells"},{"$f":"ROUND(IF(B19=\"\",0,(C19*Reference!B$177+D19*Reference!C$177)),2)","v":0},null,null,null,null,null,{"$f":"IF(C19>0,IF(OR(A19=\"\",B19=\"\",D19=\"\",E19=\"\",I19=\"\"),1,0),0)","v":0}]
[null,null,null,null,null,null,null,null,null,{"$f":"CONCATENATE(\"The $\",Reference!C$177,\".00 rate applies to all wells handbailed on the same date as sampled.\")","v":"The $72.00 rate applies to all wells handbailed on the same date as sampled."},{"$f":"ROUND(IF(B20=\"\",0,(C20*Reference!B$177+D20*Reference!C$177)),2)","v":0},null,null,null,null,null,0]
[null,null,null,null,null,null,null,null,null,null,{"$f":"ROUND(IF(B21=\"\",0,(C21*Reference!B$177+D21*Reference!C$177)),2)","v":0},null,null,null,null,null,0]
[null,null,null,null,null,null,null,null,null,null,{"$f":"ROUND(IF(B22=\"\",0,(C22*Reference!B$177+D22*Reference!C$177)),2)","v":0},null,null,null,null,null,0]
["Gauging Wells","Event Date","No. of Wells","Well Numbers \n(separate with comma)",null,null,null,null,null,{"$f":"CONCATENATE(\"$\",Reference!B$178,\".00 per well\")","v":"$28.00 per well"}]
[]
[null,null,null,null,null,null,null,null,null,null,{"$f":"ROUND((C25*Reference!B$178),2)","v":0},null,null,null,null,null,{"$f":"IF(C25>0,IF(OR(A25=\"\",B25=\"\",D25=\"\",I25=\"\"),1,0),0)","v":0}]
[null,null,null,null,null,null,null,null,null,null,{"$f":"ROUND((C26*Reference!B$178),2)","v":0},null,null,null,null,null,{"$f":"IF(C26>0,IF(OR(A26=\"\",B26=\"\",D26=\"\",I26=\"\"),1,0),0)","v":0}]
[null,null,null,null,null,null,null,null,null,null,{"$f":"ROUND((C27*Reference!B$178),2)","v":0},null,null,null,null,null,{"$f":"IF(C27>0,IF(OR(A27=\"\",B27=\"\",D27=\"\",I27=\"\"),1,0),0)","v":0}]
[null,null,null,null,null,null,null,null,null,null,{"$f":"ROUND((C28*Reference!B$178),2)","v":0},null,null,null,null,null,{"$f":"IF(C28>0,IF(OR(A28=\"\",B28=\"\",D28=\"\",I28=\"\"),1,0),0)","v":0}]
["Discharge Sampling Events","Event Dates \n(When additional sampling events are being requested due to an exceedance, a copy of the analytical result documenting the exceedance must be provided.)",null,null,null,null,null,null,null,{"$f":"CONCATENATE(\"$\",Reference!B$179,\".00 per event\")","v":"$289.00 per event"}]
[null,null,null,null,null,null,null,null,null,null,{"$f":"ROUND((COUNTA(B30:H30)*Reference!B$179),2)","v":0},null,null,null,null,null,{"$f":"IF(AND(K30>0,OR(I30=\"\",A30=\"\")),1,0)","v":0}]
[null,null,null,null,null,null,null,null,null,null,{"$f":"ROUND((COUNTA(B31:H31)*Reference!B$179),2)","v":0},null,null,null,null,null,{"$f":"IF(AND(K31>0,OR(I31=\"\",A31=\"\")),1,0)","v":0}]
[null,null,null,null,null,null,null,null,null,null,{"$f":"ROUND((COUNTA(B32:H32)*Reference!B$179),2)","v":0},null,null,null,null,null,0]
["Mob/Demob ","Event Date","Event Type (Drilling, Direct Push, P&A, etc.)",null,null,null,null,null,null,{"$f":"CONCATENATE(\"$\",Reference!B$180,\".00 once per event\")","v":"$352.00 once per event"}]
[null,null,null,null,null,null,null,null,null,null,{"$f":"ROUND((COUNTA(B34)*Reference!B$180),2)","v":0},null,null,null,null,null,{"$f":"IF(B34<>\"\",IF(OR(A34=\"\",C34=\"\",I34=\"\"),1,0),0)","v":0}]
[null,null,null,null,null,null,null,null,null,null,{"$f":"ROUND((COUNTA(B35)*Reference!B$180),2)","v":0},null,null,null,null,null,{"$f":"IF(B35<>\"\",IF(OR(A35=\"\",C35=\"\",I35=\"\"),1,0),0)","v":0}]
[null,null,null,null,null,null,null,null,null,null,{"$f":"ROUND((COUNTA(B36)*Reference!B$180),2)","v":0},null,null,null,null,null,0]
["Aquifer Testing","Event Date","Number of wells",null,"Unit Rates"]
[null,null,null,null,"$1,375.00 - 1st well; \n$385.00 - each additional well",null,null,null,null,null,{"$f":"ROUND(IF(AND(B38>0,C38=1),Reference!B$172,IF(AND(B38>0,C38>1),Reference!B$172+(C38-1)*Reference!B$173,0)),2)","v":0},null,null,null,null,null,{"$f":"IF(B38<>\"\",IF(OR(A38=\"\",C38=\"\", I38=\"\"),1,0),0)","v":0}]
["Obtaining Offsite Access","Number of Properties Accessed",null,null,null,null,null,null,null,{"$f":"CONCATENATE(\"$\",Reference!B$181,\".00 per property\")","v":"$505.00 per property"},null,null,null,null,null,null,{"$f":"IF(F39>0,IF(OR(A40=\"\",C40=\"\",I39=\"\"),1,0),0)","v":0}]
[null,"Description",null,null,null,null,null,null,null,null,{"$f":"F39*Reference!B$181","v":0},null,null,null,{"$f":"IF(SUM(K10:K40)>0,1,0)","v":0},"Print check"]
[]
["PART 5.H (2)"]
["MISCELLANEOUS SUPPLEMENTARY SHEET"]
["UNIT PRICING FORM"]
[]
["Unit pricing for these activities must be utilized."]
[]
[]
[]
["Costing Category","Unit Price Activities",null,null,null,null,null,null,"RAC\nInvoice\nNo.","Unit Rates","TOTAL",null,null,null,null,null,"Test"]
["Groundwater Sampling","Event Date","1st Well Count","Add. Well Count","Well Numbers \n(separate with comma)"]
[]
[null,null,null,null,null,null,null,null,null,null,{"$f":"ROUND(IF(B53=\"\",0,(C53*Reference!B$176+D53*Reference!C$176)),2)","v":0},null,null,null,null,null,{"$f":"IF(C53>0,IF(OR(A53=\"\",B53=\"\",D53=\"\",E53=\"\",I53=\"\"),1,0),0)","v":0}]
[null,null,null,null,null,null,null,null,null,{"$f":"CONCATENATE(\"$\",Reference!B$176,\".00 - 1st well per sample event\")","v":"$720.00 - 1st well per sample event"},{"$f":"ROUND(IF(B54=\"\",0,(C54*Reference!B$176+D54*Reference!C$176)),2)","v":0},null,null,null,null,null,{"$f":"IF(C54>0,IF(OR(A54=\"\",B54=\"\",D54=\"\",E54=\"\",I54=\"\"),1,0),0)","v":0}]
[null,null,null,null,null,null,null,null,null,null,{"$f":"ROUND(IF(B55=\"\",0,(C55*Reference!B$176+D55*Reference!C$176)),2)","v":0},null,null,null,null,null,0]
[null,null,null,null,null,null,null,null,null,{"$f":"CONCATENATE(\"$\",Reference!C$176,\".00 - additional wells\")","v":"$224.00 - additional wells"},{"$f":"ROUND(IF(B56=\"\",0,(C56*Reference!B$176+D56*Reference!C$176)),2)","v":0},null,null,null,null,null,0]
[null,null,null,null,null,null,null,null,null,null,{"$f":"ROUND(IF(B57=\"\",0,(C57*Reference!B$176+D57*Reference!C$176)),2)","v":0},null,null,null,null,null,0]
["Free Product Recovery","Event Date","1st Well Count","Add. Well Count","Well Numbers \n(separate with comma)",null,null,null,null,{"$f":"CONCATENATE(\"$\",Reference!B$177,\".00 - 1st well per event\")","v":"$218.00 - 1st well per event"}]
[]
[null,null,null,null,null,null,null,null,null,{"$f":"CONCATENATE(\"$\",Reference!C$177,\".00 - additional wells\")","v":"$72.00 - additional wells"},{"$f":"ROUND(IF(B60=\"\",0,(C60*Reference!B$177+D60*Reference!C$177)),2)","v":0},null,null,null,null,null,{"$f":"IF(C60>0,IF(OR(A60=\"\",B60=\"\",D60=\"\",E60=\"\",I60=\"\"),1,0),0)","v":0}]
[null,null,null,null,null,null,null,null,null,{"$f":"CONCATENATE(\"The $\",Reference!C$177,\".00 rate applies to all wells handbailed on the same date as sampled.\")","v":"The $72.00 rate applies to all wells handbailed on the same date as sampled."},{"$f":"ROUND(IF(B61=\"\",0,(C61*Reference!B$177+D61*Reference!C$177)),2)","v":0},null,null,null,null,null,0]
[null,null,null,null,null,null,null,null,null,null,{"$f":"ROUND(IF(B62=\"\",0,(C62*Reference!B$177+D62*Reference!C$177)),2)","v":0},null,null,null,null,null,0]
[null,null,null,null,null,null,null,null,null,null,{"$f":"ROUND(IF(B63=\"\",0,(C63*Reference!B$177+D63*Reference!C$177)),2)","v":0},null,null,null,null,null,0]
["Gauging Wells","Event Date","No. of Wells","Well Numbers \n(separate with comma)",null,null,null,null,null,{"$f":"CONCATENATE(\"$\",Reference!B$178,\".00 per well\")","v":"$28.00 per well"}]
[]
[null,null,null,null,null,null,null,null,null,null,{"$f":"ROUND((C66*Reference!B$178),2)","v":0},null,null,null,null,null,{"$f":"IF(C66>0,IF(OR(A66=\"\",B66=\"\",D66=\"\",I66=\"\"),1,0),0)","v":0}]
[null,null,null,null,null,null,null,null,null,null,{"$f":"ROUND((C67*Reference!B$178),2)","v":0},null,null,null,null,null,{"$f":"IF(C67>0,IF(OR(A67=\"\",B67=\"\",D67=\"\",I67=\"\"),1,0),0)","v":0}]
[null,null,null,null,null,null,null,null,null,null,{"$f":"ROUND((C68*Reference!B$178),2)","v":0},null,null,null,null,null,{"$f":"IF(C68>0,IF(OR(A68=\"\",B68=\"\",D68=\"\",I68=\"\"),1,0),0)","v":0}]
[null,null,null,null,null,null,null,null,null,null,{"$f":"ROUND((C69*Reference!B$178),2)","v":0},null,null,null,null,null,{"$f":"IF(C69>0,IF(OR(A69=\"\",B69=\"\",D69=\"\",I69=\"\"),1,0),0)","v":0}]
["Discharge Sampling Events","Event Dates \n(When additional sampling events are being requested due to an exceedance, a copy of the analytical result documenting the exceedance must be provided.)",null,null,null,null,null,null,null,{"$f":"CONCATENATE(\"$\",Reference!B$179,\".00 per event\")","v":"$289.00 per event"}]
[null,null,null,null,null,null,null,null,null,null,{"$f":"ROUND((COUNTA(B71:H71)*Reference!B$179),2)","v":0},null,null,null,null,null,{"$f":"IF(AND(K71>0,OR(I71=\"\",A71=\"\")),1,0)","v":0}]
[null,null,null,null,null,null,null,null,null,null,{"$f":"ROUND((COUNTA(B72:H72)*Reference!B$179),2)","v":0},null,null,null,null,null,{"$f":"IF(AND(K72>0,OR(I72=\"\",A72=\"\")),1,0)","v":0}]
[null,null,null,null,null,null,null,null,null,null,{"$f":"ROUND((COUNTA(B73:H73)*Reference!B$179),2)","v":0},null,null,null,null,null,0]
["Mob/Demob ","Event Date"," Event Type (Drilling, Direct Push, P&A, etc.)",null,null,null,null,null,null,{"$f":"CONCATENATE(\"$\",Reference!B$180,\".00 once per event\")","v":"$352.00 once per event"}]
[null,null,null,null,null,null,null,null,null,null,{"$f":"ROUND((COUNTA(B75)*Reference!B$180),2)","v":0},null,null,null,null,null,{"$f":"IF(B75<>\"\",IF(OR(A75=\"\",C75=\"\",I75=\"\"),1,0),0)","v":0}]
[null,null,null,null,null,null,null,null,null,null,{"$f":"ROUND((COUNTA(B76)*Reference!B$180),2)","v":0},null,null,null,null,null,{"$f":"IF(B76<>\"\",IF(OR(A76=\"\",C76=\"\",I76=\"\"),1,0),0)","v":0}]
[null,null,null,null,null,null,null,null,null,null,{"$f":"ROUND((COUNTA(B77)*Reference!B$180),2)","v":0},null,null,null,null,null,0]
["Aquifer Testing","Event Date","Number of wells",null,"Unit Rates"]
[null,null,null,null,"$1,250.00 - 1st well; \n$350.00 - each additional well",null,null,null,null,null,{"$f":"ROUND(IF(AND(B79>0,C79=1),Reference!B$172,IF(AND(B79>0,C79>1),Reference!B$172+(C79-1)*Reference!B$173,0)),2)","v":0},null,null,null,null,null,{"$f":"IF(B79<>\"\",IF(OR(A79=\"\",C79=\"\", I79=\"\"),1,0),0)","v":0}]
["Obtaining Offsite Access","Number of Properties Accessed",null,null,null,null,null,null,null,{"$f":"CONCATENATE(\"$\",Reference!B$181,\".00 per property\")","v":"$505.00 per property"},null,null,null,null,null,null,{"$f":"IF(F80>0,IF(OR(A81=\"\",C81=\"\",I80=\"\"),1,0),0)","v":0}]
[null,"Description",null,null,null,null,null,null,null,null,{"$f":"F80*Reference!B$181","v":0},null,null,null,{"$f":"IF(SUM(K51:K81)>0,1,0)","v":0},"Print check"]
[]
["PART 5.H (2)"]
["MISCELLANEOUS SUPPLEMENTARY SHEET"]
["UNIT PRICING FORM"]
[]
["Unit pricing for these activities must be utilized."]
[]
[]
[]
["Costing Category","Unit Price Activities",null,null,null,null,null,null,"RAC\nInvoice\nNo.","Unit Rates","TOTAL",null,null,null,null,null,"Test"]
["Groundwater Sampling","Event Date","1st Well Count","Add. Well Count","Well Numbers \n(separate with comma)"]
[]
[null,null,null,null,null,null,null,null,null,null,{"$f":"ROUND(IF(B94=\"\",0,(C94*Reference!B$176+D94*Reference!C$176)),2)","v":0},null,null,null,null,null,{"$f":"IF(C94>0,IF(OR(A94=\"\",B94=\"\",D94=\"\",E94=\"\",I94=\"\"),1,0),0)","v":0}]
[null,null,null,null,null,null,null,null,null,{"$f":"CONCATENATE(\"$\",Reference!B$176,\".00 - 1st well per sample event\")","v":"$720.00 - 1st well per sample event"},{"$f":"ROUND(IF(B95=\"\",0,(C95*Reference!B$176+D95*Reference!C$176)),2)","v":0},null,null,null,null,null,{"$f":"IF(C95>0,IF(OR(A95=\"\",B95=\"\",D95=\"\",E95=\"\",I95=\"\"),1,0),0)","v":0}]
[null,null,null,null,null,null,null,null,null,null,{"$f":"ROUND(IF(B96=\"\",0,(C96*Reference!B$176+D96*Reference!C$176)),2)","v":0},null,null,null,null,null,0]
[null,null,null,null,null,null,null,null,null,{"$f":"CONCATENATE(\"$\",Reference!C$176,\".00 - additional wells\")","v":"$224.00 - additional wells"},{"$f":"ROUND(IF(B97=\"\",0,(C97*Reference!B$176+D97*Reference!C$176)),2)","v":0},null,null,null,null,null,0]
[null,null,null,null,null,null,null,null,null,null,{"$f":"ROUND(IF(B98=\"\",0,(C98*Reference!B$176+D98*Reference!C$176)),2)","v":0},null,null,null,null,null,0]
["Free Product Recovery","Event Date","1st Well Count","Add. Well Count","Well Numbers \n(separate with comma)",null,null,null,null,{"$f":"CONCATENATE(\"$\",Reference!B$177,\".00 - 1st well per event\")","v":"$218.00 - 1st well per event"}]
[]
[null,null,null,null,null,null,null,null,null,{"$f":"CONCATENATE(\"$\",Reference!C$177,\".00 - additional wells\")","v":"$72.00 - additional wells"},{"$f":"ROUND(IF(B101=\"\",0,(C101*Reference!B$177+D101*Reference!C$177)),2)","v":0},null,null,null,null,null,{"$f":"IF(C101>0,IF(OR(A101=\"\",B101=\"\",D101=\"\",E101=\"\",I101=\"\"),1,0),0)","v":0}]
[null,null,null,null,null,null,null,null,null,{"$f":"CONCATENATE(\"The $\",Reference!C$177,\".00 rate applies to all wells handbailed on the same date as sampled.\")","v":"The $72.00 rate applies to all wells handbailed on the same date as sampled."},{"$f":"ROUND(IF(B102=\"\",0,(C102*Reference!B$177+D102*Reference!C$177)),2)","v":0},null,null,null,null,null,0]
[null,null,null,null,null,null,null,null,null,null,{"$f":"ROUND(IF(B103=\"\",0,(C103*Reference!B$177+D103*Reference!C$177)),2)","v":0},null,null,null,null,null,0]
[null,null,null,null,null,null,null,null,null,null,{"$f":"ROUND(IF(B104=\"\",0,(C104*Reference!B$177+D104*Reference!C$177)),2)","v":0},null,null,null,null,null,0]
["Gauging Wells","Event Date","No. of Wells","Well Numbers \n(separate with comma)",null,null,null,null,null,{"$f":"CONCATENATE(\"$\",Reference!B$178,\".00 per well\")","v":"$28.00 per well"}]
[]
[null,null,null,null,null,null,null,null,null,null,{"$f":"ROUND((C107*Reference!B$178),2)","v":0},null,null,null,null,null,{"$f":"IF(C107>0,IF(OR(A107=\"\",B107=\"\",D107=\"\",I107=\"\"),1,0),0)","v":0}]
[null,null,null,null,null,null,null,null,null,null,{"$f":"ROUND((C108*Reference!B$178),2)","v":0},null,null,null,null,null,{"$f":"IF(C108>0,IF(OR(A108=\"\",B108=\"\",D108=\"\",I108=\"\"),1,0),0)","v":0}]
[null,null,null,null,null,null,null,null,null,null,{"$f":"ROUND((C109*Reference!B$178),2)","v":0},null,null,null,null,null,{"$f":"IF(C109>0,IF(OR(A109=\"\",B109=\"\",D109=\"\",I109=\"\"),1,0),0)","v":0}]
[null,null,null,null,null,null,null,null,null,null,{"$f":"ROUND((C110*Reference!B$178),2)","v":0},null,null,null,null,null,{"$f":"IF(C110>0,IF(OR(A110=\"\",B110=\"\",D110=\"\",I110=\"\"),1,0),0)","v":0}]
["Discharge Sampling Events","Event Dates \n(When additional sampling events are being requested due to an exceedance, a copy of the analytical result documenting the exceedance must be provided.)",null,null,null,null,null,null,null,{"$f":"CONCATENATE(\"$\",Reference!B$179,\".00 per event\")","v":"$289.00 per event"}]
[null,null,null,null,null,null,null,null,null,null,{"$f":"ROUND((COUNTA(B112:H112)*Reference!B$179),2)","v":0},null,null,null,null,null,{"$f":"IF(AND(K112>0,OR(I112=\"\",A112=\"\")),1,0)","v":0}]
[null,null,null,null,null,null,null,null,null,null,{"$f":"ROUND((COUNTA(B113:H113)*Reference!B$179),2)","v":0},null,null,null,null,null,{"$f":"IF(AND(K113>0,OR(I113=\"\",A113=\"\")),1,0)","v":0}]
[null,null,null,null,null,null,null,null,null,null,{"$f":"ROUND((COUNTA(B114:H114)*Reference!B$179),2)","v":0},null,null,null,null,null,0]
["Mob/Demob ","Event Date"," Event Type (Drilling, Direct Push, P&A, etc.)",null,null,null,null,null,null,{"$f":"CONCATENATE(\"$\",Reference!B$180,\".00 once per event\")","v":"$352.00 once per event"}]
[null,null,null,null,null,null,null,null,null,null,{"$f":"ROUND((COUNTA(B116)*Reference!B$180),2)","v":0},null,null,null,null,null,{"$f":"IF(B116<>\"\",IF(OR(A116=\"\",C116=\"\",I116=\"\"),1,0),0)","v":0}]
[null,null,null,null,null,null,null,null,null,null,{"$f":"ROUND((COUNTA(B117)*Reference!B$180),2)","v":0},null,null,null,null,null,{"$f":"IF(B117<>\"\",IF(OR(A117=\"\",C117=\"\",I117=\"\"),1,0),0)","v":0}]
[null,null,null,null,null,null,null,null,null,null,{"$f":"ROUND((COUNTA(B118)*Reference!B$180),2)","v":0},null,null,null,null,null,0]
["Aquifer Testing","Event Date","Number of wells",null,"Unit Rates"]
[null,null,null,null,"$1,250.00 - 1st well; \n$350.00 - each additional well",null,null,null,null,null,{"$f":"ROUND(IF(AND(B120>0,C120=1),Reference!B$172,IF(AND(B120>0,C120>1),Reference!B$172+(C120-1)*Reference!B$173,0)),2)","v":0},null,null,null,null,null,{"$f":"IF(B120<>\"\",IF(OR(A120=\"\",C120=\"\", I120=\"\"),1,0),0)","v":0}]
["Obtaining Offsite Access","Number of Properties Accessed",null,null,null,null,null,null,null,{"$f":"CONCATENATE(\"$\",Reference!B$181,\".00 per property\")","v":"$505.00 per property"},null,null,null,null,null,null,{"$f":"IF(F121>0,IF(OR(A122=\"\",C122=\"\",I121=\"\"),1,0),0)","v":0}]
[null,"Description",null,null,null,null,null,null,null,null,{"$f":"F121*Reference!B$181","v":0},null,null,null,{"$f":"IF(SUM(K92:K122)>0,1,0)","v":0},"Print check"]

{"sheet":"Miscellaneous 3","index":17,"n_rows":142,"n_cols":17,"rows_kept":142,"cut":false,"hidden":false,"merged":[[41,16,42,16],[43,5,43,6],[44,5,44,6],[45,5,45,6],[46,6,46,7],[47,6,47,7],[70,10,71,10],[70,16,71,16],[75,16,76,16],[68,2,68,5],[43,1,43,4],[47,1,47,5],[46,1,46,5],[38,9,42,9],[43,9,47,9],[38,1,39,4],[38,5,39,7],[41,10,42,10],[40,2,40,4],[40,5,40,7],[70,7,74,7],[70,6,71,6],[72,9,73,9],[62,9,63,9],[111,8,113,8],[5,0,5,1],[1,7,1,9],[2,7,2,9],[3,7,3,9],[4,7,4,9],[5,7,5,9],[70,8,71,8],[75,1,76,2],[85,8,86,8],[80,1,80,2],[102,9,106,9],[28,1,29,2],[23,8,24,8],[30,1,30,2],[7,1,7,7],[57,1,57,4],[57,5,57,7],[58,1,58,4],[58,5,58,7],[56,5,56,7],[0,7,0,10],[53,0,53,2],[4,0,4,2],[38,0,39,0],[13,9,14,9],[16,2,16,4],[16,5,16,6],[15,9,16,9],[17,9,22,9],[17,8,19,8],[9,1,9,4],[10,1,10,4],[11,1,11,4],[8,9,12,9],[13,0,13,7],[28,0,29,0],[31,1,31,2],[45,1,45,4],[23,1,24,1],[17,6,19,6],[17,7,19,7],[23,2,24,5],[23,0,24,0],[23,6,24,6],[17,16,19,16],[23,16,24,16],[28,16,29,16],[38,16,39,16],[64,16,66,16],[25,2,25,5],[26,2,26,5],[27,2,27,5],[34,4,34,7],[35,4,35,7],[36,1,36,2],[37,1,37,2],[36,3,36,7],[37,3,37,7],[20,2,20,5],[21,2,21,5],[22,2,22,5],[64,1,66,1],[64,2,66,5],[64,6,66,6],[59,1,59,4],[32,1,32,2],[44,1,44,4],[62,0,62,7],[132,16,133,16],[122,1,123,2],[122,4,123,7],[132,10,133,10],[102,1,102,4],[122,10,123,10],[108,1,108,6],[103,5,103,7],[104,1,104,4],[111,9,116,9],[111,7,113,7],[111,6,113,6],[114,2,114,5],[117,9,118,9],[107,9,108,9],[109,9,110,9],[115,2,115,5],[116,2,116,5],[122,16,123,16],[122,8,123,8],[122,9,127,9],[130,9,131,9],[132,8,133,8],[128,9,129,9],[124,1,124,2],[125,1,125,2],[126,1,126,2],[127,1,127,2],[132,9,136,9],[134,5,134,7],[134,2,134,4],[23,10,24,10],[25,9,26,9],[100,0,100,2],[105,5,105,7],[106,1,106,4],[106,5,106,7],[60,0,60,7],[23,7,27,7],[103,1,103,4],[41,0,42,0],[41,8,42,8],[41,2,42,4],[70,9,71,9],[84,3,84,7],[75,8,76,8],[75,9,80,9],[109,0,109,7],[28,3,29,3],[28,8,29,8],[41,1,42,1],[64,9,69,9],[67,2,67,5],[38,10,39,10],[55,9,59,9],[56,1,56,4],[8,1,8,4],[8,5,8,7],[9,5,9,7],[34,9,35,9],[36,9,37,9],[23,9,24,9],[10,5,10,7],[11,5,11,7],[12,5,12,7],[12,1,12,4],[15,0,15,7],[14,1,14,6],[17,0,19,0],[17,1,19,1],[28,4,29,7],[17,2,19,5],[75,10,76,10],[119,2,119,5],[120,2,120,5],[121,2,121,5],[75,3,76,3],[85,9,89,9],[119,9,120,9],[117,8,118,8],[28,10,29,10],[38,8,39,8],[60,9,61,9],[64,7,66,7],[59,5,59,7],[54,1,54,7],[55,1,55,4],[55,5,55,7],[63,2,63,4],[63,5,63,6],[34,1,34,2],[35,1,35,2],[64,8,66,8],[61,1,61,6],[33,1,33,2],[28,9,33,9],[85,16,86,16],[85,10,86,10],[81,4,81,7],[82,1,82,2],[82,4,82,7],[83,9,84,9],[117,10,118,10],[88,8,89,8],[88,10,89,10],[88,16,89,16],[90,9,94,9],[85,1,86,4],[85,5,86,7],[83,1,83,2],[83,3,83,7],[102,5,102,7],[117,2,118,5],[117,6,118,6],[111,1,113,1],[111,2,113,5],[84,1,84,2],[117,16,118,16],[81,9,82,9],[111,16,113,16],[132,0,133,0],[128,1,128,2],[128,4,128,7],[129,1,129,2],[129,4,129,7],[130,1,130,2],[130,3,130,7],[131,1,131,2],[131,3,131,7],[132,1,133,4],[132,5,133,7],[122,0,123,0],[110,2,110,4],[110,5,110,6],[111,0,113,0],[85,0,86,0],[91,1,91,4],[91,5,91,6],[92,1,92,4],[92,5,92,6],[93,1,93,5],[93,6,93,7],[117,0,118,0],[94,1,94,5],[94,6,94,7],[117,7,121,7],[117,1,118,1],[101,1,101,7],[104,5,104,7],[105,1,105,4],[87,2,87,4],[87,5,87,7],[122,3,123,3],[107,0,107,7],[64,0,66,0],[75,0,76,0],[78,1,78,2],[79,1,79,2],[88,0,89,0],[88,1,89,1],[88,2,89,4],[90,1,90,4],[90,5,90,6],[70,0,71,0],[70,1,71,1],[70,2,71,5],[69,2,69,5],[74,2,74,5],[72,2,72,5],[73,2,73,5],[81,1,81,2],[77,1,77,2],[75,4,76,7],[135,0,136,0],[135,1,136,1],[135,2,136,4],[135,8,136,8],[135,10,136,10],[135,16,136,16],[137,1,137,4],[137,5,137,6],[137,9,141,9],[138,1,138,4],[138,5,138,6],[139,1,139,4],[139,5,139,6],[140,1,140,5],[140,6,140,7],[141,1,141,5],[141,6,141,7]]}
["PART 5.H(3)",null,null,null,null,null,null,"Costing Category Summary",null,null,null,null,null,null,{"$f":"+O48+O95+O142","v":0},"Total Print check"]
["MISCELLANEOUS SUPPLEMENTARY SHEET",null,null,null,null,null,null,"Emergency/Initial",null,null,{"$f":"SUMIF(A$10:A$48,H2,K$10:K$48)+SUMIF(A$57:A$92,H2,K$57:K$92)+SUMIF(A$104:A$139,H2,K$104:K$139)","v":0}]
["UNIT PRICING FORM",null,null,null,null,null,null,"Investigation",null,null,{"$f":"SUMIF(A$10:A$48,H3,K$10:K$48)+SUMIF(A$57:A$92,H3,K$57:K$92)+SUMIF(A$104:A$139,H3,K$104:K$139)","v":0}]
[null,null,null,null,null,null,null,"Interim Monitoring",null,null,{"$f":"SUMIF(A$10:A$48,H4,K$10:K$48)+SUMIF(A$57:A$92,H4,K$57:K$92)+SUMIF(A$104:A$139,H4,K$104:K$139)","v":0}]
["Unit pricing for these activities must be utilized.",null,null,null,null,null,null,"Corrective Action Plan",null,null,{"$f":"SUMIF(A$10:A$48,H5,K$10:K$48)+SUMIF(A$57:A$92,H5,K$57:K$92)+SUMIF(A$104:A$139,H5,K$104:K$139)","v":0}]
["* - Cost Control Guidance Document",null,null,{"$f":"IF(SUM(Q10:Q142)>0,\"MISSING INFORMATION\",\"\")","v":""},null,null,null,"Report Preparation",null,null,{"$f":"SUMIF(A$10:A$48,H6,K$10:K$48)+SUMIF(A$57:A$92,H6,K$57:K$92)+SUMIF(A$104:A$139,H6,K$104:K$139)","v":0}]
[]
["Costing Category","Unit Price Activities",null,null,null,null,null,null,"RAC\nInvoice No.","Unit Rates","TOTAL",null,null,null,null,null,"Test"]
["Bid Package Preparation","Bid Package Description",null,null,null,"Work Value",null,null,null,"See page 49 of the 2025 CCGD* for rate descriptions\n\nProvide Bid Summary with RAC Invoice."]
[null,null,null,null,null,null,null,null,null,null,{"$f":"ROUND(IF(B10>0,IF(B10=Reference!$A$186,INDEX(Reference!$B$186:$D$190,MATCH(B10,Reference!$A$186:$A$190,0),MATCH(F10,Reference!$B$185:$D$185,0)),VLOOKUP(B10,Reference!$A$187:$B$190,2,FALSE)),0),2)","v":0},null,null,null,null,null,{"$f":"IF(B10<>\"\",IF(OR(A10=\"\",I10=\"\"),1,0),0)","v":0}]
[null,null,null,null,null,null,null,null,null,null,{"$f":"ROUND(IF(B11>0,IF(B11=Reference!$A$186,INDEX(Reference!$B$186:$D$190,MATCH(B11,Reference!$A$186:$A$190,0),MATCH(F11,Reference!$B$185:$D$185,0)),VLOOKUP(B11,Reference!$A$187:$B$190,2,FALSE)),0),2)","v":0},null,null,null,null,null,{"$f":"IF(B11<>\"\",IF(OR(A11=\"\",I11=\"\"),1,0),0)","v":0}]
[null,null,null,null,null,null,null,null,null,null,{"$f":"ROUND(IF(B12>0,IF(B12=Reference!$A$186,INDEX(Reference!$B$186:$D$190,MATCH(B12,Reference!$A$186:$A$190,0),MATCH(F12,Reference!$B$185:$D$185,0)),VLOOKUP(B12,Reference!$A$187:$B$190,2,FALSE)),0),2)","v":0},null,null,null,null,null,{"$f":"IF(B12<>\"\",IF(OR(A12=\"\",I12=\"\"),1,0),0)","v":0}]
[null,null,null,null,null,null,null,null,null,null,{"$f":"ROUND(IF(B13>0,IF(B13=Reference!$A$186,INDEX(Reference!$B$186:$D$190,MATCH(B13,Reference!$A$186:$A$190,0),MATCH(F13,Reference!$B$185:$D$185,0)),VLOOKUP(B13,Reference!$A$187:$B$190,2,FALSE)),0),2)","v":0},null,null,null,null,null,{"$f":"IF(B13<>\"\",IF(OR(A13=\"\",I13=\"\"),1,0),0)","v":0}]
["Treatment System Design/Engineering/Planning and Treatment System Installation Design/ Engineering/Planning",null,null,null,null,null,null,null,null,{"$f":"CONCATENATE(\"$\",Reference!B$214,\".00 per activity\")","v":"$5766.00 per activity"}]
[null,"System/installation RFP documents included with this application",null,null,null,null,null,null,null,null,{"$f":"ROUND(IF(H15=\"Yes\",VLOOKUP(\"System Design and Planning\",Reference!A$214:B$218,2),0),2)","v":0},null,null,null,null,null,{"$f":"IF(H15<>\"\",IF(OR(I15=\"\",A15=\"\"),1,0),0)","v":0}]
["Permit Application Development and Submittal (select from lists)",null,null,null,null,null,null,null,null,"See page 67 of the 2025 CCGD* for rate descriptions"]
[null,"Air Permit",null,null,null,"Water Permit",null,null,null,null,{"$f":"SUM(IF(C17>0,VLOOKUP(C17,Reference!A$193:$B$195,2,FALSE),0)+IF(H17>0,VLOOKUP(H17,Reference!$A$193:$B$195,2,FALSE),0))","v":0},null,null,null,null,null,{"$f":"IF(K16>0,IF(OR(I17=\"\",A17=\"\"),1,0),0)","v":0}]
["Groundwater Monitoring Reports","Report Type","Report Period",null,null,null,"Treatment System (Yes/No)","Initial or \nSubsequent",null,"See pages 56-57 of the 2025 CCGD* for rate descriptions"]
[]
[]
[null,null,null,null,null,null,null,null,null,null,{"$f":"IF(B21=\"\",0,VLOOKUP(CONCATENATE(B21,G21,H21),Reference!D$199:E$210,2,FALSE))","v":0},null,null,null,null,null,{"$f":"IF(B21<>\"\",IF(OR(A21=\"\",C21=\"\",G21=\"\",H21=\"\",I21=\"\"),1,0),0)","v":0}]
[null,null,null,null,null,null,null,null,null,null,{"$f":"IF(B22=\"\",0,VLOOKUP(CONCATENATE(B22,G22,H22),Reference!D$199:E$210,2,FALSE))","v":0},null,null,null,null,null,{"$f":"IF(B22<>\"\",IF(OR(A22=\"\",C22=\"\",G22=\"\",H22=\"\",I22=\"\"),1,0),0)","v":0}]
[null,null,null,null,null,null,null,null,null,null,{"$f":"IF(B23=\"\",0,VLOOKUP(CONCATENATE(B23,G23,H23),Reference!D$199:E$210,2,FALSE))","v":0},null,null,null,null,null,{"$f":"IF(B23<>\"\",IF(OR(A23=\"\",C23=\"\",G23=\"\",H23=\"\",I23=\"\"),1,0),0)","v":0}]
["Discharge Monitoring Report","Permit No.","Report Period",null,null,null,"Discharge (Yes/No)","Include State or Municipal/\nParish Quarterly  Reports",null,{"$f":"CONCATENATE(\"$\",Reference!B$302,\".00 per report\")","v":"$275.00 per report"}]
[]
[null,null,null,null,null,null,null,null,null,{"$f":"CONCATENATE(\"($\",Reference!B$303,\".00 for No Discharge)\")","v":"($96.00 for No Discharge)"},{"$f":"IF(B26<>\"\",IF(G26=\"Yes\",Reference!B$302,Reference!B$303),0)","v":0},null,null,null,null,null,{"$f":"IF(K26>0,IF(OR(A26=\"\",B26=\"\",C26=\"\",G26=\"\",I26=\"\"),1,0),0)","v":0}]
[null,null,null,null,null,null,null,null,null,null,{"$f":"IF(B27<>\"\",IF(G27=\"Yes\",Reference!B$302,Reference!B$303),0)","v":0},null,null,null,null,null,{"$f":"IF(K27>0,IF(OR(A27=\"\",B27=\"\",C27=\"\",G27=\"\",I27=\"\"),1,0),0)","v":0}]
[null,null,null,null,null,null,null,null,null,null,{"$f":"IF(B28<>\"\",IF(G28=\"Yes\",Reference!B$302,Reference!B$303),0)","v":0},null,null,null,null,null,{"$f":"IF(K28>0,IF(OR(A28=\"\",B28=\"\",C28=\"\",G28=\"\",I28=\"\"),1,0),0)","v":0}]
["Treatment Unit O&M ","Remediation Status/ \nUnit Type/Frequency",null,"Add. Units","O&M Event Dates",null,null,null,null,"See page 66 of the 2025 CCGD* for rate descriptions"]
[]
[null,null,null,null,null,null,null,null,null,null,{"$f":"IF(B31=\"\",0,(VLOOKUP(B31,Reference!$D$221:$E$232,2,FALSE)+IF(D31=\"\",0,D31)*Reference!$B$235)*(COUNT(E31:H31)))","v":0},null,null,null,null,null,{"$f":"IF(B31<>\"\",IF(OR(A31=\"\",D31=\"\",COUNT(E31:H31)=0,I31=\"\"),1,0),0)","v":0}]
[null,null,null,null,null,null,null,null,null,null,{"$f":"IF(B32=\"\",0,(VLOOKUP(B32,Reference!$D$221:$E$232,2,FALSE)+IF(D32=\"\",0,D32)*Reference!$B$235)*(COUNT(E32:H32)))","v":0},null,null,null,null,null,{"$f":"IF(B32<>\"\",IF(OR(A32=\"\",D32=\"\",COUNT(E32:H32)=0,I32=\"\"),1,0),0)","v":0}]
[null,null,null,null,null,null,null,null,null,null,{"$f":"IF(B33=\"\",0,(VLOOKUP(B33,Reference!$D$221:$E$232,2,FALSE)+IF(D33=\"\",0,D33)*Reference!$B$235)*(COUNT(E33:H33)))","v":0},null,null,null,null,null,{"$f":"IF(B33<>\"\",IF(OR(A33=\"\",D33=\"\",COUNT(E33:H33)=0,I33=\"\"),1,0),0)","v":0}]
[null,null,null,null,null,null,null,null,null,null,{"$f":"IF(B34=\"\",0,(VLOOKUP(B34,Reference!$D$221:$E$232,2,FALSE)+IF(D34=\"\",0,D34)*Reference!$B$235)*(COUNT(E34:H34)))","v":0},null,null,null,null,null,{"$f":"IF(B34<>\"\",IF(OR(A34=\"\",D34=\"\",COUNT(E34:H34)=0,I34=\"\"),1,0),0)","v":0}]
["Oil Changes","No. of Events",null,"Unit HP","Event Dates",null,null,null,null,{"$f":"CONCATENATE(\"$\",Reference!B$236,\".00 per event\",\" & $\",Reference!B$237,\".00 for units > 40 HP\")","v":"$3450.00 per event & $616.00 for units > 40 HP"}]
[null,null,null,null,null,null,null,null,null,null,{"$f":"B36*(Reference!B$236+IF('Miscellaneous 3'!D36=\"> 40\",Reference!B$237,0))","v":0},null,null,null,null,null,{"$f":"IF(K36>0,IF(OR(A36=\"\",D36=\"\",E36=\"\",I36=\"\"),1,0),0)","v":0}]
["Stripperator Cleaning","No. of Events",null,"Event Dates",null,null,null,null,null,{"$f":"CONCATENATE(\"$\",Reference!B$238,\".00 per event\")","v":"$1109.00 per event"}]
[null,null,null,null,null,null,null,null,null,null,{"$f":"B38*(Reference!B$238)","v":0},null,null,null,null,null,{"$f":"IF(K38>0,IF(OR(A38=\"\",D38=\"\",I38=\"\"),1,0),0)","v":0}]
["Vac. Event Report with Planning","Event Types",null,null,null,"Event Dates",null,null,null,"See page 62-64 of the 2025 CCGD* for rate descriptions"]
[]
["Corrective Action Plan","Initial Event",null,null,null,null,null,null,null,null,{"$f":"IF(C41=\"\",0,VLOOKUP('Miscellaneous 3'!C41,Reference!A$242:D$244,2,FALSE)*COUNT(F41:H41))","v":0},null,null,null,null,null,{"$f":"IF(K41>0,IF(OR(A41=\"\",C41=\"\",I41=\"\"),1,0),0)","v":0}]
["Corrective Action Plan","Additional Events",null,null,null,null,null,null,null,null,{"$f":"IF(C42=\"\",0,VLOOKUP('Miscellaneous 3'!C42,Reference!A$242:D$244,3,FALSE)*COUNT(F42:H43))","v":0},null,null,null,null,null,{"$f":"IF(K42>0,IF(OR(A42=\"\",C42=\"\",I42=\"\"),1,0),0)","v":0}]
[]
["High Resolution Site Characterization","Event Description \n(Operator & Equipment)",null,null,null,"Dates of Event",null,"Day Count",null,"See page 60-61 of the 2025 CCGD* for rate descriptions"]
[null,null,null,null,null,null,null,null,null,null,{"$f":"IF(OR(B45=\"\",F45=\"\"),0,VLOOKUP(B45,Reference!$A$322:$B$325,2,FALSE)*IF(VLOOKUP(B45,Reference!$A$322:$C$325,3,FALSE)<H45,0,H45))","v":0},null,null,null,null,null,{"$f":"IF(B45>0,IF(OR(A45=\"\",F45=\"\",H45=\"\",I45=\"\"),1,0),0)","v":0}]
[null,null,null,null,null,null,null,null,null,null,{"$f":"IF(OR(B46=\"\",F46=\"\"),0,VLOOKUP(B46,Reference!$A$322:$B$325,2,FALSE)*IF(VLOOKUP(B46,Reference!$A$322:$C$325,3,FALSE)<H46,0,H46))","v":0},null,null,null,null,null,{"$f":"IF(B46>0,IF(OR(A46=\"\",F46=\"\",H46=\"\",I46=\"\"),1,0),0)","v":0}]
[null,"Event Planning",null,null,null,null,null,null,null,null,{"$f":"+IF(OR(G47=\"\",G47=\"No\"),0,VLOOKUP(B47,Reference!$A$326:$B$327,2,FALSE))","v":0},null,null,null,null,null,{"$f":"IF(G47=\"Yes\",IF(OR(A47=\"\",I47=\"\"),1,0),0)","v":0}]
[null,"Intergrated Site Visualization report with 3D modeling",null,null,null,null,null,null,null,null,{"$f":"IF(OR(G48=\"\",G48=\"No\"),0,VLOOKUP(B48,Reference!$A$326:$B$327,2,FALSE))","v":0},null,null,null,{"$f":"IF(SUM(K9:K48)>0,1,0)","v":0},"Print check",{"$f":"IF(G48=\"Yes\",IF(OR(A48=\"\",I48=\"\"),1,0),0)","v":0}]
[]
["PART 5.H(3)"]
["MISCELLANEOUS SUPPLEMENTARY SHEET"]
["UNIT PRICING FORM"]
[]
["Unit pricing for these activities must be utilized.",null,null,null,null,null,null,null,null,"    * - Cost Control Guidance Document"]
["Costing Category","Unit Price Activities",null,null,null,null,null,null,"RAC\nInvoice No.","Unit Rates","TOTAL",null,null,null,null,null,"Test"]
["Bid Package Preparation","Bid Package Description",null,null,null,"Work Value",null,null,null,"See page 49 of the 2025 CCGD* for rate descriptions\n\nProvide Bid Summary with RAC Invoice."]
[null,null,null,null,null,null,null,null,null,null,{"$f":"ROUND(IF(B57>0,IF(B57=Reference!$A$186,INDEX(Reference!$B$186:$D$190,MATCH(B57,Reference!$A$186:$A$190,0),MATCH(F57,Reference!$B$185:$D$185,0)),VLOOKUP(B57,Reference!$A$187:$B$190,2,FALSE)),0),2)","v":0},null,null,null,null,null,{"$f":"IF(B57<>\"\",IF(OR(A57=\"\",I57=\"\"),1,0),0)","v":0}]
[null,null,null,null,null,null,null,null,null,null,{"$f":"ROUND(IF(B58>0,IF(B58=Reference!$A$186,INDEX(Reference!$B$186:$D$190,MATCH(B58,Reference!$A$186:$A$190,0),MATCH(F58,Reference!$B$185:$D$185,0)),VLOOKUP(B58,Reference!$A$187:$B$190,2,FALSE)),0),2)","v":0},null,null,null,null,null,{"$f":"IF(B58<>\"\",IF(OR(A58=\"\",I58=\"\"),1,0),0)","v":0}]
[null,null,null,null,null,null,null,null,null,null,{"$f":"ROUND(IF(B59>0,IF(B59=Reference!$A$186,INDEX(Reference!$B$186:$D$190,MATCH(B59,Reference!$A$186:$A$190,0),MATCH(F59,Reference!$B$185:$D$185,0)),VLOOKUP(B59,Reference!$A$187:$B$190,2,FALSE)),0),2)","v":0},null,null,null,null,null,{"$f":"IF(B59<>\"\",IF(OR(A59=\"\",I59=\"\"),1,0),0)","v":0}]
[null,null,null,null,null,null,null,null,null,null,{"$f":"ROUND(IF(B60>0,IF(B60=Reference!$A$186,INDEX(Reference!$B$186:$D$190,MATCH(B60,Reference!$A$186:$A$190,0),MATCH(F60,Reference!$B$185:$D$185,0)),VLOOKUP(B60,Reference!$A$187:$B$190,2,FALSE)),0),2)","v":0},null,null,null,null,null,{"$f":"IF(B60<>\"\",IF(OR(A60=\"\",I60=\"\"),1,0),0)","v":0}]
["Treatment System Design/Engineering/Planning and Treatment System Installation Design/ Engineering/Planning",null,null,null,null,null,null,null,null,{"$f":"CONCATENATE(\"$\",Reference!B$214,\".00 per activity\")","v":"$5766.00 per activity"}]
[null,"System/installation RFP documents included with this application",null,null,null,null,null,null,null,null,{"$f":"ROUND(IF(H62=\"Yes\",VLOOKUP(\"System Design and Planning\",Reference!A$214:B$218,2),0),2)","v":0},null,null,null,null,null,{"$f":"IF(H62<>\"\",IF(OR(I62=\"\",A62=\"\"),1,0),0)","v":0}]
["Permit Application Development and Submittal (select from lists)",null,null,null,null,null,null,null,null,"See page 67 of the 2025 CCGD* for rate descriptions"]
[null,"Air Permit",null,null,null,"Water Permit",null,null,null,null,{"$f":"SUM(IF(C64>0,VLOOKUP(C64,Reference!A$193:$B$195,2,FALSE),0)+IF(H64>0,VLOOKUP(H64,Reference!$A$193:$B$195,2,FALSE),0))","v":0},null,null,null,null,null,{"$f":"IF(K63>0,IF(OR(I64=\"\",A64=\"\"),1,0),0)","v":0}]
["Groundwater Monitoring Reports","Report Type","Report Period",null,null,null,"Treatment System (Yes/No)","Initial or \nSubsequent",null,"See pages 56-57 of the 2025 CCGD* for rate descriptions"]
[]
[]
[null,null,null,null,null,null,null,null,null,null,{"$f":"IF(B68=\"\",0,VLOOKUP(CONCATENATE(B68,G68,H68),Reference!D$199:E$210,2,FALSE))","v":0},null,null,null,null,null,{"$f":"IF(B68<>\"\",IF(OR(A68=\"\",C68=\"\",G68=\"\",H68=\"\",I68=\"\"),1,0),0)","v":0}]
[null,null,null,null,null,null,null,null,null,null,{"$f":"IF(B69=\"\",0,VLOOKUP(CONCATENATE(B69,G69,H69),Reference!D$199:E$210,2,FALSE))","v":0},null,null,null,null,null,{"$f":"IF(B69<>\"\",IF(OR(A69=\"\",C69=\"\",G69=\"\",H69=\"\",I69=\"\"),1,0),0)","v":0}]
[null,null,null,null,null,null,null,null,null,null,{"$f":"IF(B70=\"\",0,VLOOKUP(CONCATENATE(B70,G70,H70),Reference!D$199:E$210,2,FALSE))","v":0},null,null,null,null,null,{"$f":"IF(B70<>\"\",IF(OR(A70=\"\",C70=\"\",G70=\"\",H70=\"\",I70=\"\"),1,0),0)","v":0}]
["Discharge Monitoring Report","Permit No.","Report Period",null,null,null,"Discharge (Yes/No)","Include State or Municipal/\nParish Quarterly  Reports",null,{"$f":"CONCATENATE(\"$\",Reference!B$302,\".00 per report\")","v":"$275.00 per report"}]
[]
[null,null,null,null,null,null,null,null,null,{"$f":"CONCATENATE(\"($\",Reference!B$303,\".00 for No Discharge)\")","v":"($96.00 for No Discharge)"},{"$f":"IF(B73<>\"\",IF(G73=\"Yes\",Reference!B$302,Reference!B$303),0)","v":0},null,null,null,null,null,{"$f":"IF(K73>0,IF(OR(A73=\"\",B73=\"\",C73=\"\",G73=\"\",I73=\"\"),1,0),0)","v":0}]
[null,null,null,null,null,null,null,null,null,null,{"$f":"IF(B74<>\"\",IF(G74=\"Yes\",Reference!B$302,Reference!B$303),0)","v":0},null,null,null,null,null,{"$f":"IF(K74>0,IF(OR(A74=\"\",B74=\"\",C74=\"\",G74=\"\",I74=\"\"),1,0),0)","v":0}]
[null,null,null,null,null,null,null,null,null,null,{"$f":"IF(B75<>\"\",IF(G75=\"Yes\",Reference!B$302,Reference!B$303),0)","v":0},null,null,null,null,null,{"$f":"IF(K75>0,IF(OR(A75=\"\",B75=\"\",C75=\"\",G75=\"\",I75=\"\"),1,0),0)","v":0}]
["Treatment Unit O&M ","Remediation Status/ \nUnit Type/Frequency",null,"Add. Units","O&M Event Dates",null,null,null,null,"See page 66 of the 2025 CCGD* for rate descriptions"]
[]
[null,null,null,null,null,null,null,null,null,null,{"$f":"IF(B78=\"\",0,(VLOOKUP(B78,Reference!$D$221:$E$232,2,FALSE)+IF(D78=\"\",0,D78)*Reference!$B$235)*(COUNT(E78:H78)))","v":0},null,null,null,null,null,{"$f":"IF(B78<>\"\",IF(OR(A78=\"\",D78=\"\",COUNT(E78:H78)=0,I78=\"\"),1,0),0)","v":0}]
[null,null,null,null,null,null,null,null,null,null,{"$f":"IF(B79=\"\",0,(VLOOKUP(B79,Reference!$D$221:$E$232,2,FALSE)+IF(D79=\"\",0,D79)*Reference!$B$235)*(COUNT(E79:H79)))","v":0},null,null,null,null,null,{"$f":"IF(B79<>\"\",IF(OR(A79=\"\",D79=\"\",COUNT(E79:H79)=0,I79=\"\"),1,0),0)","v":0}]
[null,null,null,null,null,null,null,null,null,null,{"$f":"IF(B80=\"\",0,(VLOOKUP(B80,Reference!$D$221:$E$232,2,FALSE)+IF(D80=\"\",0,D80)*Reference!$B$235)*(COUNT(E80:H80)))","v":0},null,null,null,null,null,{"$f":"IF(B80<>\"\",IF(OR(A80=\"\",D80=\"\",COUNT(E80:H80)=0,I80=\"\"),1,0),0)","v":0}]
[null,null,null,null,null,null,null,null,null,null,{"$f":"IF(B81=\"\",0,(VLOOKUP(B81,Reference!$D$221:$E$232,2,FALSE)+IF(D81=\"\",0,D81)*Reference!$B$235)*(COUNT(E81:H81)))","v":0},null,null,null,null,null,{"$f":"IF(B81<>\"\",IF(OR(A81=\"\",D81=\"\",COUNT(E81:H81)=0,I81=\"\"),1,0),0)","v":0}]
["Oil Changes","No. of Events",null,"Unit HP","Event Dates",null,null,null,null,{"$f":"CONCATENATE(\"$\",Reference!B$236,\".00 per event\",\" & $\",Reference!B$237,\".00 for units > 40 HP\")","v":"$3450.00 per event & $616.00 for units > 40 HP"}]
[null,null,null,null,null,null,null,null,null,null,{"$f":"B83*(Reference!B$236+IF('Miscellaneous 3'!D83=\"> 40\",Reference!B$237,0))","v":0},null,null,null,null,null,{"$f":"IF(K83>0,IF(OR(A83=\"\",D83=\"\",E83=\"\",I83=\"\"),1,0),0)","v":0}]
["Stripperator Cleaning","No. of Events",null,"Event Dates",null,null,null,null,null,{"$f":"CONCATENATE(\"$\",Reference!B$238,\".00 per event\")","v":"$1109.00 per event"}]
[null,null,null,null,null,null,null,null,null,null,{"$f":"B85*(Reference!B$238)","v":0},null,null,null,null,null,{"$f":"IF(K85>0,IF(OR(A85=\"\",D85=\"\",I85=\"\"),1,0),0)","v":0}]
["Vac. Event Report with Planning","Event Types",null,null,null,"Event Dates",null,null,null,"See page 62-64 of the 2025 CCGD* for rate descriptions"]
[]
[null,"Initial Event",null,null,null,null,null,null,null,null,{"$f":"IF(C88=\"\",0,VLOOKUP('Miscellaneous 3'!C88,Reference!A$242:D$244,2,FALSE)*COUNT(F88:H88))","v":0},null,null,null,null,null,{"$f":"IF(K88>0,IF(OR(A88=\"\",C88=\"\",I88=\"\"),1,0),0)","v":0}]
[null,"Additional Events",null,null,null,null,null,null,null,null,{"$f":"IF(C89=\"\",0,VLOOKUP('Miscellaneous 3'!C89,Reference!A$242:D$244,3,FALSE)*COUNT(F89:H90))","v":0},null,null,null,null,null,{"$f":"IF(K89>0,IF(OR(A89=\"\",C89=\"\",I89=\"\"),1,0),0)","v":0}]
[]
["High Resolution Site Characterization","Event Description \n(Operator & Equipment)",null,null,null,"Dates of Event",null,"Day Count",null,"See page 60-61 of the 2025 CCGD* for rate descriptions"]
[null,null,null,null,null,null,null,null,null,null,{"$f":"IF(OR(B92=\"\",F92=\"\"),0,VLOOKUP(B92,Reference!$A$322:$B$325,2,FALSE)*IF(VLOOKUP(B92,Reference!$A$322:$C$325,3,FALSE)<H92,0,H92))","v":0},null,null,null,null,null,{"$f":"IF(B92>0,IF(OR(A92=\"\",F92=\"\",H92=\"\",I92=\"\"),1,0),0)","v":0}]
[null,null,null,null,null,null,null,null,null,null,{"$f":"IF(OR(B93=\"\",F93=\"\"),0,VLOOKUP(B93,Reference!$A$322:$B$325,2,FALSE)*IF(VLOOKUP(B93,Reference!$A$322:$C$325,3,FALSE)<H93,0,H93))","v":0},null,null,null,null,null,{"$f":"IF(B93>0,IF(OR(A93=\"\",F93=\"\",H93=\"\",I93=\"\"),1,0),0)","v":0}]
[null,"Event Planning",null,null,null,null,null,null,null,null,{"$f":"+IF(OR(G94=\"\",G94=\"No\"),0,VLOOKUP(B94,Reference!$A$326:$B$327,2,FALSE))","v":0},null,null,null,null,null,{"$f":"IF(G94=\"Yes\",IF(OR(A94=\"\",I94=\"\"),1,0),0)","v":0}]
[null,"Intergrated Site Visualization report with 3D modeling",null,null,null,null,null,null,null,null,{"$f":"IF(OR(G95=\"\",G95=\"No\"),0,VLOOKUP(B95,Reference!$A$326:$B$327,2,FALSE))","v":0},null,null,null,{"$f":"IF(SUM(K56:K92)>0,1,0)","v":0},"Print check",{"$f":"IF(G95=\"Yes\",IF(OR(A95=\"\",I95=\"\"),1,0),0)","v":0}]
[]
["PART 5.H(3)"]
["MISCELLANEOUS SUPPLEMENTARY SHEET"]
["UNIT PRICING FORM"]
[]
["Unit pricing for these activities must be utilized.",null,null,null,null,null,null,null,null,"    * - Cost Control Guidance Document"]
["Costing Category","Unit Price Activities",null,null,null,null,null,null,"RAC\nInvoice No.","Unit Rates","TOTAL",null,null,null,null,null,"Test"]
["Bid Package Preparation","Bid Package Description",null,null,null,"Work Value",null,null,null,"See page 49 of the 2025 CCGD* for rate descriptions\n\nProvide Bid Summary with RAC Invoice."]
[null,null,null,null,null,null,null,null,null,null,{"$f":"ROUND(IF(B104>0,IF(B104=Reference!$A$186,INDEX(Reference!$B$186:$D$190,MATCH(B104,Reference!$A$186:$A$190,0),MATCH(F104,Reference!$B$185:$D$185,0)),VLOOKUP(B104,Reference!$A$187:$B$190,2,FALSE)),0),2)","v":0},null,null,null,null,null,{"$f":"IF(B104<>\"\",IF(OR(A104=\"\",I104=\"\"),1,0),0)","v":0}]
[null,null,null,null,null,null,null,null,null,null,{"$f":"ROUND(IF(B105>0,IF(B105=Reference!$A$186,INDEX(Reference!$B$186:$D$190,MATCH(B105,Reference!$A$186:$A$190,0),MATCH(F105,Reference!$B$185:$D$185,0)),VLOOKUP(B105,Reference!$A$187:$B$190,2,FALSE)),0),2)","v":0},null,null,null,null,null,{"$f":"IF(B105<>\"\",IF(OR(A105=\"\",I105=\"\"),1,0),0)","v":0}]
[null,null,null,null,null,null,null,null,null,null,{"$f":"ROUND(IF(B106>0,IF(B106=Reference!$A$186,INDEX(Reference!$B$186:$D$190,MATCH(B106,Reference!$A$186:$A$190,0),MATCH(F106,Reference!$B$185:$D$185,0)),VLOOKUP(B106,Reference!$A$187:$B$190,2,FALSE)),0),2)","v":0},null,null,null,null,null,{"$f":"IF(B106<>\"\",IF(OR(A106=\"\",I106=\"\"),1,0),0)","v":0}]
[null,null,null,null,null,null,null,null,null,null,{"$f":"ROUND(IF(B107>0,IF(B107=Reference!$A$186,INDEX(Reference!$B$186:$D$190,MATCH(B107,Reference!$A$186:$A$190,0),MATCH(F107,Reference!$B$185:$D$185,0)),VLOOKUP(B107,Reference!$A$187:$B$190,2,FALSE)),0),2)","v":0},null,null,null,null,null,{"$f":"IF(B107<>\"\",IF(OR(A107=\"\",I107=\"\"),1,0),0)","v":0}]
["Treatment System Design/Engineering/Planning and Treatment System Installation Design/ Engineering/Planning",null,null,null,null,null,null,null,null,{"$f":"CONCATENATE(\"$\",Reference!B$214,\".00 per activity\")","v":"$5766.00 per activity"}]
[null,"System/installation RFP documents included with this application",null,null,null,null,null,null,null,null,{"$f":"ROUND(IF(H109=\"Yes\",VLOOKUP(\"System Design and Planning\",Reference!A$214:B$218,2),0),2)","v":0},null,null,null,null,null,{"$f":"IF(H109<>\"\",IF(OR(I109=\"\",A109=\"\"),1,0),0)","v":0}]
["Permit Application Development and Submittal (select from lists)",null,null,null,null,null,null,null,null,"See page 67 of the 2025 CCGD* for rate descriptions"]
[null,"Air Permit",null,null,null,"Water Permit",null,null,null,null,{"$f":"SUM(IF(C111>0,VLOOKUP(C111,Reference!A$193:$B$195,2,FALSE),0)+IF(H111>0,VLOOKUP(H111,Reference!$A$193:$B$195,2,FALSE),0))","v":0},null,null,null,null,null,{"$f":"IF(K110>0,IF(OR(I111=\"\",A111=\"\"),1,0),0)","v":0}]
["Groundwater Monitoring Reports","Report Type","Report Period",null,null,null,"Treatment System (Yes/No)","Initial or \nSubsequent",null,"See pages 56-57 of the 2025 CCGD* for rate descriptions"]
[]
[]
[null,null,null,null,null,null,null,null,null,null,{"$f":"IF(B115=\"\",0,VLOOKUP(CONCATENATE(B115,G115,H115),Reference!D$199:E$210,2,FALSE))","v":0},null,null,null,null,null,{"$f":"IF(B115<>\"\",IF(OR(A115=\"\",C115=\"\",G115=\"\",H115=\"\",I115=\"\"),1,0),0)","v":0}]
[null,null,null,null,null,null,null,null,null,null,{"$f":"IF(B116=\"\",0,VLOOKUP(CONCATENATE(B116,G116,H116),Reference!D$199:E$210,2,FALSE))","v":0},null,null,null,null,null,{"$f":"IF(B116<>\"\",IF(OR(A116=\"\",C116=\"\",G116=\"\",H116=\"\",I116=\"\"),1,0),0)","v":0}]
[null,null,null,null,null,null,null,null,null,null,{"$f":"IF(B117=\"\",0,VLOOKUP(CONCATENATE(B117,G117,H117),Reference!D$199:E$210,2,FALSE))","v":0},null,null,null,null,null,{"$f":"IF(B117<>\"\",IF(OR(A117=\"\",C117=\"\",G117=\"\",H117=\"\",I117=\"\"),1,0),0)","v":0}]
["Discharge Monitoring Report","Permit No.","Report Period",null,null,null,"Discharge (Yes/No)","Include State or Municipal/\nParish Quarterly  Reports",null,{"$f":"CONCATENATE(\"$\",Reference!B$302,\".00 per report\")","v":"$275.00 per report"}]
[]
[null,null,null,null,null,null,null,null,null,{"$f":"CONCATENATE(\"($\",Reference!B$303,\".00 for No Discharge)\")","v":"($96.00 for No Discharge)"},{"$f":"IF(B120<>\"\",IF(G120=\"Yes\",Reference!B$302,Reference!B$303),0)","v":0},null,null,null,null,null,{"$f":"IF(K120>0,IF(OR(A120=\"\",B120=\"\",C120=\"\",G120=\"\",I120=\"\"),1,0),0)","v":0}]
[null,null,null,null,null,null,null,null,null,null,{"$f":"IF(B121<>\"\",IF(G121=\"Yes\",Reference!B$302,Reference!B$303),0)","v":0},null,null,null,null,null,{"$f":"IF(K121>0,IF(OR(A121=\"\",B121=\"\",C121=\"\",G121=\"\",I121=\"\"),1,0),0)","v":0}]
[null,null,null,null,null,null,null,null,null,null,{"$f":"IF(B122<>\"\",IF(G122=\"Yes\",Reference!B$302,Reference!B$303),0)","v":0},null,null,null,null,null,{"$f":"IF(K122>0,IF(OR(A122=\"\",B122=\"\",C122=\"\",G122=\"\",I122=\"\"),1,0),0)","v":0}]
["Treatment Unit O&M ","Remediation Status/ \nUnit Type/Frequency",null,"Add. Units","O&M Event Dates",null,null,null,null,"See page 66 of the 2025 CCGD* for rate descriptions"]
[]
[null,null,null,null,null,null,null,null,null,null,{"$f":"IF(B125=\"\",0,(VLOOKUP(B125,Reference!$D$221:$E$232,2,FALSE)+IF(D125=\"\",0,D125)*Reference!$B$235)*(COUNT(E125:H125)))","v":0},null,null,null,null,null,{"$f":"IF(B125<>\"\",IF(OR(A125=\"\",D125=\"\",COUNT(E125:H125)=0,I125=\"\"),1,0),0)","v":0}]
[null,null,null,null,null,null,null,null,null,null,{"$f":"IF(B126=\"\",0,(VLOOKUP(B126,Reference!$D$221:$E$232,2,FALSE)+IF(D126=\"\",0,D126)*Reference!$B$235)*(COUNT(E126:H126)))","v":0},null,null,null,null,null,{"$f":"IF(B126<>\"\",IF(OR(A126=\"\",D126=\"\",COUNT(E126:H126)=0,I126=\"\"),1,0),0)","v":0}]
[null,null,null,null,null,null,null,null,null,null,{"$f":"IF(B127=\"\",0,(VLOOKUP(B127,Reference!$D$221:$E$232,2,FALSE)+IF(D127=\"\",0,D127)*Reference!$B$235)*(COUNT(E127:H127)))","v":0},null,null,null,null,null,{"$f":"IF(B127<>\"\",IF(OR(A127=\"\",D127=\"\",COUNT(E127:H127)=0,I127=\"\"),1,0),0)","v":0}]
[null,null,null,null,null,null,null,null,null,null,{"$f":"IF(B128=\"\",0,(VLOOKUP(B128,Reference!$D$221:$E$232,2,FALSE)+IF(D128=\"\",0,D128)*Reference!$B$235)*(COUNT(E128:H128)))","v":0},null,null,null,null,null,{"$f":"IF(B128<>\"\",IF(OR(A128=\"\",D128=\"\",COUNT(E128:H128)=0,I128=\"\"),1,0),0)","v":0}]
["Oil Changes","No. of Events",null,"Unit HP","Event Dates",null,null,null,null,{"$f":"CONCATENATE(\"$\",Reference!B$236,\".00 per event\",\" & $\",Reference!B$237,\".00 for units > 40 HP\")","v":"$3450.00 per event & $616.00 for units > 40 HP"}]
[null,null,null,null,null,null,null,null,null,null,{"$f":"B130*(Reference!B$236+IF('Miscellaneous 3'!D130=\"> 40\",Reference!B$237,0))","v":0},null,null,null,null,null,{"$f":"IF(K130>0,IF(OR(A130=\"\",D130=\"\",E130=\"\",I130=\"\"),1,0),0)","v":0}]
["Stripperator Cleaning","No. of Events",null,"Event Dates",null,null,null,null,null,{"$f":"CONCATENATE(\"$\",Reference!B$238,\".00 per event\")","v":"$1109.00 per event"}]
[null,null,null,null,null,null,null,null,null,null,{"$f":"B132*(Reference!B$238)","v":0},null,null,null,null,null,{"$f":"IF(K132>0,IF(OR(A132=\"\",D132=\"\",I132=\"\"),1,0),0)","v":0}]
["Vac. Event Report with Planning","Event Types",null,null,null,"Event Dates",null,null,null,"See page 62-64 of the 2025 CCGD* for rate descriptions"]
[]
[null,"Initial Event",null,null,null,null,null,null,null,null,{"$f":"IF(C135=\"\",0,VLOOKUP('Miscellaneous 3'!C135,Reference!A$242:D$244,2,FALSE)*COUNT(F135:H135))","v":0},null,null,null,null,null,{"$f":"IF(K135>0,IF(OR(A135=\"\",C135=\"\",I135=\"\"),1,0),0)","v":0}]
[null,"Additional Events",null,null,null,null,null,null,null,null,{"$f":"IF(C136=\"\",0,VLOOKUP('Miscellaneous 3'!C136,Reference!A$242:D$244,3,FALSE)*COUNT(F136:H137))","v":0},null,null,null,null,null,{"$f":"IF(K136>0,IF(OR(A136=\"\",C136=\"\",I136=\"\"),1,0),0)","v":0}]
[]
["High Resolution Site Characterization","Event Description \n(Operator & Equipment)",null,null,null,"Dates of Event",null,"Day Count",null,"See page 60-61 of the 2025 CCGD* for rate descriptions"]
[null,null,null,null,null,null,null,null,null,null,{"$f":"IF(OR(B139=\"\",F139=\"\"),0,VLOOKUP(B139,Reference!$A$322:$B$325,2,FALSE)*IF(VLOOKUP(B139,Reference!$A$322:$C$325,3,FALSE)<H139,0,H139))","v":0},null,null,null,null,null,{"$f":"IF(B139>0,IF(OR(A139=\"\",F139=\"\",H139=\"\",I139=\"\"),1,0),0)","v":0}]
[null,null,null,null,null,null,null,null,null,null,{"$f":"IF(OR(B140=\"\",F140=\"\"),0,VLOOKUP(B140,Reference!$A$322:$B$325,2,FALSE)*IF(VLOOKUP(B140,Reference!$A$322:$C$325,3,FALSE)<H140,0,H140))","v":0},null,null,null,null,null,{"$f":"IF(B140>0,IF(OR(A140=\"\",F140=\"\",H140=\"\",I140=\"\"),1,0),0)","v":0}]
[null,"Event Planning",null,null,null,null,null,null,null,null,{"$f":"+IF(OR(G141=\"\",G141=\"No\"),0,VLOOKUP(B141,Reference!$A$326:$B$327,2,FALSE))","v":0},null,null,null,null,null,{"$f":"IF(G141=\"Yes\",IF(OR(A141=\"\",I141=\"\"),1,0),0)","v":0}]
[null,"Intergrated Site Visualization report with 3D modeling",null,null,null,null,null,null,null,null,{"$f":"IF(OR(G142=\"\",G142=\"No\"),0,VLOOKUP(B142,Reference!$A$326:$B$327,2,FALSE))","v":0},null,null,null,{"$f":"IF(SUM(K103:K139)>0,1,0)","v":0},"Print check",{"$f":"IF(G142=\"Yes\",IF(OR(A142=\"\",I142=\"\"),1,0),0)","v":0}]

{"sheet":"Miscellaneous 4","index":18,"n_rows":41,"n_cols":21,"rows_kept":41,"cut":false,"hidden":false,"merged":[[32,0,33,0],[32,1,33,3],[32,4,33,4],[36,1,36,2],[36,3,36,4],[26,2,27,2],[26,3,27,3],[26,4,27,4],[37,3,37,4],[37,1,37,2],[26,20,27,20],[38,20,40,20],[40,3,40,4],[38,0,39,0],[26,6,31,6],[26,7,27,7],[38,7,39,7],[38,6,40,6],[40,1,40,2],[26,5,27,5],[35,1,35,3],[32,6,35,6],[36,6,37,6],[34,1,34,3],[26,0,27,0],[26,1,27,1],[19,6,20,6],[23,1,23,3],[24,1,24,3],[21,6,25,6],[10,6,14,6],[17,6,18,6],[10,1,11,1],[10,2,11,3],[10,4,11,4],[15,1,16,1],[15,2,16,3],[15,4,16,4],[20,1,20,3],[21,1,22,3],[12,2,12,3],[13,2,13,3],[5,0,5,1],[6,0,6,1],[10,0,11,0],[15,0,16,0],[0,4,0,7],[2,4,2,5],[1,4,1,5],[10,7,11,7],[15,6,16,6],[3,4,3,5],[4,4,4,5],[5,4,5,5],[6,4,6,5],[17,2,17,3],[18,2,18,3],[9,1,9,4],[19,0,19,4],[25,1,25,3],[21,0,22,0],[21,4,22,4],[14,2,14,3]]}
["PART 5.H (4)",null,null,null,"Costing Category Summary"]
["MISCELLANEOUS SUPPLEMENTARY SHEET",null,null,null,"Category",null,"Page Totals","Part 5.H Totals"]
["UNIT PRICING FORM",null,null,null,"Emergency/Initial",null,{"$f":"SUMIF($A$11:$A$41,E3,$H$11:$H$41)","v":0},{"$f":"+G3+'Miscellaneous 3'!K2+'Miscellaneous 2'!K3+'Miscellaneous 1'!H4","v":0}]
[null,null,null,null,"Investigation",null,{"$f":"SUMIF($A$11:$A$41,E4,$H$11:$H$41)","v":0},{"$f":"+G4+'Miscellaneous 3'!K3+'Miscellaneous 2'!K4+'Miscellaneous 1'!H5","v":0}]
[{"$f":"IF(SUM(U11:U42)>0,\"MISSING INFORMATION\",\"\")","v":""},null,null,null,"Interim Monitoring",null,0,{"$f":"+G5+'Miscellaneous 3'!K4+'Miscellaneous 2'!K5+'Miscellaneous 1'!H6","v":0}]
["Unit pricing for these activities must be utilized.",null,null,null,"Corrective Action Plan",null,{"$f":"SUMIF($A$11:$A$41,E6,$H$11:$H$41)","v":0},{"$f":"+G6+'Miscellaneous 3'!K5+'Miscellaneous 2'!K6+'Miscellaneous 1'!H7","v":0}]
["* - Cost Control Guidance Document",null,null,null,"Report Preparation",null,0,{"$f":"+G7+'Miscellaneous 3'!K6+'Miscellaneous 1'!H8","v":0}]
[]
[]
["Costing Category","Unit Price Activities",null,null,null,"RAC Invoice\nNo.","Unit Rates","TOTAL",null,null,null,null,null,null,null,null,null,null,null,null,"Test"]
["Corrective Action Plan ","Submittal Date","CAP Category",null,"Budget Amount",null," See page 50 of the \n2025 CCGD* \nfor rate descriptions"]
[]
[null,null,null,null,null,null,null,{"$f":"ROUND(IF(OR(AND(B13>0,C13>0,E13>0),AND(B13>0,C13=Reference!A248)),IF(OR(C13=Reference!$A$252,C13=Reference!$A$254,C13=Reference!$A$255),IF(E13*VLOOKUP(C13,Reference!$A$247:$C$255,2,FALSE)>VLOOKUP(C13,Reference!$A$247:$C$255,3,FALSE),VLOOKUP(C13,Reference!$A$247:$C$255,3,FALSE),E13*VLOOKUP(C13,Reference!$A$247:$C$255,2,FALSE)),VLOOKUP(C13,Reference!$A$247:$C$255,2,FALSE)),0),2)","v":0},null,null,null,null,null,null,null,null,null,null,null,null,{"$f":"IF(C13<>\"\",IF(OR(A13=\"\",B13=\"\",E13=\"\",F13=\"\"),1,0),0)","v":0}]
[null,null,null,null,null,null,null,{"$f":"ROUND(IF(OR(AND(B14>0,C14>0,E14>0),AND(B14>0,C14=Reference!A249)),IF(OR(C14=Reference!$A$252,C14=Reference!$A$254,C14=Reference!$A$255),IF(E14*VLOOKUP(C14,Reference!$A$247:$C$255,2,FALSE)>VLOOKUP(C14,Reference!$A$247:$C$255,3,FALSE),VLOOKUP(C14,Reference!$A$247:$C$255,3,FALSE),E14*VLOOKUP(C14,Reference!$A$247:$C$255,2,FALSE)),VLOOKUP(C14,Reference!$A$247:$C$255,2,FALSE)),0),2)","v":0},null,null,null,null,null,null,null,null,null,null,null,null,{"$f":"IF(C14<>\"\",IF(OR(A14=\"\",B14=\"\",E14=\"\",F14=\"\"),1,0),0)","v":0}]
[null,null,null,null,null,null,null,{"$f":"ROUND(IF(OR(AND(B15>0,C15>0,E15>0),AND(B15>0,C15=Reference!A250)),IF(OR(C15=Reference!$A$252,C15=Reference!$A$254,C15=Reference!$A$255),IF(E15*VLOOKUP(C15,Reference!$A$247:$C$255,2,FALSE)>VLOOKUP(C15,Reference!$A$247:$C$255,3,FALSE),VLOOKUP(C15,Reference!$A$247:$C$255,3,FALSE),E15*VLOOKUP(C15,Reference!$A$247:$C$255,2,FALSE)),VLOOKUP(C15,Reference!$A$247:$C$255,2,FALSE)),0),2)","v":0},null,null,null,null,null,null,null,null,null,null,null,null,{"$f":"IF(C15<>\"\",IF(OR(A15=\"\",B15=\"\",E15=\"\",F15=\"\"),1,0),0)","v":0}]
["Plugging & Abandonment Workplan or Report","Report Type","Event Description",null,"Submittal Date",null,{"$f":"CONCATENATE(\"$\",Reference!B$261,\".00 per work plan \")","v":"$128.00 per work plan "}]
[]
[null,null,null,null,null,null,{"$f":"CONCATENATE(\"$\",Reference!B$260,\".00 per report\")","v":"$924.00 per report"},{"$f":"ROUND(IF(AND(B18<>\"\",E18>0),VLOOKUP(B18,Reference!A$260:B$261,2,FALSE),0),2)","v":0},null,null,null,null,null,null,null,null,null,null,null,null,{"$f":"IF(B18<>\"\",IF(OR(A18=\"\",C18=\"\",E18=\"\",F18=\"\"),1,0),0)","v":0}]
[null,null,null,null,null,null,null,{"$f":"ROUND(IF(AND(B19<>\"\",E19>0),VLOOKUP(B19,Reference!A$260:B$261,2,FALSE),0),2)","v":0},null,null,null,null,null,null,null,null,null,null,null,null,{"$f":"IF(B19<>\"\",IF(OR(A19=\"\",C19=\"\",E19=\"\",F19=\"\"),1,0),0)","v":0}]
["Remediation Oversight Group Meeting Preparation and Attendance",null,null,null,null,null,{"$f":"CONCATENATE(\"$\",Reference!B$215,\".00 per activity\")","v":"$865.00 per activity"}]
[null,"Meeting Date",null,null,null,null,null,{"$f":"ROUND(IF(E21<>\"\",VLOOKUP(A21,Reference!A$214:B$217,2),0),2)","v":0},null,null,null,null,null,null,null,null,null,null,null,null,{"$f":"IF(E21<>\"\",IF(OR(A21=\"\",F21=\"\"),1,0),0)","v":0}]
["Risk Evaluation/ Corrective Action Report","RECAP Report Description",null,null," Submittal Date",null," See page 70 \nof the \n2025 CCGD* for \nrate descriptions"]
[]
[null,null,null,null,null,null,null,{"$f":"ROUND(IF(AND(B24<>\"\",E24>0),VLOOKUP(B24,Reference!A$265:B$271,2,FALSE),0),2)","v":0},null,null,null,null,null,null,null,null,null,null,null,null,{"$f":"IF(B24<>\"\",IF(OR(A24=\"\",E24=\"\",F24=\"\"),1,0),0)","v":0}]
[null,null,null,null,null,null,null,{"$f":"ROUND(IF(AND(B25<>\"\",E25>0),VLOOKUP(B25,Reference!A$265:B$271,2,FALSE),0),2)","v":0},null,null,null,null,null,null,null,null,null,null,null,null,{"$f":"IF(B25<>\"\",IF(OR(A25=\"\",E25=\"\",F25=\"\"),1,0),0)","v":0}]
[null,null,null,null,null,null,null,{"$f":"ROUND(IF(AND(B26<>\"\",E26>0),VLOOKUP(B26,Reference!A$265:B$271,2,FALSE),0),2)","v":0},null,null,null,null,null,null,null,null,null,null,null,null,{"$f":"IF(B26<>\"\",IF(OR(A26=\"\",E26=\"\",F26=\"\"),1,0),0)","v":0}]
["Site Investigation/Soil Confirmation Workplan/Report","Workplan/Report Type","Submittal Date","Team Leader Approval Date","Field Work Budgeted/ Reimbursed",null," See pages 71- 72 \nof the \n2025 CCGD* for \nrate descriptions"]
[null,null,null,null,null,null,null,null,null,null,null,null,null,null,null,null,null,"$ calculation"]
[null,null,null,null,null,null,null,{"$f":"ROUND(IF(AND(B29<>\"\",C29>0,E29>0),IF(R29<VLOOKUP(B29,Reference!A$275:D$278,3,FALSE),VLOOKUP(B29,Reference!A$275:D$278,3,FALSE),IF(R29>VLOOKUP(B29,Reference!A$275:D$278,4,FALSE),VLOOKUP(B29,Reference!A$275:D$278,4,FALSE),R29))),2)","v":0},null,null,null,null,null,null,null,null,null,{"$f":"IF(AND(B29<>\"\",C29>0,E29>0),VLOOKUP(B29,Reference!A$275:D$278,2,FALSE)*'Miscellaneous 4'!E29,0)","v":0},null,null,{"$f":"IF(B29<>\"\",IF(OR(A29=\"\",C29=\"\",D29=\"\",E29=\"\",F29=\"\"),1,0),0)","v":0}]
[null,null,null,null,null,null,null,{"$f":"ROUND(IF(AND(B30<>\"\",C30>0,E30>0),IF(R30<VLOOKUP(B30,Reference!A$275:D$278,3,FALSE),VLOOKUP(B30,Reference!A$275:D$278,3,FALSE),IF(R30>VLOOKUP(B30,Reference!A$275:D$278,4,FALSE),VLOOKUP(B30,Reference!A$275:D$278,4,FALSE),R30))),2)","v":0},null,null,null,null,null,null,null,null,null,{"$f":"IF(AND(B30<>\"\",C30>0,E30>0),VLOOKUP(B30,Reference!A$275:D$278,2,FALSE)*'Miscellaneous 4'!E30,0)","v":0},null,null,{"$f":"IF(B30<>\"\",IF(OR(A30=\"\",C30=\"\",D30=\"\",E30=\"\",F30=\"\"),1,0),0)","v":0}]
[null,null,null,null,null,null,null,{"$f":"ROUND(IF(AND(B31<>\"\",C31>0,E31>0),IF(R31<VLOOKUP(B31,Reference!A$275:D$278,3,FALSE),VLOOKUP(B31,Reference!A$275:D$278,3,FALSE),IF(R31>VLOOKUP(B31,Reference!A$275:D$278,4,FALSE),VLOOKUP(B31,Reference!A$275:D$278,4,FALSE),R31))),2)","v":0},null,null,null,null,null,null,null,null,null,{"$f":"IF(AND(B31<>\"\",C31>0,E31>0),VLOOKUP(B31,Reference!A$275:D$278,2,FALSE)*'Miscellaneous 4'!E31,0)","v":0},null,null,{"$f":"IF(B31<>\"\",IF(OR(A31=\"\",C31=\"\",D31=\"\",E31=\"\",F31=\"\"),1,0),0)","v":0}]
[null,null,null,null,null,null,null,{"$f":"ROUND(IF(AND(B32<>\"\",C32>0,E32>0),IF(R32<VLOOKUP(B32,Reference!A$275:D$278,3,FALSE),VLOOKUP(B32,Reference!A$275:D$278,3,FALSE),IF(R32>VLOOKUP(B32,Reference!A$275:D$278,4,FALSE),VLOOKUP(B32,Reference!A$275:D$278,4,FALSE),R32))),2)","v":0},null,null,null,null,null,null,null,null,null,{"$f":"IF(AND(B32<>\"\",C32>0,E32>0),VLOOKUP(B32,Reference!A$275:D$278,2,FALSE)*'Miscellaneous 4'!E32,0)","v":0},null,null,{"$f":"IF(B32<>\"\",IF(OR(A32=\"\",C32=\"\",D32=\"\",E32=\"\",F32=\"\"),1,0),0)","v":0}]
["Corrective Action Plan Construction and Operations Report","Report Type",null,null,"Submittal Date",null,"See page 51 of the \n2025 CCGD*\nfor rate descriptions"]
[]
[null,null,null,null,null,null,null,{"$f":"ROUND(IF(AND(B35<>\"\",E35>0),VLOOKUP(B35,Reference!A$281:B$284,2,FALSE),0),2)","v":0},null,null,null,null,null,null,null,null,null,null,null,null,{"$f":"IF(B35<>\"\",IF(OR(A35=\"\",E35=\"\",F35=\"\"),1,0),0)","v":0}]
[null,null,null,null,null,null,null,{"$f":"ROUND(IF(AND(B36<>\"\",E36>0),VLOOKUP(B36,Reference!A$281:B$284,2,FALSE),0),2)","v":0},null,null,null,null,null,null,null,null,null,null,null,null,{"$f":"IF(B36<>\"\",IF(OR(A36=\"\",E36=\"\",F36=\"\"),1,0),0)","v":0}]
["Conveyance Notice ","Number of Affected Properties",null,"Notice Date",null,null,{"$f":"CONCATENATE(\"$\",Reference!B$287,\".00 per affected property\")","v":"$1478.00 per affected property"}]
[null,null,null,null,null,null,null,{"$f":"ROUND(IF(AND(B38>0,D38>0),B38*Reference!$B$287,0),2)","v":0},null,null,null,null,null,null,null,null,null,null,null,null,{"$f":"IF(C38>0,IF(OR(F38=\"\",E38=\"\",A38=\"\"),1,0),0)","v":0}]
["Trust Fund Reimbursement Application Preparation","July – September",{"$f":"+'Part 5'!M$16","v":""},"January – March",{"$f":"+'Part 5'!S$16","v":""},null,{"$f":"CONCATENATE(\"Applications Addressing Field Work: $\",Reference!B291,\".00  Application Addressing Reports Only: $\",Reference!B292,\".00\")","v":"Applications Addressing Field Work: $440.00  Application Addressing Reports Only: $220.00"},null,null,null,null,null,null,null,null,null,null,null,null,null,{"$f":"IF(H41>0,IF(OR(F41=\"\",A41=\"\"),1,0),0)","v":0}]
[null,"October - December",{"$f":"+'Part 5'!M$17","v":""},"April - June",{"$f":"+'Part 5'!S$17","v":""}]
[null," Work the Trust Fund Reimbursement Application Addresses",null,null,null,null,null,{"$f":"IF(D41<>\"\",VLOOKUP(D41,Reference!A$291:B$292,2,FALSE),0)","v":0}]

{"sheet":"Part 7","index":19,"n_rows":46,"n_cols":26,"rows_kept":46,"cut":false,"hidden":false,"merged":[[11,1,11,7],[45,0,45,21],[42,11,42,15],[42,16,42,21],[44,3,44,9],[44,11,44,16],[44,17,44,21],[42,0,42,6],[42,7,42,10],[44,0,44,2],[38,0,38,21],[39,0,39,21],[40,0,40,1],[40,2,40,9],[40,11,40,14],[40,15,40,21],[37,0,37,21],[31,9,31,11],[31,17,31,20],[32,0,32,5],[32,6,32,21],[34,0,34,8],[34,9,34,11],[34,12,34,16],[34,17,34,20],[35,9,35,11],[35,17,35,20],[28,0,28,6],[28,7,28,21],[24,10,24,15],[30,0,30,8],[30,9,30,11],[30,12,30,16],[30,17,30,20],[21,19,21,21],[25,9,25,21],[24,1,24,9],[25,1,25,8],[27,0,27,21],[11,15,11,19],[23,1,23,8],[23,9,23,11],[23,12,23,18],[23,19,23,21],[19,1,19,10],[19,12,19,15],[22,1,22,8],[22,9,22,11],[22,12,22,18],[22,19,22,21],[19,16,19,21],[20,0,20,21],[21,1,21,8],[21,9,21,11],[21,12,21,18],[16,0,16,19],[17,1,17,21],[18,0,18,21],[16,20,16,21],[0,0,0,21],[1,0,1,21],[4,0,4,3],[4,4,4,21],[6,0,6,6],[6,7,6,21],[8,0,8,21],[9,0,9,21],[10,0,10,21],[11,20,11,21],[11,10,11,13],[12,10,12,13],[12,15,12,18],[12,19,12,20],[14,5,14,21],[15,0,15,7],[15,8,15,21],[12,1,12,8]]}
["PART 7"]
["TREATMENT SYSTEM TRACKING FORM"]
[]
[]
["Current Site Name"]
[]
["Agency Interest Number (AIN)"]
[]
["1.        Please provide the following for groundwater or vapor recovery equipment in use at the above listed site for"]
["            which reimbursement is being ,or will be, requested."]
[]
[null,"Purchase",null,null,null,null,null,null,null,"Cost",null,null,null,null,null,"Vendor Invoice No. ",null,null,null,null,null,null,null,null,null,"(Invoice attached)"]
[null,"Rental (DEQ approval only)",null,null,null,null,null,null,null,"Monthly Rate",null,null,null,null,null,"Minimum Term",null,null,null,null,null,"Months"]
[]
["2.        Manufacturer’s Name"]
["3.        Serial Number of Equipment "]
["4.        Prior location of the unit and period of use, if previously used at another site (include AIN)"]
[]
["5.        Brief information on the unit: (Please check appropriate method noted below)"]
[null,null,null,null,null,null,null,null,null,null,null,null,"Description:",null,null,null,null,null,null,null,null,null,null,{"$f":"IF(F15<>\"\",1,0)","v":0}]
["6.         Major Components and Manufacturer's Recommendations:"]
[null,"Motor Size (quantity and size)",null,null,null,null,null,null,null,null,null,null,"Carbon Filter (yes/no, size)"]
[null,"Pump (quantity and size)",null,null,null,null,null,null,null,null,null,null,"Oil Capacity (in gallons)"]
["   ","Manufacturer Recommended\nOil Change Frequency",null,null,null,null,null,null,null,null,null,null,"Air Stripper (flow rate)"]
[null,"Ozone Output (pounds per day)"]
[null,"Other System Specifications"]
[]
["7.       Period Operated (If original location, please estimate number of months of expected use at the site.)"]
["          Original Location/AIN"]
[]
["          (Estimated time-frame) From",null,null,null,null,null,null,null,null,null,null,null,"Length of use"]
[null,null,null,null,null,null,null,null,null,"(Installation Date)",null,null,null,null,null,null,null,"(Estimated Time)"]
["           New Location/ AIN"]
[]
["          (Estimated time-frame) From",null,null,null,null,null,null,null,null,null,null,null,"Length of use"]
[null,null,null,null,null,null,null,null,null,"(Installation Date)",null,null,null,null,null,null,null,"(Estimated Time)"]
[]
["I hereby certify that all of the above information is true and correct to the best of my knowledge and I agree to "]
["notify the Trust Fund Section, in writing, indicating the specific address of the relocation of the treatment"]
["equipment as soon as possible, but prior to relocation of the equipment."]
["RAC Name",null,null,null,null,null,null,null,null,null,"  ","*Signature ",null,null,null,{"$f":"IF(OR(CONCATENATE(K12,K13)=\"\",U12=\"\",F15=\"\",I16=\"\",CONCATENATE(J22,J23,J24,T24,T22,T23,K25,H26)=\"\",G33=\"\",J35=\"\",R35=\"\"),\"MISSING INFORMATION\",\"\")","v":"MISSING INFORMATION"}]
[]
["Owner, Operator, or RP Name",null,null,null,null,null,null,null,null,null,null,"Title of Signatory"]
[]
["Telefax Number",null,null,null,null,null,null,null,null,null,null,"Telephone Number"]
["* Signature is required of Owner, Operator, RP, or RAC (person purchasing unit).  RAC signature is required for rental."]

{"sheet":"Part 8","index":20,"n_rows":57,"n_cols":11,"rows_kept":57,"cut":false,"hidden":false,"merged":[[11,0,13,9],[50,1,50,7],[56,4,56,8],[56,0,56,3],[15,11,25,22],[38,0,38,8],[35,0,35,8],[54,0,54,1],[55,3,55,7],[52,0,52,1],[52,2,52,5],[39,0,39,8],[40,6,40,8],[41,0,41,5],[41,7,41,8],[42,0,42,8],[0,0,0,8],[1,0,1,8],[2,0,2,8],[8,0,10,8],[4,0,6,9],[18,0,21,9],[23,0,26,9],[28,0,30,9],[15,0,16,9],[32,0,33,9],[54,2,54,4],[54,5,54,6],[37,11,38,22],[35,11,35,22],[37,0,37,5],[37,7,37,8],[45,0,45,7],[46,0,46,8],[48,1,48,3],[48,6,48,8],[43,0,43,8],[54,7,54,9]]}
["PART 8"]
["PURCHASE AGREEMENT FORM"]
["(TREATMENT SYSTEMS ONLY)"]
[]
["1.    Treatment systems are defined as dual-phase vacuum extraction systems, ozone sparge systems, soil vapor extraction \n       systems, groundwater pump and treat systems, chemical injection systems, or any other technology or equipment \n       used in the remediation of contaminated underground storage tank sites (hereinafter referred to as “equipment”).  "]
[]
[]
[]
["2.    The Equipment owner is defined as the owner, operator, Responsible Party (RP), or Response Action \n       Contractor (RAC).” (hereinafter referred to as “owner”).   "]
[]
[]
["3.    The owner is responsible for the purchase, delivery, installation, operation, maintenance, troubleshooting, service, and \n       repairs of the equipment as per the manufacturer’s requirements in order to maintain continued, efficient, and effective \n       operation for the duration of corrective action at the site."]
[]
[]
[]
["4.    The owner shall place the equipment as close as possible to the area to be remediated to minimize cost the Motor \n       Fuel Trust Fund."]
[]
[]
["5.    The owner shall not use, operate, alter, or store the equipment improperly, carelessly, nor use or operate the equipment \n       other than in the manner and use for its intended purpose.  Should the equipment become damaged or rendered\n       inoperable by such activities, the owner, at no cost to the Department, shall repair or replace the equipment within sixty\n       (60) days and continue remediation of the site."]
[]
[]
[]
[]
["6.    Should the owner relocate the equipment to another site prior to meeting the site-specific clean-up standards and \n       completing the post remediation monitoring period at the original site, or without approval of the Department, the \n       owner, at no cost to the Department, shall mobilize to the original site the same or comparable equipment within \n       sixty (60) days and continue remediation of the site.  "]
[]
[]
[]
[]
["7.    Upon completion of remediation at the original site and with prior approval from the Department, the owner shall notify \n       the Trust Fund Section (Financial Services Division) of a pending transfer and relocation of the equipment by completing \n       a Treatment System Tracking Form (Part 7).  "]
[]
[]
[]
["8.    In the event of damage to the equipment whether by accident, theft, vandalism, acts of God or third parties, including \n       collision by a motor vehicle, the owner shall be responsible for the repair or replacement of the equipment."]
[]
[]
["I agree to comply with the terms and conditions as stated above."]
[]
[{"$f":"IF(OR(H42=\"\",E57=\"\",G41=\"VALUE DOES NOT MATCH PART 7\",D56=\"SERIAL NUMBER DOES NOT MATCH PART 7\"),\"MISSING INFORMATION\",\"\")","v":"MISSING INFORMATION"}]
["Signature of system purchaser/renter (Owner, Operator, RP, or RAC)                                 Date Signed"]
["    (Circle:  Owner, Operator, RP, or RAC)"]
[null,null,null,null,null,null,{"$f":"IF(AND(H42>0,H42<>'Part 7'!K12),\"VALUE DOES NOT MATCH PART 7\",\"\")","v":""}]
[null,null,null,null,null,null,null,null,null,null,{"$f":"IF(H42>0,1,0)","v":0}]
["Typed or Printed Name of Owner, Operator, RP, or RAC                                                     Cost of Unit"]
["    (Circle:  Owner, Operator, RP, or RAC)"]
[]
[]
["Mailing Address of Owner, Operator, RP, or RAC (above)"]
[]
["Phone No. ",null,null,null,null,"Telefax No. "]
[]
["Site Name",{"$f":"IF('Part 1'!A20>0,'Part 1'!A20,\"\")","v":""}]
[]
["Agency Interest No. "]
[]
["Equipment Type",null,null,null,null,"Description"]
[null,null,null,{"$f":"IF(E57='Part 7'!I16,\"\",\"SERIAL NUMBER DOES NOT MATCH PART 7\")","v":""}]
["Equipment Serial Number"]

{"sheet":"Reference","index":21,"n_rows":327,"n_cols":9,"rows_kept":327,"cut":false,"hidden":true,"merged":[[93,0,93,1],[183,0,183,3],[191,0,191,1],[299,0,299,1],[239,0,239,3],[245,0,245,2],[279,0,279,1],[288,0,288,1],[293,0,293,1],[0,1,0,2],[1,1,1,2],[2,1,2,2],[3,1,3,2],[25,0,26,0],[25,1,25,3]]}
["Costing Categories:","Drilling & P&A Costing category options",null,"Non-impacted and treated soils"]
["Emergency/Initial","Emergency/Initial",null,"Emergency/Initial"]
["Investigation","Investigation",null,"Corrective Action Plan"]
["Interim Monitoring","Corrective Action Plan"]
["Corrective Action Plan"]
["Report Preparation"]
[]
["Title","Rate","Max Qty (Hrs)"]
["**PRINCIPAL",161,10]
["*SENIOR TOXICOLOGIST",128,250]
["*SENIOR ENGINEER",128,250]
["*SENIOR GEOLOGIST",128,250]
["*PROJECT MANAGER",128,250]
["ENGINEER",92,250]
["GEOLOGIST",92,250]
["TOXICOLOGIST",92,250]
["*PROJECT COORDINATOR",92,250]
["DRAFTSMAN (Includes CAD equipment)",84,250]
["ENVIRONMENTAL SPECIALIST",84,250]
["FOREMAN",84,250]
["OPERATOR",58,250]
["CLERICAL",45,250]
["LABORER",45,250]
[]
[]
["EQUIPMENT","SHORT-TERM RATE"]
[null,"HOURLY","DAILY","WEEKLY","Error"]
["AIR COMPRESSOR  - 100 cfm to 249 cfm",8,64,192.2,"NA"]
["AIR COMPRESSOR - 250 cfm to 375 cfm",12,96.1,288.3,"NA"]
["BACKHOE (UP TO 36” BUCKET)",44,352.3,1057.0999999999999,"NA"]
["BACKHOE (Including and OVER 36” BUCKET)",56.7,452.8,1358.3,"NA"]
["BOBCAT/SKID STEER LOADER/FRONT-END LOADER w/ BREAKER",28.8,230.7,691.9,"NA"]
["BULLDOZER",104.9,839.2,2517.6999999999998,"NA"]
["COMBUSTIBLE GAS INDICATOR",4.8,38.4,115.3,"NA"]
["COMPACTOR",36.1,288.3,864.8,"NA",null,{"$f":"CONCATENATE(\"Applications Addressing Field Work: $\",Reference!B291,\".00      Application Addressing Reports Only: $\")","v":"Applications Addressing Field Work: $440.00      Application Addressing Reports Only: $"}]
["CONCRETE CORE DRILL",8.6,69.2,207.6,"NA"]
["CRANE TRUCK",57.6,461.2,1383.8,"NA"]
["DATA LOGGER",24,192.2,576.6,"NA"]
["DIGITAL MANOMETER",2.4,19.3,57.6,"NA"]
["DISSOLVED OXYGEN METER",4.0999999999999996,32,96.1,"NA"]
["DUMP TRUCK (7-10 YARDS)",38.4,"NA","NA","NA"]
["DUMP TRUCK (11-20 YARDS)",51.3,"NA","NA","NA"]
["DUMP TRUCK (OVER 20 YARDS)",64,"NA","NA","NA"]
["ELECTRIC GENERATOR",8,64,192.2,"NA"]
["EXCAVATORS",96.1,768.8,2306.3000000000002,"NA"]
["EXPLOSIMETER *",4.8,38.4,115.3,"NA"]
["GAS DETECTOR *",4.0999999999999996,32,96.1,"NA"]
["GOOSENECK TRAILER",16.100000000000001,128.19999999999999,384.3,"NA"]
["HYDROCARBON ANALYZER (FID, PID, HNU, OVA, TVA, ETC. *",12,96.1,288.3,"NA"]
["JACKHAMMER",4.8,38.4,115.3,"NA"]
["LOWBOY TRAILER (INCLUDES TRUCK)",28.8,230.7,691.9,"NA"]
["OIL/WATER INTERFACE PROBE *",5.6,44.9,134.5,"NA"]
["pH CONDUCTIVITY METER *",4.0999999999999996,32,96.1,"NA"]
["PORTABLE GAS CHROMATOGRAPHY",24,192.2,576.6,"NA"]
["PUMPS (when not used in conjunction with a system)",4.8,38.4,115.3,"NA"]
["TEMPERATURE PROBE *",2.4,19.3,57.6,"NA"]
["THERMAL ANEMOMETER *",2.4,19.3,57.6,"NA"]
["TILLER (HAND)",4.0999999999999996,32,96.1,"NA"]
["TILLER (ROTARY w/ SLIP CLUTCH)",12,96.1,288.3,"NA"]
["TRACKHOE (UP TO & INCLUDING 200 HP)",81.7,653.4,1960.3,"NA"]
["TRACKHOE (OVER 200 HP)",163.4,1306.9000000000001,3920.7,"NA"]
["TRACTOR WITH TRAILER, FRONT END LOADER & BOX BLADE OR HITCH",40.799999999999997,326.7,980.2,"NA"]
["TRANSDUCER",32,256.3,768.8,"NA"]
["SOIL/WATER HOLDING CONTAINER (Skid or RAC tank)",10.5,83.3,358.7,"NA"]
["VACUUM TRUCK(Bobtail) – 39 HP and below",108.9,871.3,2613.8000000000002,"NA"]
["VACUUM TRUCK – 40 HP to 150 HP",140.9,1127.5,3382.6,"NA"]
["VACUUM TRUCK -  over 150 HP",197,1576,4727.8999999999996,"NA"]
["WATER LEVEL INDICATOR *",2.4,19.3,57.6,"NA"]
["PURCHASE - TREATMENT UNIT",0,0,0,"NA"]
["RENTAL - TREATMENT UNIT",0,0,0,"NA"]
["Other - Not listed (describe in Activity Description section) ",0,0,0,"NA"]
[]
[]
["Mileage Unit Rate",2.2999999999999998]
[]
["Travel Activity Type"]
["Well Groundwater Sampling"]
["Treatment Unit, O&M"]
["Free Product Recovery (Handbail of Wells)"]
["Free Product Recovery (VAC event)"]
["Treatment Unit, O&M"]
["Discharge Sampling"]
["Drilling, P/A Wells, Geoprobe"]
["Excavation"]
["System Installation"]
["Major Renovation"]
["Major Repair"]
["Soil Treatment"]
["Site Investigation"]
["Soil Confirmation Sampling"]
["Multiple Site Visits"]
["Other or Non-Unit Price Activity "]
[]
["Drilling - P&A - Type of Activity"]
["Chemical Injection"]
["Boring - Direct Push",1]
["Boring - Drilling",2]
["Monitoring Well",3]
["Extraction Well"]
["Horizontal Recovery Well"]
["Recovery Well"]
["Sparge Well"]
["Temporary Well"]
[]
["Well Description","Well diameter (inches)","Sampled (Yes/No)","Manhole cover","Rate ($/ft)","Estimated Well Auger Size (inches) ","Overdrill & Grout (P&A-1)","Pull Casing & Grout (P&A-2)","Grout only (P&A-3)"]
["Direct Push, 2 inch, sampled",2,"Yes",0,80,2.5,0,0,0]
["Direct Push, 2 inch, non-sampled",2,"No",0,{"$f":"80-15","v":65},2.5,0,0,0]
["Boring, 2 inch, sampled",2,"Yes",0,80,8.25,0,0,0]
["Boring, 2 inch, non-sampled",2,"No",0,65,8.25,0,0,0]
["Boring, 4 inch, sampled",4,"Yes",0,87,10.25,0,0,0]
["Boring, 4 inch, non-sampled",4,"No",0,{"$f":"87-15","v":72},10.25,0,0,0]
["Monitor well, 2 inch, sampled",2,"Yes",1,116,8.25,79,65,36]
["Monitor well, 2 inch, non-sampled",2,"No",1,{"$f":"116-15","v":101},8.25,79,65,36]
["Monitor/Recovery well, 4 inch, sampled",4,"Yes",1,141,10.25,108,67,43]
["Monitor/Recovery well, 4 inch, non-sampled",4,"No",1,{"$f":"141-15","v":126},10.25,108,67,43]
["Horizontal Recovery well, 4 inch, sampled",4,"No",1,168,10.25,116,86,43]
["Ozone Injection well, 2 inch or less",2,"No",1,85,8.25,79,65,36]
[]
["Direct Push or Drilling Activity Type","Minimum rates ($/day)"]
["DRILLING",4501]
["DIRECT PUSH ",3544]
["CHEMICAL INJECTION",5125]
["P&A",2156]
[]
[]
["Parameter","Cost per sample","Method"]
["Atterberg Limits (LL, PLI, PI)",56,"ASTM D4318"]
["BTEX",55,"(8021B, 602,603) "]
["BTEX/MTBE",84,"8260B"]
["BTEX/TPH-G",70,"8021B/8015"]
["Dry Density-Calculated/Unit Wt Determination",22.5,"NA"]
["EPH Analysis",160,"MA DEP"]
["Hydraulic Conductivity - Constant Head",168,"ASTM D2434"]
["Hydraulic Conductivity - Falling Head",313.5,"ASTM D5084"]
["Lead",27,"6010B or 200.7"]
["Moisture Content",8,"ASTM D2216"]
["Moisture Content/Volumetric Content",8,"ASTM D2216"]
["MTBE",84,"8260B"]
["Organic matter",45,"ASTM D2974"]
["Organic Matter/Fractional Organic Carbon",45,"ASTM D2974"]
["PAH - 8270",200,8270]
["PAH - 8310",135,8310]
["Particle Size Analysis – Hydrometer",106.5,"ASTM 422"]
["Particle Size Analysis – Sieve",56,"ASTM 422"]
["RCRA Metals",135,6010]
["Soil pH",28,"ASTM D4972"]
["Specific Gravity",100,"ASTM D854"]
["SPLP Analysis",40,1312]
["TCLP",40,1311]
["TOC",30,"415.1 or 415.2"]
["Total Porosity - Calculated",62]
["TPH-D (RECAP DRO)",65,8015]
["TPH-G (RECAP GRO)",45,8015]
["TPH-O",65,8015]
["Triaxial Permeability - Falling Head",313.5,"ASTM D5084"]
["Unified Soil Classification System",45,"ASTM D2487"]
["VPH Analysis (TPH-G Fractions)",135,"MA DEP"]
["Combination - BTEX/MTBE, VPH Analysis (TPH-G Fractions)",219,"8260B, MA DEP"]
["Combination - BTEX, VPH Analysis (TPH-G Fractions)",190,"(8021B, 602,603) , MA DEP"]
["Combination - MTBE, VPH Analysis (TPH-G Fractions)",219,"8260B, MA DEP"]
["Combination - BTEX, Lead, VPH Analysis (TPH-G Fractions)",217,"(8021B, 602,603) , 6010B or 200.7, MA DEP"]
["Combination - BTEX/MTBE, Lead, VPH Analysis (TPH-G Fractions)",246,"8260B, 6010B or 200.7, MA DEP"]
["Combination - BTEX, TOC, Lead",112,"(8021B, 602,603) , 415.1 or 415.2, 6010B or 200.7"]
["Combination - EPH Analysis, PAH - 8310",295,"MA DEP, 8310"]
["Combination - EPH Analysis, PAH - 8310, RCRA Metals",430,"MA DEP, 8310, 6010"]
["Combination - SPLP Analysis, VPH Analysis (TPH-G Fractions)",175,"1312, MA DEP"]
["Combination - SPLP Analysis, EPH Analysis",200,"1312, MA DEP"]
["RAC Analysis Markup",0,"NA"]
["Lab Rush Charges",0,"NA"]
[]
["Aquifer Test","Cost"]
["1st well",1375]
["Subsequent wells",385]
[]
["Activity Description","Initial","Other"]
["Groundwater Sampling",720,224]
["Free Product recovery",218,72]
["Gauging wells",28,28]
["Discharge Sampling Event",289]
["Mob/Demob",352]
["Obtaining offsite access",505]
[]
[]
["Bid Package Prep"]
[null,"$0.00 - $1,999.99","$2,000.00 - $9,999.99","$10,000.00 and greater","NA"]
["Work Value Based",0,145,370]
["Treatment System Purchase",720]
["Chemical Injection Events",720]
["Used Treatment System Sale",0]
["Treatment System Installation",2156]
[]
["LDEQ Permits"]
["Air Exemption",1731]
["Air Permit (Small Source)",5766]
["LPDES Water",2156]
[]
["Groundwater Monitoring Reports"]
["Type","Treatment (Yes/No)","Initial/ Subsequent","Concatenate","Cost"]
["Annual","Yes","Initial",{"$f":"CONCATENATE(A199,B199,C199)","v":"AnnualYesInitial"},3949]
["Annual","Yes","Subsequent","AnnualYesSubsequent",3592]
["Annual","No","Initial","AnnualNoInitial",2514]
["Annual","No","Subsequent","AnnualNoSubsequent",2156]
["Semi-annual","Yes","Initial","Semi-annualYesInitial",3949]
["Semi-annual","Yes","Subsequent","Semi-annualYesSubsequent",3592]
["Semi-annual","No","Initial","Semi-annualNoInitial",2514]
["Semi-annual","No","Subsequent","Semi-annualNoSubsequent",2156]
["Quarterly","Yes","Initial","QuarterlyYesInitial",3592]
["Quarterly","Yes","Subsequent","QuarterlyYesSubsequent",3227]
["Quarterly","No","Initial","QuarterlyNoInitial",2156]
["Quarterly","No","Subsequent","QuarterlyNoSubsequent",1793]
[]
["Generic Reports"]
["Report type","Cost"]
["System Design and Planning",5766]
["Remediation Oversight Group Meeting Preparation and Attendance",865]
[]
[]
[]
["O&M rates"]
["Status","Unit Type","Frequency","Concatenate","Rates"]
["Active","Type 1","Weekly","Active, Type 1, Weekly",462]
["Active","Type 1","Biweekly","Active, Type 1, Biweekly",924]
["Active","Type 2","Weekly","Active, Type 2, Weekly",284]
["Active","Type 2","Biweekly","Active, Type 2, Biweekly",566]
["Active","Type 3","Weekly","Active, Type 3, Weekly",308]
["Active","Type 3","Biweekly","Active, Type 3, Biweekly",616]
["Post","Type 1","Monthly","Post, Type 1, Monthly",462]
["Post","Type 1","Quarterly","Post, Type 1, Quarterly",770]
["Post","Type 2","Monthly","Post, Type 2, Monthly",284]
["Post","Type 2","Quarterly","Post, Type 2, Quarterly",474]
["Post","Type 3","Monthly","Post, Type 3, Monthly",308]
["Post","Type 3","Quarterly","Post, Type 3, Quarterly",512]
[]
["Additional O&M unit rates","Rate"]
["Additional Treatment unit add-on",246]
["Oil Change(40 HP or less)",3450]
["Oil Change(> 40 HP)",616]
["Stripperator Cleaning",1109]
[]
["Vacuum Event Reporting"]
["Description","First Event","Additional Events","No longer needed"]
["Free Product Recovery Only",811,233]
["Free Product Recovery & Vapor Calc.",2156,924]
["Vacuum Extraction Pilot Test",4018,0]
[]
["Corrective Action Plan"]
["Type","Rate","Max"]
["Category 1 - Complete CAP",9020]
["Category 1 - Scoping Meeting",{"$f":"B248*0.4","v":3608}]
["Category 1 - ROG Approval",{"$f":"B248*0.6","v":5412}]
["Category 2",3300]
["Category 3",0.1,4928]
["Category 4",825]
["Category 5",0.05,2464]
["Category 6",0.05,1232]
["Prior to Category types"]
[]
["P&A reports"]
["Type","Rate"]
["P & A Report",924]
["P&A Work Plan",128]
[]
["RECAP reports"]
["Type","Rate"]
["Appendix I Only for Gas, Diesel or Oil",9020]
["Appendix I addon for combination of Gas, Diesel, or Motor Oil",640]
["Appendix I addon for sites with >20 borings",640]
["MO-1 RECAP",4312]
["Response to Team Leader/ROG requested revisions",880]
["RECAP Input Parameters Form",880]
["Addon per Enclosed structure",640]
[]
["Site Investigation or Soil Confirmation reports"]
["Type","Rate","Mininum","Maximum"]
["Site Investigation Workplan",0.04,640,1232]
["Soil Confirmation Workplan",0.04,640,1232]
["Site Investigation Report",0.17,0,12320]
["Soil Confirmation Report",0.17,0,12320]
[]
["Construction and Operations Report"]
["With System Installation (Dual/Single Phase Extractions, Ozone, etc.)",2267]
["Without System Installation (e.g Chemical Injection, etc)",961]
["Excavations greater than or equal to 675 tons ",3696.0000000000005]
["Excavations less than 675 tons",2218]
[]
["Conveyance Notice","Rate"]
["Notice per affected property",1478]
[]
["Trust Fund Application options"]
["Type","Rate"]
["Both field activities and reporting charges",440]
["Reporting charges only",220]
[]
["Drum disposal"]
["Type","Rate"]
["1st drum",338]
["Additional drums",254]
["Minimum",845]
[]
["Discharge Reports"]
["Type","Rate"]
["Discharge report with discharge",275]
["Discharge report without discharge",96]
[]
["Reviewer List"]
["Madalyn Marcel"]
["Meagan Arnold"]
["Carlye Roussel"]
["Joshua Welch"]
["Tonjia Scott"]
[]
[]
["Part 7 Dropdown"]
["Dual Phase Vacumm Extraction"]
["Ozone"]
["SVE"]
["Groundwater Pump & Treat"]
["Other"]
[]
["High Resolution Site Characterization"]
["Activity Description","Rate","Max days"]
["HRSC (0 to 2 day event)(Half day rate)",4757,2]
["HRSC (0 to 2 day event)(Full day rate)",8070,2]
["HRSC (> 2 day event)(Half day rate)",3757,10]
["HRSC (> 2 day event)(Full day rate)",6403,10]
["Intergrated Site Visualization report with 3D modeling",5000]
["Event Planning",659]

{"sheet":"ExcData","index":22,"n_rows":5019,"n_cols":10,"rows_kept":5019,"cut":false,"hidden":true,"merged":[[1,0,1,5],[7,0,7,2],[1,8,2,8],[1,9,2,9],[6,8,7,8],[6,9,7,9]]}
[]
["TONNAGE 1 - 99",null,null,null,null,null,null,null,"Previous Rates - $/ton","% increase"]
[]
["Minimum Price",null,null,null,null,{"$f":"ROUND(I4*(1+J4),2)","v":11385.92},null,null,9900.7999999999993,0.15]
["Price / Ton (1 - 99 tons)",null,null,null,null,{"$f":"ROUND(I5*(1+J5),2)","v":133.94999999999999},null,null,116.48,0.15]
[]
[null,null,null,null,"VARIABLE",null,null,null,"Previous Rates - $/ton","% increase"]
["Tonnage Ranges",null,null,"Range Amounts","Price / Ton","Increments"]
[100,"-",250,{"$f":"C9-A9","v":150},{"$f":"ROUND(I9*(1+J9),2)","v":247.81},{"$f":"(E9-E10)/D9","v":0.33040000000000003},null,null,215.49,0.15]
[251,"-",500,{"$f":"C10-C9","v":250},{"$f":"ROUND(I10*(1+J10),2)","v":198.25},{"$f":"(E10-E11)/D10","v":0.13927999999999996},null,{"$f":"E9-E10","v":49.56},172.39,0.15]
[501,"-",1000,{"$f":"C11-C10","v":500},163.43,{"$f":"(E11-E12)/D11","v":5.8960000000000033E-2},null,{"$f":"E10-E11","v":34.819999999999993},142.11000000000001,0.15]
[1001,"-",2000,{"$f":"C12-C11","v":1000},133.94999999999999,{"$f":"(E12-E13)/D12","v":1.3399999999999992E-2},null,{"$f":"E11-E12","v":29.480000000000018},116.48,0.15]
[2001,"<",null,null,120.55,null,null,{"$f":"E12-E13","v":13.399999999999991},104.83,0.15]
[]
[]
[]
[null,null,null,"TONS","PRICE / TON","TOTAL"]
[null,null,null,1,{"$f":"F18/D18","v":11519.87},{"$f":"+$F$4+($F$5*D18)","v":11519.87}]
[null,null,null,2,5826.91,11653.82]
[null,null,null,3,3929.2566666666667,11787.77]
[null,null,null,4,2980.43,11921.72]
[null,null,null,5,2411.134,12055.67]
[null,null,null,6,2031.6033333333335,12189.62]
[null,null,null,7,1760.51,12323.57]
[null,null,null,8,1557.19,12457.52]
[null,null,null,9,1399.0522222222221,12591.47]
[null,null,null,10,1272.5419999999999,12725.42]
[null,null,null,11,1169.0336363636363,12859.369999999999]
[null,null,null,12,1082.7766666666666,12993.32]
[null,null,null,13,1009.7900000000001,13127.27]
[null,null,null,14,947.2299999999999,13261.22]
[null,null,null,15,893.01133333333337,13395.17]
[null,null,null,16,845.56999999999994,13529.119999999999]
[null,null,null,17,803.71,13663.07]
[null,null,null,18,766.50111111111119,13797.02]
[null,null,null,19,733.20894736842104,13930.97]
[null,null,null,20,703.24599999999998,14064.92]
[null,null,null,21,676.13666666666666,14198.869999999999]
[null,null,null,22,651.49181818181819,14332.82]
[null,null,null,23,628.99,14466.77]
[null,null,null,24,608.36333333333334,14600.72]
[null,null,null,25,589.38679999999999,14734.67]
[null,null,null,26,571.87,14868.619999999999]
[null,null,null,27,555.65074074074073,15002.57]
[null,null,null,28,540.59,15136.52]
[null,null,null,29,526.56793103448274,15270.47]
[null,null,null,30,513.48066666666671,15404.42]
[null,null,null,31,501.23774193548383,15538.369999999999]
[null,null,null,32,489.76,15672.32]
[null,null,null,33,478.97787878787881,15806.27]
[null,null,null,34,468.83,15940.22]
[null,null,null,35,459.262,16074.17]
[null,null,null,36,450.2255555555555,16208.119999999999]
[null,null,null,37,441.67756756756756,16342.07]
[null,null,null,38,433.57947368421054,16476.02]
[null,null,null,39,425.8966666666667,16609.97]
[null,null,null,40,418.59799999999996,16743.919999999998]
[null,null,null,41,411.65536585365851,16877.87]
[null,null,null,42,405.04333333333335,17011.82]
[null,null,null,43,398.73883720930235,17145.77]
[null,null,null,44,392.72090909090912,17279.72]
[null,null,null,45,386.97044444444441,17413.669999999998]
[null,null,null,46,381.46999999999997,17547.62]
[null,null,null,47,376.20361702127661,17681.57]
[null,null,null,48,371.15666666666669,17815.52]
[null,null,null,49,366.31571428571431,17949.47]
[null,null,null,50,361.66839999999996,18083.419999999998]
[null,null,null,51,357.20333333333332,18217.37]
[null,null,null,52,352.90999999999997,18351.32]
[null,null,null,53,348.778679245283,18485.27]
[null,null,null,54,344.80037037037039,18619.22]
[null,null,null,55,340.96672727272727,18753.169999999998]
[null,null,null,56,337.27,18887.12]
[null,null,null,57,333.70298245614032,19021.07]
[null,null,null,58,330.25896551724139,19155.02]
[null,null,null,59,326.93169491525424,19288.97]
[null,null,null,60,323.71533333333332,19422.919999999998]
[null,null,null,61,320.60442622950819,19556.87]
[null,null,null,62,317.59387096774191,19690.82]
[null,null,null,63,314.67888888888882,19824.769999999997]
[null,null,null,64,311.85500000000002,19958.72]
[null,null,null,65,{"$f":"F82/D82","v":309.11799999999999},{"$f":"+$F$4+($F$5*D82)","v":20092.669999999998}]
[null,null,null,66,306.46393939393937,20226.62]
[null,null,null,67,303.88910447761191,20360.57]
[null,null,null,68,301.38999999999993,20494.519999999997]
[null,null,null,69,298.96333333333337,20628.47]
[null,null,null,70,296.60599999999999,20762.419999999998]
[null,null,null,71,294.3150704225352,20896.37]
[null,null,null,72,292.08777777777777,21030.32]
[null,null,null,73,289.92150684931505,21164.269999999997]
[null,null,null,74,287.81378378378378,21298.22]
[null,null,null,75,285.76226666666662,21432.17]
[null,null,null,76,283.76473684210526,21566.12]
[null,null,null,77,281.8190909090909,21700.07]
[null,null,null,78,279.92333333333329,21834.019999999997]
[null,null,null,79,278.07556962025319,21967.97]
[null,null,null,80,276.274,22101.919999999998]
[null,null,null,81,274.51691358024692,22235.87]
[null,null,null,82,272.80268292682928,22369.82]
[null,null,null,83,271.12975903614455,22503.769999999997]
[null,null,null,84,269.49666666666667,22637.72]
[null,null,null,85,267.90199999999999,22771.67]
[null,null,null,86,266.34441860465114,22905.62]
[null,null,null,87,264.82264367816094,23039.57]
[null,null,null,88,263.33545454545452,23173.519999999997]
[null,null,null,89,261.88168539325846,23307.47]
[null,null,null,90,260.46022222222223,23441.42]
[null,null,null,91,259.07,23575.37]
[null,null,null,92,257.70999999999998,23709.32]
[null,null,null,93,256.3792473118279,23843.269999999997]
[null,null,null,94,255.0768085106383,23977.22]
[null,null,null,95,253.80178947368418,24111.17]
[null,null,null,96,252.55333333333331,24245.119999999999]
[null,null,null,97,251.33061855670104,24379.07]
[null,null,null,98,250.13285714285712,24513.019999999997]
[null,null,null,99,248.95929292929293,24646.97]
[null,null,null,100,{"$f":"E9","v":247.81},{"$f":"E117*D117","v":24781}]
[null,null,null,101,{"$f":"E117-$F$9","v":247.4796},24995.439600000002]
[null,null,null,102,247.14920000000001,25209.218400000002]
[null,null,null,103,246.81880000000001,25422.3364]
[null,null,null,104,246.48840000000001,25634.793600000001]
[null,null,null,105,246.15800000000002,25846.59]
[null,null,null,106,245.82760000000002,26057.725600000002]
[null,null,null,107,245.49720000000002,26268.200400000002]
[null,null,null,108,245.16680000000002,26478.014400000004]
[null,null,null,109,244.83640000000003,26687.167600000004]
[null,null,null,110,244.50600000000003,26895.660000000003]
[null,null,null,111,244.17560000000003,27103.491600000005]
[null,null,null,112,243.84520000000003,27310.662400000005]
[null,null,null,113,243.51480000000004,27517.172400000003]
[null,null,null,114,243.18440000000004,27723.021600000004]
[null,null,null,115,242.85400000000004,27928.210000000006]
[null,null,null,116,242.52360000000004,28132.737600000004]
[null,null,null,117,242.19320000000005,28336.604400000004]
[null,null,null,118,241.86280000000005,28539.810400000006]
[null,null,null,119,241.53240000000005,28742.355600000006]
[null,null,null,120,241.20200000000006,28944.240000000005]
[null,null,null,121,240.87160000000006,29145.463600000006]
[null,null,null,122,240.54120000000006,29346.026400000006]
[null,null,null,123,240.21080000000006,29545.928400000008]
[null,null,null,124,239.88040000000007,29745.169600000008]
[null,null,null,125,239.55000000000007,29943.750000000007]
[null,null,null,126,239.21960000000007,30141.669600000008]
[null,null,null,127,238.88920000000007,30338.928400000008]
[null,null,null,128,238.55880000000008,30535.52640000001]
[null,null,null,129,238.22840000000008,30731.46360000001]
[null,null,null,130,237.89800000000008,30926.740000000009]
[null,null,null,131,237.56760000000008,31121.35560000001]
[null,null,null,132,237.23720000000009,31315.310400000013]
[null,null,null,133,236.90680000000009,31508.604400000011]
[null,null,null,134,236.57640000000009,31701.237600000011]
[null,null,null,135,236.24600000000009,31893.210000000014]
[null,null,null,136,235.9156000000001,32084.521600000015]
[null,null,null,137,235.5852000000001,32275.172400000014]
[null,null,null,138,235.2548000000001,32465.162400000016]
[null,null,null,139,234.92440000000011,32654.491600000016]
[null,null,null,140,234.59400000000011,32843.160000000018]
[null,null,null,141,234.26360000000011,33031.167600000015]
[null,null,null,142,233.93320000000011,33218.514400000015]
[null,null,null,143,233.60280000000012,33405.200400000016]
[null,null,null,144,233.27240000000012,33591.22560000002]
[null,null,null,145,232.94200000000012,33776.590000000018]
[null,null,null,146,232.61160000000012,33961.293600000019]
[null,null,null,147,232.28120000000013,34145.336400000022]
[null,null,null,148,231.95080000000013,34328.71840000002]
[null,null,null,149,231.62040000000013,34511.43960000002]
[null,null,null,150,231.29000000000013,34693.500000000022]
[null,null,null,151,230.95960000000014,34874.899600000019]
[null,null,null,152,230.62920000000014,35055.638400000018]
[null,null,null,153,230.29880000000014,35235.716400000019]
[null,null,null,154,229.96840000000014,35415.133600000023]
[null,null,null,155,229.63800000000015,35593.890000000021]
[null,null,null,156,229.30760000000015,35771.985600000022]
[null,null,null,157,228.97720000000015,35949.420400000025]
[null,null,null,158,228.64680000000016,36126.194400000022]
[null,null,null,159,228.31640000000016,36302.307600000022]
[null,null,null,160,227.98600000000016,36477.760000000024]
[null,null,null,161,227.65560000000016,36652.551600000028]
[null,null,null,162,227.32520000000017,36826.682400000027]
[null,null,null,163,226.99480000000017,37000.152400000028]
[null,null,null,164,226.66440000000017,{"$f":"E181*D181","v":37172.961600000031}]
[null,null,null,165,{"$f":"E181-$F$9","v":226.33400000000017},37345.11000000003]
[null,null,null,166,226.00360000000018,37516.59760000003]
[null,null,null,167,225.67320000000018,37687.424400000033]
[null,null,null,168,225.34280000000018,37857.59040000003]
[null,null,null,169,225.01240000000018,38027.09560000003]
[null,null,null,170,224.68200000000019,38195.940000000031]
[null,null,null,171,224.35160000000019,38364.123600000035]
[null,null,null,172,224.02120000000019,38531.646400000034]
[null,null,null,173,223.69080000000019,38698.508400000035]
[null,null,null,174,223.3604000000002,38864.709600000031]
[null,null,null,175,223.0300000000002,39030.250000000036]
[null,null,null,176,222.6996000000002,39195.129600000037]
[null,null,null,177,222.36920000000021,39359.348400000039]
[null,null,null,178,222.03880000000021,39522.906400000036]
[null,null,null,179,221.70840000000021,39685.803600000036]
[null,null,null,180,221.37800000000021,39848.040000000037]
[null,null,null,181,221.04760000000022,40009.615600000041]
[null,null,null,182,220.71720000000022,40170.53040000004]
[null,null,null,183,220.38680000000022,40330.78440000004]
[null,null,null,184,220.05640000000022,40490.377600000043]
[null,null,null,185,219.72600000000023,40649.310000000041]
[null,null,null,186,219.39560000000023,40807.581600000041]
[null,null,null,187,219.06520000000023,40965.192400000044]
[null,null,null,188,218.73480000000023,41122.142400000041]
[null,null,null,189,218.40440000000024,41278.431600000047]
[null,null,null,190,218.07400000000024,41434.060000000049]
[null,null,null,191,217.74360000000024,41589.027600000045]
[null,null,null,192,217.41320000000024,41743.334400000051]
[null,null,null,193,217.08280000000025,41896.980400000051]
[null,null,null,194,216.75240000000025,42049.965600000047]
[null,null,null,195,216.42200000000025,42202.290000000052]
[null,null,null,196,216.09160000000026,42353.953600000052]
[null,null,null,197,215.76120000000026,42504.956400000054]
[null,null,null,198,215.43080000000026,42655.298400000051]
[null,null,null,199,215.10040000000026,42804.97960000005]
[null,null,null,200,214.77000000000027,42954.000000000051]
[null,null,null,201,214.43960000000027,43102.359600000054]
[null,null,null,202,214.10920000000027,43250.058400000053]
[null,null,null,203,213.77880000000027,43397.096400000053]
[null,null,null,204,213.44840000000028,43543.473600000056]
[null,null,null,205,213.11800000000028,43689.190000000061]
[null,null,null,206,212.78760000000028,43834.24560000006]
[null,null,null,207,212.45720000000028,43978.640400000062]
[null,null,null,208,212.12680000000029,44122.374400000059]
[null,null,null,209,211.79640000000029,44265.447600000058]
[null,null,null,210,211.46600000000029,44407.860000000059]
[null,null,null,211,211.1356000000003,44549.611600000062]
[null,null,null,212,210.8052000000003,44690.70240000006]
[null,null,null,213,210.4748000000003,44831.13240000006]
[null,null,null,214,210.1444000000003,44970.901600000063]
[null,null,null,215,209.81400000000031,45110.010000000068]
[null,null,null,216,209.48360000000031,45248.457600000067]
[null,null,null,217,209.15320000000031,45386.244400000069]
[null,null,null,218,208.82280000000031,45523.370400000065]
[null,null,null,219,208.49240000000032,45659.835600000071]
[null,null,null,220,208.16200000000032,45795.640000000072]
[null,null,null,221,207.83160000000032,45930.783600000068]
[null,null,null,222,207.50120000000032,46065.266400000073]
[null,null,null,223,207.17080000000033,46199.088400000073]
[null,null,null,224,206.84040000000033,46332.249600000076]
[null,null,null,225,206.51000000000033,46464.750000000073]
[null,null,null,226,206.17960000000033,46596.589600000072]
[null,null,null,227,205.84920000000034,46727.768400000074]
[null,null,null,228,205.51880000000034,{"$f":"E245*D245","v":46858.286400000077}]
[null,null,null,229,{"$f":"E245-$F$9","v":205.18840000000034},46988.143600000076]
[null,null,null,230,204.85800000000035,47117.340000000077]
[null,null,null,231,204.52760000000035,47245.875600000079]
[null,null,null,232,204.19720000000035,47373.750400000084]
[null,null,null,233,203.86680000000035,47500.964400000084]
[null,null,null,234,203.53640000000036,47627.517600000087]
[null,null,null,235,203.20600000000036,47753.410000000084]
[null,null,null,236,202.87560000000036,47878.641600000083]
[null,null,null,237,202.54520000000036,48003.212400000084]
[null,null,null,238,202.21480000000037,48127.122400000088]
[null,null,null,239,201.88440000000037,48250.371600000086]
[null,null,null,240,201.55400000000037,48372.960000000086]
[null,null,null,241,201.22360000000037,48494.887600000089]
[null,null,null,242,200.89320000000038,48616.154400000094]
[null,null,null,243,200.56280000000038,48736.760400000094]
[null,null,null,244,200.23240000000038,48856.705600000096]
[null,null,null,245,199.90200000000038,48975.990000000093]
[null,null,null,246,199.57160000000039,49094.613600000099]
[null,null,null,247,199.24120000000039,49212.576400000093]
[null,null,null,248,198.91080000000039,49329.878400000096]
[null,null,null,249,198.5804000000004,49446.519600000101]
[null,null,null,250,198.2500000000004,49562.500000000102]
[null,null,null,251,{"$f":"E267-$F$10","v":198.11072000000038},49725.790720000099]
[null,null,null,252,197.97144000000037,49888.80288000009]
[null,null,null,253,197.83216000000036,50051.53648000009]
[null,null,null,254,197.69288000000034,50213.991520000091]
[null,null,null,255,197.55360000000033,50376.168000000085]
[null,null,null,256,197.41432000000032,50538.065920000081]
[null,null,null,257,197.2750400000003,50699.685280000078]
[null,null,null,258,197.13576000000029,50861.026080000076]
[null,null,null,259,196.99648000000028,51022.088320000068]
[null,null,null,260,196.85720000000026,51182.872000000069]
[null,null,null,261,196.71792000000025,51343.377120000063]
[null,null,null,262,196.57864000000023,51503.603680000058]
[null,null,null,263,196.43936000000022,51663.551680000055]
[null,null,null,264,196.30008000000021,51823.221120000053]
[null,null,null,265,196.16080000000019,51982.612000000052]
[null,null,null,266,196.02152000000018,52141.724320000045]
[null,null,null,267,195.88224000000017,52300.558080000046]
[null,null,null,268,195.74296000000015,52459.113280000041]
[null,null,null,269,195.60368000000014,52617.389920000038]
[null,null,null,270,195.46440000000013,52775.388000000035]
[null,null,null,271,195.32512000000011,52933.107520000027]
[null,null,null,272,195.1858400000001,53090.548480000027]
[null,null,null,273,195.04656000000008,53247.710880000021]
[null,null,null,274,194.90728000000007,53404.594720000023]
[null,null,null,275,194.76800000000006,53561.200000000019]
[null,null,null,276,194.62872000000004,53717.526720000009]
[null,null,null,277,194.48944000000003,53873.574880000007]
[null,null,null,278,194.35016000000002,54029.344480000007]
[null,null,null,279,194.21088,54184.835520000001]
[null,null,null,280,194.07159999999999,54340.047999999995]
[null,null,null,281,193.93231999999998,54494.981919999991]
[null,null,null,282,193.79303999999996,54649.637279999988]
[null,null,null,283,193.65375999999995,54804.014079999986]
[null,null,null,284,193.51447999999993,54958.112319999978]
[null,null,null,285,193.37519999999992,55111.931999999979]
[null,null,null,286,193.23591999999991,55265.473119999973]
[null,null,null,287,193.09663999999989,55418.735679999969]
[null,null,null,288,192.95735999999988,55571.719679999966]
[null,null,null,289,192.81807999999987,55724.425119999963]
[null,null,null,290,192.67879999999985,55876.851999999955]
[null,null,null,291,192.53951999999984,56029.000319999956]
[null,null,null,292,192.40023999999983,{"$f":"E309*D309","v":56180.87007999995}]
[null,null,null,293,192.26095999999981,56332.461279999945]
[null,null,null,294,192.1216799999998,56483.773919999941]
[null,null,null,295,191.98239999999979,56634.807999999939]
[null,null,null,296,191.84311999999977,56785.563519999931]
[null,null,null,297,191.70383999999976,56936.040479999931]
[null,null,null,298,191.56455999999974,57086.238879999924]
[null,null,null,299,191.42527999999973,57236.158719999919]
[null,null,null,300,191.28599999999972,57385.799999999916]
[null,null,null,301,191.1467199999997,57535.162719999913]
[null,null,null,302,191.00743999999969,57684.246879999904]
[null,null,null,303,190.86815999999968,57833.052479999904]
[null,null,null,304,190.72887999999966,57981.579519999897]
[null,null,null,305,190.58959999999965,58129.827999999892]
[null,null,null,306,190.45031999999964,58277.797919999888]
[null,null,null,307,190.31103999999962,58425.489279999885]
[null,null,null,308,190.17175999999961,58572.902079999876]
[null,null,null,309,190.03247999999959,58720.036319999876]
[null,null,null,310,189.89319999999958,58866.891999999869]
[null,null,null,311,189.75391999999957,59013.469119999863]
[null,null,null,312,189.61463999999955,59159.767679999859]
[null,null,null,313,189.47535999999954,59305.787679999856]
[null,null,null,314,189.33607999999953,59451.529119999854]
[null,null,null,315,{"$f":"E331-$F$10","v":189.19679999999951},59596.991999999846]
[null,null,null,316,189.0575199999995,59742.176319999839]
[null,null,null,317,188.91823999999949,59887.08207999984]
[null,null,null,318,188.77895999999947,60031.709279999835]
[null,null,null,319,188.63967999999946,60176.057919999825]
[null,null,null,320,188.50039999999944,60320.127999999822]
[null,null,null,321,188.36111999999943,60463.919519999814]
[null,null,null,322,188.22183999999942,60607.432479999814]
[null,null,null,323,188.0825599999994,60750.666879999808]
[null,null,null,324,187.94327999999939,60893.622719999803]
[null,null,null,325,187.80399999999938,61036.299999999799]
[null,null,null,326,187.66471999999936,61178.698719999789]
[null,null,null,327,187.52543999999935,61320.818879999788]
[null,null,null,328,187.38615999999934,61462.66047999978]
[null,null,null,329,187.24687999999932,61604.223519999774]
[null,null,null,330,187.10759999999931,61745.507999999769]
[null,null,null,331,186.9683199999993,61886.513919999765]
[null,null,null,332,186.82903999999928,62027.241279999762]
[null,null,null,333,186.68975999999927,62167.690079999753]
[null,null,null,334,186.55047999999925,62307.860319999752]
[null,null,null,335,186.41119999999924,62447.751999999746]
[null,null,null,336,186.27191999999923,62587.36511999974]
[null,null,null,337,186.13263999999921,62726.699679999736]
[null,null,null,338,185.9933599999992,62865.755679999733]
[null,null,null,339,185.85407999999919,63004.533119999724]
[null,null,null,340,185.71479999999917,63143.031999999715]
[null,null,null,341,185.57551999999916,63281.252319999716]
[null,null,null,342,185.43623999999915,63419.19407999971]
[null,null,null,343,185.29695999999913,63556.857279999705]
[null,null,null,344,185.15767999999912,63694.241919999695]
[null,null,null,345,185.0183999999991,63831.347999999693]
[null,null,null,346,184.87911999999909,63968.175519999684]
[null,null,null,347,184.73983999999908,64104.724479999677]
[null,null,null,348,184.60055999999906,64240.994879999671]
[null,null,null,349,184.46127999999905,64376.986719999666]
[null,null,null,350,184.32199999999904,64512.699999999662]
[null,null,null,351,184.18271999999902,64648.13471999966]
[null,null,null,352,184.04343999999901,64783.290879999651]
[null,null,null,353,183.904159999999,64918.168479999644]
[null,null,null,354,183.76487999999898,65052.767519999637]
[null,null,null,355,183.62559999999897,65187.087999999632]
[null,null,null,356,183.48631999999895,{"$f":"E373*D373","v":65321.129919999628}]
[null,null,null,357,183.34703999999894,65454.893279999626]
[null,null,null,358,183.20775999999893,65588.378079999617]
[null,null,null,359,183.06847999999891,65721.584319999616]
[null,null,null,360,182.9291999999989,65854.51199999961]
[null,null,null,361,182.78991999999889,65987.161119999597]
[null,null,null,362,182.65063999999887,66119.531679999593]
[null,null,null,363,182.51135999999886,66251.623679999582]
[null,null,null,364,182.37207999999885,66383.43711999958]
[null,null,null,365,182.23279999999883,66514.971999999572]
[null,null,null,366,182.09351999999882,66646.228319999573]
[null,null,null,367,181.9542399999988,66777.206079999567]
[null,null,null,368,181.81495999999879,66907.905279999555]
[null,null,null,369,181.67567999999878,67038.325919999552]
[null,null,null,370,181.53639999999876,67168.467999999542]
[null,null,null,371,181.39711999999875,67298.331519999541]
[null,null,null,372,181.25783999999874,67427.916479999534]
[null,null,null,373,181.11855999999872,67557.222879999521]
[null,null,null,374,180.97927999999871,67686.250719999516]
[null,null,null,375,180.8399999999987,67814.999999999505]
[null,null,null,376,180.70071999999868,67943.470719999503]
[null,null,null,377,180.56143999999867,68071.662879999494]
[null,null,null,378,180.42215999999866,68199.576479999494]
[null,null,null,379,{"$f":"E395-$F$10","v":180.28287999999864},68327.211519999488]
[null,null,null,380,180.14359999999863,68454.567999999475]
[null,null,null,381,180.00431999999861,68581.645919999472]
[null,null,null,382,179.8650399999986,68708.445279999461]
[null,null,null,383,179.72575999999859,68834.96607999946]
[null,null,null,384,179.58647999999857,68961.208319999452]
[null,null,null,385,179.44719999999856,69087.171999999438]
[null,null,null,386,179.30791999999855,69212.857119999433]
[null,null,null,387,179.16863999999853,69338.263679999436]
[null,null,null,388,179.02935999999852,69463.391679999419]
[null,null,null,389,178.89007999999851,69588.241119999424]
[null,null,null,390,178.75079999999849,69712.811999999409]
[null,null,null,391,178.61151999999848,69837.104319999402]
[null,null,null,392,178.47223999999846,69961.118079999404]
[null,null,null,393,178.33295999999845,70084.853279999385]
[null,null,null,394,178.19367999999844,70208.309919999389]
[null,null,null,395,178.05439999999842,70331.487999999372]
[null,null,null,396,177.91511999999841,70454.387519999364]
[null,null,null,397,177.7758399999984,70577.008479999364]
[null,null,null,398,177.63655999999838,70699.350879999358]
[null,null,null,399,177.49727999999837,70821.414719999346]
[null,null,null,400,177.35799999999836,70943.199999999342]
[null,null,null,401,177.21871999999834,71064.706719999333]
[null,null,null,402,177.07943999999833,71185.934879999331]
[null,null,null,403,176.94015999999831,71306.884479999324]
[null,null,null,404,176.8008799999983,71427.55551999931]
[null,null,null,405,176.66159999999829,71547.947999999305]
[null,null,null,406,176.52231999999827,71668.061919999294]
[null,null,null,407,176.38303999999826,71787.897279999292]
[null,null,null,408,176.24375999999825,71907.454079999283]
[null,null,null,409,176.10447999999823,72026.732319999282]
[null,null,null,410,175.96519999999822,72145.731999999276]
[null,null,null,411,175.82591999999821,72264.453119999263]
[null,null,null,412,175.68663999999819,72382.895679999259]
[null,null,null,413,175.54735999999818,72501.059679999249]
[null,null,null,414,175.40807999999817,72618.945119999247]
[null,null,null,415,175.26879999999815,72736.551999999239]
[null,null,null,416,175.12951999999814,72853.880319999225]
[null,null,null,417,174.99023999999812,72970.93007999922]
[null,null,null,418,174.85095999999811,73087.701279999208]
[null,null,null,419,174.7116799999981,73204.193919999205]
[null,null,null,420,174.57239999999808,{"$f":"E437*D437","v":73320.407999999195}]
[null,null,null,421,174.43311999999807,73436.343519999195]
[null,null,null,422,174.29383999999806,73552.000479999173]
[null,null,null,423,174.15455999999804,73667.378879999174]
[null,null,null,424,174.01527999999803,73782.47871999917]
[null,null,null,425,173.87599999999802,73897.299999999159]
[null,null,null,426,173.736719999998,74011.842719999142]
[null,null,null,427,173.59743999999799,74126.106879999148]
[null,null,null,428,173.45815999999797,74240.092479999134]
[null,null,null,429,173.31887999999796,74353.799519999127]
[null,null,null,430,173.17959999999795,74467.227999999115]
[null,null,null,431,173.04031999999793,74580.377919999111]
[null,null,null,432,172.90103999999792,74693.249279999101]
[null,null,null,433,172.76175999999791,74805.8420799991]
[null,null,null,434,172.62247999999789,74918.156319999092]
[null,null,null,435,172.48319999999788,75030.191999999079]
[null,null,null,436,172.34391999999787,75141.949119999073]
[null,null,null,437,172.20463999999785,75253.427679999062]
[null,null,null,438,172.06535999999784,75364.627679999059]
[null,null,null,439,171.92607999999782,75475.54911999905]
[null,null,null,440,171.78679999999781,75586.191999999035]
[null,null,null,441,171.6475199999978,75696.556319999028]
[null,null,null,442,171.50823999999778,75806.642079999016]
[null,null,null,443,{"$f":"E459-$F$10","v":171.36895999999777},75916.449279999011]
[null,null,null,444,171.22967999999776,76025.977919999001]
[null,null,null,445,171.09039999999774,76135.227999998999]
[null,null,null,446,170.95111999999773,76244.199519998991]
[null,null,null,447,170.81183999999772,76352.892479998976]
[null,null,null,448,170.6725599999977,76461.306879998971]
[null,null,null,449,170.53327999999769,76569.442719998959]
[null,null,null,450,170.39399999999767,76677.299999998955]
[null,null,null,451,170.25471999999766,76784.878719998946]
[null,null,null,452,170.11543999999765,76892.17887999893]
[null,null,null,453,169.97615999999763,76999.200479998923]
[null,null,null,454,169.83687999999762,77105.943519998924]
[null,null,null,455,169.69759999999761,77212.407999998904]
[null,null,null,456,169.55831999999759,77318.593919998908]
[null,null,null,457,169.41903999999758,77424.501279998891]
[null,null,null,458,169.27975999999757,77530.130079998882]
[null,null,null,459,169.14047999999755,77635.480319998882]
[null,null,null,460,169.00119999999754,77740.551999998861]
[null,null,null,461,168.86191999999753,77845.345119998863]
[null,null,null,462,168.72263999999751,77949.859679998845]
[null,null,null,463,168.5833599999975,78054.095679998834]
[null,null,null,464,168.44407999999748,78158.053119998833]
[null,null,null,465,168.30479999999747,78261.731999998825]
[null,null,null,466,168.16551999999746,78365.132319998811]
[null,null,null,467,168.02623999999744,78468.254079998806]
[null,null,null,468,167.88695999999743,78571.097279998794]
[null,null,null,469,167.74767999999742,78673.661919998791]
[null,null,null,470,167.6083999999974,78775.947999998782]
[null,null,null,471,167.46911999999739,78877.955519998766]
[null,null,null,472,167.32983999999738,78979.684479998759]
[null,null,null,473,167.19055999999736,79081.134879998746]
[null,null,null,474,167.05127999999735,79182.306719998742]
[null,null,null,475,166.91199999999733,79283.199999998731]
[null,null,null,476,166.77271999999732,79383.814719998729]
[null,null,null,477,166.63343999999731,79484.15087999872]
[null,null,null,478,166.49415999999729,79584.208479998706]
[null,null,null,479,166.35487999999728,79683.9875199987]
[null,null,null,480,166.21559999999727,79783.487999998688]
[null,null,null,481,166.07631999999725,79882.709919998684]
[null,null,null,482,165.93703999999724,79981.653279998674]
[null,null,null,483,165.79775999999723,80080.318079998659]
[null,null,null,484,165.65847999999721,{"$f":"E501*D501","v":80178.704319998651}]
[null,null,null,485,165.5191999999972,80276.811999998637]
[null,null,null,486,165.37991999999718,80374.641119998632]
[null,null,null,487,165.24063999999717,80472.191679998621]
[null,null,null,488,165.10135999999716,80569.463679998618]
[null,null,null,489,164.96207999999714,80666.457119998609]
[null,null,null,490,164.82279999999713,80763.171999998594]
[null,null,null,491,164.68351999999712,80859.608319998588]
[null,null,null,492,164.5442399999971,80955.766079998575]
[null,null,null,493,164.40495999999709,81051.645279998571]
[null,null,null,494,164.26567999999708,81147.245919998561]
[null,null,null,495,164.12639999999706,81242.567999998544]
[null,null,null,496,163.98711999999705,81337.611519998536]
[null,null,null,497,163.84783999999703,81432.376479998522]
[null,null,null,498,163.70855999999702,81526.862879998516]
[null,null,null,499,163.56927999999701,81621.070719998505]
[null,null,null,500,163.42999999999699,81714.999999998501]
[null,null,null,501,{"$f":"E517-$F$11","v":163.37103999999698},81848.891039998489]
[null,null,null,502,163.31207999999697,81982.664159998472]
[null,null,null,503,163.25311999999695,82116.319359998466]
[null,null,null,504,163.19415999999694,82249.856639998456]
[null,null,null,505,163.13519999999693,82383.275999998456]
[null,null,null,506,163.07623999999691,82516.577439998437]
[null,null,null,507,163.0172799999969,82649.760959998428]
[null,null,null,508,162.95831999999689,82782.826559998415]
[null,null,null,509,162.89935999999688,82915.774239998413]
[null,null,null,510,162.84039999999686,83048.603999998406]
[null,null,null,511,162.78143999999685,83181.315839998395]
[null,null,null,512,162.72247999999684,83313.90975999838]
[null,null,null,513,162.66351999999682,83446.385759998375]
[null,null,null,514,162.60455999999681,83578.743839998366]
[null,null,null,515,162.5455999999968,83710.983999998352]
[null,null,null,516,162.48663999999678,83843.106239998335]
[null,null,null,517,162.42767999999677,83975.110559998328]
[null,null,null,518,162.36871999999676,84106.996959998316]
[null,null,null,519,162.30975999999674,84238.765439998315]
[null,null,null,520,162.25079999999673,84370.415999998295]
[null,null,null,521,162.19183999999672,84501.948639998285]
[null,null,null,522,162.1328799999967,84633.363359998286]
[null,null,null,523,162.07391999999669,84764.660159998268]
[null,null,null,524,162.01495999999668,84895.83903999826]
[null,null,null,525,161.95599999999666,85026.899999998248]
[null,null,null,526,161.89703999999665,85157.843039998232]
[null,null,null,527,161.83807999999664,85288.668159998226]
[null,null,null,528,161.77911999999662,85419.375359998216]
[null,null,null,529,161.72015999999661,85549.964639998201]
[null,null,null,530,161.6611999999966,85680.435999998197]
[null,null,null,531,161.60223999999658,85810.789439998189]
[null,null,null,532,161.54327999999657,85941.024959998176]
[null,null,null,533,161.48431999999656,86071.142559998159]
[null,null,null,534,161.42535999999654,86201.142239998153]
[null,null,null,535,161.36639999999653,86331.023999998142]
[null,null,null,536,161.30743999999652,86460.787839998127]
[null,null,null,537,161.2484799999965,86590.433759998123]
[null,null,null,538,161.18951999999649,86719.961759998114]
[null,null,null,539,161.13055999999648,86849.371839998101]
[null,null,null,540,161.07159999999647,86978.663999998098]
[null,null,null,541,161.01263999999645,87107.838239998076]
[null,null,null,542,160.95367999999644,87236.894559998065]
[null,null,null,543,160.89471999999643,87365.832959998064]
[null,null,null,544,160.83575999999641,87494.653439998045]
[null,null,null,545,160.7767999999964,87623.355999998035]
[null,null,null,546,160.71783999999639,87751.940639998022]
[null,null,null,547,160.65887999999637,87880.407359998018]
[null,null,null,548,160.59991999999636,{"$f":"E565*D565","v":88008.756159998011}]
[null,null,null,549,160.54095999999635,88136.987039997999]
[null,null,null,550,160.48199999999633,88265.099999997983]
[null,null,null,551,160.42303999999632,88393.095039997977]
[null,null,null,552,160.36407999999631,88520.972159997968]
[null,null,null,553,160.30511999999629,88648.731359997953]
[null,null,null,554,160.24615999999628,88776.372639997935]
[null,null,null,555,160.18719999999627,88903.895999997927]
[null,null,null,556,160.12823999999625,89031.301439997915]
[null,null,null,557,160.06927999999624,89158.588959997913]
[null,null,null,558,160.01031999999623,89285.758559997892]
[null,null,null,559,159.95135999999621,89412.810239997882]
[null,null,null,560,159.8923999999962,89539.743999997867]
[null,null,null,561,159.83343999999619,89666.559839997863]
[null,null,null,562,159.77447999999617,89793.257759997854]
[null,null,null,563,159.71551999999616,89919.837759997841]
[null,null,null,564,159.65655999999615,90046.299839997824]
[null,null,null,565,{"$f":"E581-$F$11","v":159.59759999999613},90172.643999997817]
[null,null,null,566,159.53863999999612,90298.870239997806]
[null,null,null,567,159.47967999999611,90424.978559997791]
[null,null,null,568,159.42071999999609,90550.968959997786]
[null,null,null,569,159.36175999999608,90676.841439997777]
[null,null,null,570,159.30279999999607,90802.595999997764]
[null,null,null,571,159.24383999999606,90928.232639997746]
[null,null,null,572,159.18487999999604,91053.751359997739]
[null,null,null,573,159.12591999999603,91179.152159997728]
[null,null,null,574,159.06695999999602,91304.435039997712]
[null,null,null,575,159.007999999996,91429.599999997707]
[null,null,null,576,158.94903999999599,91554.647039997682]
[null,null,null,577,158.89007999999598,91679.576159997683]
[null,null,null,578,158.83111999999596,91804.387359997665]
[null,null,null,579,158.77215999999595,91929.080639997657]
[null,null,null,580,158.71319999999594,92053.655999997645]
[null,null,null,581,158.65423999999592,92178.113439997629]
[null,null,null,582,158.59527999999591,92302.452959997623]
[null,null,null,583,158.5363199999959,92426.674559997613]
[null,null,null,584,158.47735999999588,92550.778239997599]
[null,null,null,585,158.41839999999587,92674.76399999758]
[null,null,null,586,158.35943999999586,92798.631839997572]
[null,null,null,587,158.30047999999584,92922.381759997559]
[null,null,null,588,158.24151999999583,93046.013759997542]
[null,null,null,589,158.18255999999582,93169.527839997536]
[null,null,null,590,158.1235999999958,93292.923999997525]
[null,null,null,591,158.06463999999579,93416.20223999751]
[null,null,null,592,158.00567999999578,93539.362559997506]
[null,null,null,593,157.94671999999576,93662.404959997482]
[null,null,null,594,157.88775999999575,93785.329439997469]
[null,null,null,595,157.82879999999574,93908.135999997467]
[null,null,null,596,157.76983999999572,94030.824639997445]
[null,null,null,597,157.71087999999571,94153.395359997434]
[null,null,null,598,157.6519199999957,94275.848159997433]
[null,null,null,599,157.59295999999568,94398.183039997413]
[null,null,null,600,157.53399999999567,94520.399999997404]
[null,null,null,601,157.47503999999566,94642.49903999739]
[null,null,null,602,157.41607999999565,94764.480159997373]
[null,null,null,603,157.35711999999563,94886.343359997365]
[null,null,null,604,157.29815999999562,95008.088639997353]
[null,null,null,605,157.23919999999561,95129.715999997337]
[null,null,null,606,157.18023999999559,95251.225439997332]
[null,null,null,607,157.12127999999558,95372.616959997322]
[null,null,null,608,157.06231999999557,95493.890559997308]
[null,null,null,609,157.00335999999555,95615.046239997289]
[null,null,null,610,156.94439999999554,95736.083999997281]
[null,null,null,611,156.88543999999553,95857.003839997269]
[null,null,null,612,156.82647999999551,{"$f":"E629*D629","v":95977.805759997253}]
[null,null,null,613,156.7675199999955,96098.489759997246]
[null,null,null,614,156.70855999999549,96219.055839997221]
[null,null,null,615,156.64959999999547,96339.503999997221]
[null,null,null,616,156.59063999999546,96459.834239997203]
[null,null,null,617,156.53167999999545,96580.046559997194]
[null,null,null,618,156.47271999999543,96700.140959997181]
[null,null,null,619,156.41375999999542,96820.117439997164]
[null,null,null,620,156.35479999999541,96939.975999997157]
[null,null,null,621,156.29583999999539,97059.716639997147]
[null,null,null,622,156.23687999999538,97179.339359997131]
[null,null,null,623,156.17791999999537,97298.844159997112]
[null,null,null,624,156.11895999999535,97418.231039997103]
[null,null,null,625,156.05999999999534,97537.49999999709]
[null,null,null,626,156.00103999999533,97656.651039997072]
[null,null,null,627,155.94207999999531,97775.684159997065]
[null,null,null,628,155.8831199999953,97894.599359997053]
[null,null,null,629,{"$f":"E645-$F$11","v":155.82415999999529},98013.396639997038]
[null,null,null,630,155.76519999999527,98132.075999997018]
[null,null,null,631,155.70623999999526,98250.637439997008]
[null,null,null,632,155.64727999999525,98369.080959996994]
[null,null,null,633,155.58831999999524,98487.406559996991]
[null,null,null,634,155.52935999999522,98605.614239996969]
[null,null,null,635,155.47039999999521,98723.703999996957]
[null,null,null,636,155.4114399999952,98841.67583999694]
[null,null,null,637,155.35247999999518,98959.529759996934]
[null,null,null,638,155.29351999999517,99077.265759996924]
[null,null,null,639,155.23455999999516,99194.88383999691]
[null,null,null,640,155.17559999999514,99312.383999996891]
[null,null,null,641,155.11663999999513,99429.766239996883]
[null,null,null,642,155.05767999999512,99547.030559996871]
[null,null,null,643,154.9987199999951,99664.176959996854]
[null,null,null,644,154.93975999999509,99781.205439996833]
[null,null,null,645,154.88079999999508,99898.115999996822]
[null,null,null,646,154.82183999999506,100014.90863999681]
[null,null,null,647,154.76287999999505,100131.5833599968]
[null,null,null,648,154.70391999999504,100248.14015999678]
[null,null,null,649,154.64495999999502,100364.57903999677]
[null,null,null,650,154.58599999999501,100480.89999999676]
[null,null,null,651,154.527039999995,100597.10303999674]
[null,null,null,652,154.46807999999498,100713.18815999673]
[null,null,null,653,154.40911999999497,100829.15535999672]
[null,null,null,654,154.35015999999496,100945.0046399967]
[null,null,null,655,154.29119999999494,101060.73599999669]
[null,null,null,656,154.23223999999493,101176.34943999667]
[null,null,null,657,154.17327999999492,101291.84495999666]
[null,null,null,658,154.1143199999949,101407.22255999665]
[null,null,null,659,154.05535999999489,101522.48223999664]
[null,null,null,660,153.99639999999488,101637.62399999662]
[null,null,null,661,153.93743999999487,101752.6478399966]
[null,null,null,662,153.87847999999485,101867.55375999659]
[null,null,null,663,153.81951999999484,101982.34175999658]
[null,null,null,664,153.76055999999483,102097.01183999656]
[null,null,null,665,153.70159999999481,102211.56399999655]
[null,null,null,666,153.6426399999948,102325.99823999654]
[null,null,null,667,153.58367999999479,102440.31455999652]
[null,null,null,668,153.52471999999477,102554.51295999651]
[null,null,null,669,153.46575999999476,102668.59343999649]
[null,null,null,670,153.40679999999475,102782.55599999648]
[null,null,null,671,153.34783999999473,102896.40063999647]
[null,null,null,672,153.28887999999472,103010.12735999645]
[null,null,null,673,153.22991999999471,103123.73615999644]
[null,null,null,674,153.17095999999469,103237.22703999642]
[null,null,null,675,153.11199999999468,103350.59999999641]
[null,null,null,676,153.05303999999467,{"$f":"E693*D693","v":103463.8550399964}]
[null,null,null,677,152.99407999999465,103576.99215999639]
[null,null,null,678,152.93511999999464,103690.01135999637]
[null,null,null,679,152.87615999999463,103802.91263999636]
[null,null,null,680,152.81719999999461,103915.69599999634]
[null,null,null,681,152.7582399999946,104028.36143999633]
[null,null,null,682,152.69927999999459,104140.9089599963]
[null,null,null,683,152.64031999999457,104253.33855999629]
[null,null,null,684,152.58135999999456,104365.65023999628]
[null,null,null,685,152.52239999999455,104477.84399999627]
[null,null,null,686,152.46343999999453,104589.91983999625]
[null,null,null,687,152.40447999999452,104701.87775999623]
[null,null,null,688,152.34551999999451,104813.71775999622]
[null,null,null,689,152.28655999999449,104925.43983999621]
[null,null,null,690,152.22759999999448,105037.0439999962]
[null,null,null,691,152.16863999999447,105148.53023999618]
[null,null,null,692,152.10967999999446,105259.89855999616]
[null,null,null,693,{"$f":"E709-$F$11","v":152.05071999999444},105371.14895999615]
[null,null,null,694,151.99175999999443,105482.28143999614]
[null,null,null,695,151.93279999999442,105593.29599999612]
[null,null,null,696,151.8738399999944,105704.19263999611]
[null,null,null,697,151.81487999999439,105814.9713599961]
[null,null,null,698,151.75591999999438,105925.63215999608]
[null,null,null,699,151.69695999999436,106036.17503999606]
[null,null,null,700,151.63799999999435,106146.59999999605]
[null,null,null,701,151.57903999999434,106256.90703999603]
[null,null,null,702,151.52007999999432,106367.09615999601]
[null,null,null,703,151.46111999999431,106477.167359996]
[null,null,null,704,151.4021599999943,106587.12063999599]
[null,null,null,705,151.34319999999428,106696.95599999597]
[null,null,null,706,151.28423999999427,106806.67343999595]
[null,null,null,707,151.22527999999426,106916.27295999594]
[null,null,null,708,151.16631999999424,107025.75455999593]
[null,null,null,709,151.10735999999423,107135.11823999591]
[null,null,null,710,151.04839999999422,107244.3639999959]
[null,null,null,711,150.9894399999942,107353.49183999588]
[null,null,null,712,150.93047999999419,107462.50175999587]
[null,null,null,713,150.87151999999418,107571.39375999584]
[null,null,null,714,150.81255999999416,107680.16783999583]
[null,null,null,715,150.75359999999415,107788.82399999582]
[null,null,null,716,150.69463999999414,107897.3622399958]
[null,null,null,717,150.63567999999412,108005.78255999579]
[null,null,null,718,150.57671999999411,108114.08495999577]
[null,null,null,719,150.5177599999941,108222.26943999575]
[null,null,null,720,150.45879999999408,108330.33599999575]
[null,null,null,721,150.39983999999407,108438.28463999572]
[null,null,null,722,150.34087999999406,108546.1153599957]
[null,null,null,723,150.28191999999405,108653.8281599957]
[null,null,null,724,150.22295999999403,108761.42303999567]
[null,null,null,725,150.16399999999402,108868.89999999566]
[null,null,null,726,150.10503999999401,108976.25903999565]
[null,null,null,727,150.04607999999399,109083.50015999563]
[null,null,null,728,149.98711999999398,109190.62335999562]
[null,null,null,729,149.92815999999397,109297.6286399956]
[null,null,null,730,149.86919999999395,109404.51599999558]
[null,null,null,731,149.81023999999394,109511.28543999557]
[null,null,null,732,149.75127999999393,109617.93695999555]
[null,null,null,733,149.69231999999391,109724.47055999553]
[null,null,null,734,149.6333599999939,109830.88623999553]
[null,null,null,735,149.57439999999389,109937.18399999551]
[null,null,null,736,149.51543999999387,110043.36383999549]
[null,null,null,737,149.45647999999386,110149.42575999547]
[null,null,null,738,149.39751999999385,110255.36975999546]
[null,null,null,739,149.33855999999383,110361.19583999545]
[null,null,null,740,149.27959999999382,{"$f":"E757*D757","v":110466.90399999543}]
[null,null,null,741,149.22063999999381,110572.49423999542]
[null,null,null,742,149.16167999999379,110677.9665599954]
[null,null,null,743,149.10271999999378,110783.32095999538]
[null,null,null,744,149.04375999999377,110888.55743999536]
[null,null,null,745,148.98479999999375,110993.67599999535]
[null,null,null,746,148.92583999999374,111098.67663999533]
[null,null,null,747,148.86687999999373,111203.55935999531]
[null,null,null,748,148.80791999999371,111308.3241599953]
[null,null,null,749,148.7489599999937,111412.97103999529]
[null,null,null,750,148.68999999999369,111517.49999999527]
[null,null,null,751,148.63103999999367,111621.91103999525]
[null,null,null,752,148.57207999999366,111726.20415999524]
[null,null,null,753,148.51311999999365,111830.37935999522]
[null,null,null,754,148.45415999999364,111934.4366399952]
[null,null,null,755,148.39519999999362,112038.37599999519]
[null,null,null,756,148.33623999999361,112142.19743999517]
[null,null,null,757,{"$f":"E773-$F$11","v":148.2772799999936},112245.90095999515]
[null,null,null,758,148.21831999999358,112349.48655999513]
[null,null,null,759,148.15935999999357,112452.95423999512]
[null,null,null,760,148.10039999999356,112556.3039999951]
[null,null,null,761,148.04143999999354,112659.53583999509]
[null,null,null,762,147.98247999999353,112762.64975999507]
[null,null,null,763,147.92351999999352,112865.64575999505]
[null,null,null,764,147.8645599999935,112968.52383999503]
[null,null,null,765,147.80559999999349,113071.28399999502]
[null,null,null,766,147.74663999999348,113173.92623999501]
[null,null,null,767,147.68767999999346,113276.45055999499]
[null,null,null,768,147.62871999999345,113378.85695999497]
[null,null,null,769,147.56975999999344,113481.14543999496]
[null,null,null,770,147.51079999999342,113583.31599999494]
[null,null,null,771,147.45183999999341,113685.36863999492]
[null,null,null,772,147.3928799999934,113787.3033599949]
[null,null,null,773,147.33391999999338,113889.12015999488]
[null,null,null,774,147.27495999999337,113990.81903999487]
[null,null,null,775,147.21599999999336,114092.39999999486]
[null,null,null,776,147.15703999999334,114193.86303999483]
[null,null,null,777,147.09807999999333,114295.20815999481]
[null,null,null,778,147.03911999999332,114396.43535999481]
[null,null,null,779,146.9801599999933,114497.54463999478]
[null,null,null,780,146.92119999999329,114598.53599999477]
[null,null,null,781,146.86223999999328,114699.40943999475]
[null,null,null,782,146.80327999999326,114800.16495999473]
[null,null,null,783,146.74431999999325,114900.80255999471]
[null,null,null,784,146.68535999999324,115001.3222399947]
[null,null,null,785,146.62639999999323,115101.72399999468]
[null,null,null,786,146.56743999999321,115202.00783999467]
[null,null,null,787,146.5084799999932,115302.17375999465]
[null,null,null,788,146.44951999999319,115402.22175999463]
[null,null,null,789,146.39055999999317,115502.15183999461]
[null,null,null,790,146.33159999999316,115601.96399999459]
[null,null,null,791,146.27263999999315,115701.65823999458]
[null,null,null,792,146.21367999999313,115801.23455999455]
[null,null,null,793,146.15471999999312,115900.69295999454]
[null,null,null,794,146.09575999999311,116000.03343999453]
[null,null,null,795,146.03679999999309,116099.25599999451]
[null,null,null,796,145.97783999999308,116198.3606399945]
[null,null,null,797,145.91887999999307,116297.34735999447]
[null,null,null,798,145.85991999999305,116396.21615999445]
[null,null,null,799,145.80095999999304,116494.96703999444]
[null,null,null,800,145.74199999999303,116593.59999999442]
[null,null,null,801,145.68303999999301,116692.1150399944]
[null,null,null,802,145.624079999993,116790.51215999438]
[null,null,null,803,145.56511999999299,116888.79135999437]
[null,null,null,804,145.50615999999297,{"$f":"E821*D821","v":116986.95263999436}]
[null,null,null,805,145.44719999999296,117084.99599999434]
[null,null,null,806,145.38823999999295,117182.92143999432]
[null,null,null,807,145.32927999999293,117280.7289599943]
[null,null,null,808,145.27031999999292,117378.41855999429]
[null,null,null,809,145.21135999999291,117475.99023999427]
[null,null,null,810,145.15239999999289,117573.44399999424]
[null,null,null,811,145.09343999999288,117670.77983999423]
[null,null,null,812,145.03447999999287,117767.99775999421]
[null,null,null,813,144.97551999999285,117865.0977599942]
[null,null,null,814,144.91655999999284,117962.07983999417]
[null,null,null,815,144.85759999999283,118058.94399999415]
[null,null,null,816,144.79863999999282,118155.69023999413]
[null,null,null,817,144.7396799999928,118252.31855999412]
[null,null,null,818,144.68071999999279,118348.82895999411]
[null,null,null,819,144.62175999999278,118445.22143999409]
[null,null,null,820,144.56279999999276,118541.49599999406]
[null,null,null,821,{"$f":"E837-$F$11","v":144.50383999999275},118637.65263999405]
[null,null,null,822,144.44487999999274,118733.69135999403]
[null,null,null,823,144.38591999999272,118829.61215999401]
[null,null,null,824,144.32695999999271,118925.415039994]
[null,null,null,825,144.2679999999927,119021.09999999398]
[null,null,null,826,144.20903999999268,119116.66703999396]
[null,null,null,827,144.15007999999267,119212.11615999394]
[null,null,null,828,144.09111999999266,119307.44735999392]
[null,null,null,829,144.03215999999264,119402.6606399939]
[null,null,null,830,143.97319999999263,119497.75599999388]
[null,null,null,831,143.91423999999262,119592.73343999387]
[null,null,null,832,143.8552799999926,119687.59295999384]
[null,null,null,833,143.79631999999259,119782.33455999383]
[null,null,null,834,143.73735999999258,119876.95823999381]
[null,null,null,835,143.67839999999256,119971.46399999379]
[null,null,null,836,143.61943999999255,120065.85183999377]
[null,null,null,837,143.56047999999254,120160.12175999375]
[null,null,null,838,143.50151999999252,120254.27375999374]
[null,null,null,839,143.44255999999251,120348.30783999372]
[null,null,null,840,143.3835999999925,120442.2239999937]
[null,null,null,841,143.32463999999248,120536.02223999368]
[null,null,null,842,143.26567999999247,120629.70255999366]
[null,null,null,843,143.20671999999246,120723.26495999364]
[null,null,null,844,143.14775999999245,120816.70943999362]
[null,null,null,845,143.08879999999243,120910.0359999936]
[null,null,null,846,143.02983999999242,121003.24463999359]
[null,null,null,847,142.97087999999241,121096.33535999357]
[null,null,null,848,142.91191999999239,121189.30815999355]
[null,null,null,849,142.85295999999238,121282.16303999352]
[null,null,null,850,142.79399999999237,121374.8999999935]
[null,null,null,851,142.73503999999235,121467.51903999349]
[null,null,null,852,142.67607999999234,121560.02015999347]
[null,null,null,853,142.61711999999233,121652.40335999345]
[null,null,null,854,142.55815999999231,121744.66863999344]
[null,null,null,855,142.4991999999923,121836.81599999341]
[null,null,null,856,142.44023999999229,121928.8454399934]
[null,null,null,857,142.38127999999227,122020.75695999338]
[null,null,null,858,142.32231999999226,122112.55055999335]
[null,null,null,859,142.26335999999225,122204.22623999334]
[null,null,null,860,142.20439999999223,122295.78399999332]
[null,null,null,861,142.14543999999222,122387.2238399933]
[null,null,null,862,142.08647999999221,122478.54575999329]
[null,null,null,863,142.02751999999219,122569.74975999327]
[null,null,null,864,141.96855999999218,122660.83583999325]
[null,null,null,865,141.90959999999217,122751.80399999322]
[null,null,null,866,141.85063999999215,122842.65423999321]
[null,null,null,867,141.79167999999214,122933.38655999319]
[null,null,null,868,141.73271999999213,{"$f":"E885*D885","v":123024.00095999317}]
[null,null,null,869,141.67375999999211,123114.49743999315]
[null,null,null,870,141.6147999999921,123204.87599999312]
[null,null,null,871,141.55583999999209,123295.13663999311]
[null,null,null,872,141.49687999999207,123385.27935999309]
[null,null,null,873,141.43791999999206,123475.30415999307]
[null,null,null,874,141.37895999999205,123565.21103999305]
[null,null,null,875,141.31999999999204,123654.99999999303]
[null,null,null,876,141.26103999999202,123744.67103999302]
[null,null,null,877,141.20207999999201,123834.224159993]
[null,null,null,878,141.143119999992,123923.65935999298]
[null,null,null,879,141.08415999999198,124012.97663999295]
[null,null,null,880,141.02519999999197,124102.17599999293]
[null,null,null,881,140.96623999999196,124191.25743999291]
[null,null,null,882,140.90727999999194,124280.22095999289]
[null,null,null,883,140.84831999999193,124369.06655999288]
[null,null,null,884,140.78935999999192,124457.79423999286]
[null,null,null,885,{"$f":"E901-$F$11","v":140.7303999999919},124546.40399999284]
[null,null,null,886,140.67143999999189,124634.89583999281]
[null,null,null,887,140.61247999999188,124723.26975999279]
[null,null,null,888,140.55351999999186,124811.52575999277]
[null,null,null,889,140.49455999999185,124899.66383999276]
[null,null,null,890,140.43559999999184,124987.68399999273]
[null,null,null,891,140.37663999999182,125075.58623999271]
[null,null,null,892,140.31767999999181,125163.37055999269]
[null,null,null,893,140.2587199999918,125251.03695999268]
[null,null,null,894,140.19975999999178,125338.58543999266]
[null,null,null,895,140.14079999999177,125426.01599999264]
[null,null,null,896,140.08183999999176,125513.32863999261]
[null,null,null,897,140.02287999999174,125600.5233599926]
[null,null,null,898,139.96391999999173,125687.60015999258]
[null,null,null,899,139.90495999999172,125774.55903999256]
[null,null,null,900,139.8459999999917,125861.39999999253]
[null,null,null,901,139.78703999999169,125948.12303999251]
[null,null,null,902,139.72807999999168,126034.72815999249]
[null,null,null,903,139.66911999999166,126121.21535999248]
[null,null,null,904,139.61015999999165,126207.58463999245]
[null,null,null,905,139.55119999999164,126293.83599999243]
[null,null,null,906,139.49223999999163,126379.96943999242]
[null,null,null,907,139.43327999999161,126465.98495999239]
[null,null,null,908,139.3743199999916,126551.88255999237]
[null,null,null,909,139.31535999999159,126637.66223999235]
[null,null,null,910,139.25639999999157,126723.32399999232]
[null,null,null,911,139.19743999999156,126808.86783999231]
[null,null,null,912,139.13847999999155,126894.29375999229]
[null,null,null,913,139.07951999999153,126979.60175999226]
[null,null,null,914,139.02055999999152,127064.79183999225]
[null,null,null,915,138.96159999999151,127149.86399999223]
[null,null,null,916,138.90263999999149,127234.81823999221]
[null,null,null,917,138.84367999999148,127319.65455999218]
[null,null,null,918,138.78471999999147,127404.37295999216]
[null,null,null,919,138.72575999999145,127488.97343999214]
[null,null,null,920,138.66679999999144,127573.45599999212]
[null,null,null,921,138.60783999999143,127657.8206399921]
[null,null,null,922,138.54887999999141,127742.06735999208]
[null,null,null,923,138.4899199999914,127826.19615999206]
[null,null,null,924,138.43095999999139,127910.20703999205]
[null,null,null,925,138.37199999999137,127994.09999999202]
[null,null,null,926,138.31303999999136,128077.875039992]
[null,null,null,927,138.25407999999135,128161.53215999198]
[null,null,null,928,138.19511999999133,128245.07135999195]
[null,null,null,929,138.13615999999132,128328.49263999193]
[null,null,null,930,138.07719999999131,128411.79599999191]
[null,null,null,931,138.01823999999129,128494.9814399919]
[null,null,null,932,137.95927999999128,{"$f":"E949*D949","v":128578.04895999188}]
[null,null,null,933,137.90031999999127,128660.99855999186]
[null,null,null,934,137.84135999999125,128743.83023999183]
[null,null,null,935,137.78239999999124,128826.54399999182]
[null,null,null,936,137.72343999999123,128909.1398399918]
[null,null,null,937,137.66447999999122,128991.61775999177]
[null,null,null,938,137.6055199999912,129073.97775999174]
[null,null,null,939,137.54655999999119,129156.21983999173]
[null,null,null,940,137.48759999999118,129238.3439999917]
[null,null,null,941,137.42863999999116,129320.35023999169]
[null,null,null,942,137.36967999999115,129402.23855999166]
[null,null,null,943,137.31071999999114,129484.00895999164]
[null,null,null,944,137.25175999999112,129565.66143999161]
[null,null,null,945,137.19279999999111,129647.1959999916]
[null,null,null,946,137.1338399999911,129728.61263999158]
[null,null,null,947,137.07487999999108,129809.91135999156]
[null,null,null,948,137.01591999999107,129891.09215999153]
[null,null,null,949,{"$f":"E965-$F$11","v":136.95695999999106},129972.15503999151]
[null,null,null,950,136.89799999999104,130053.09999999149]
[null,null,null,951,136.83903999999103,130133.92703999147]
[null,null,null,952,136.78007999999102,130214.63615999145]
[null,null,null,953,136.721119999991,130295.22735999143]
[null,null,null,954,136.66215999999099,130375.70063999141]
[null,null,null,955,136.60319999999098,130456.05599999138]
[null,null,null,956,136.54423999999096,130536.29343999136]
[null,null,null,957,136.48527999999095,130616.41295999134]
[null,null,null,958,136.42631999999094,130696.41455999132]
[null,null,null,959,136.36735999999092,130776.2982399913]
[null,null,null,960,136.30839999999091,130856.06399999128]
[null,null,null,961,136.2494399999909,130935.71183999126]
[null,null,null,962,136.19047999999088,131015.24175999123]
[null,null,null,963,136.13151999999087,131094.6537599912]
[null,null,null,964,136.07255999999086,131173.94783999119]
[null,null,null,965,136.01359999999084,131253.12399999116]
[null,null,null,966,135.95463999999083,131332.18223999115]
[null,null,null,967,135.89567999999082,131411.12255999111]
[null,null,null,968,135.83671999999081,131489.94495999109]
[null,null,null,969,135.77775999999079,131568.64943999107]
[null,null,null,970,135.71879999999078,131647.23599999107]
[null,null,null,971,135.65983999999077,131725.70463999105]
[null,null,null,972,135.60087999999075,131804.05535999101]
[null,null,null,973,135.54191999999074,131882.288159991]
[null,null,null,974,135.48295999999073,131960.40303999095]
[null,null,null,975,135.42399999999071,132038.39999999094]
[null,null,null,976,135.3650399999907,132116.27903999091]
[null,null,null,977,135.30607999999069,132194.04015999089]
[null,null,null,978,135.24711999999067,132271.68335999089]
[null,null,null,979,135.18815999999066,132349.20863999086]
[null,null,null,980,135.12919999999065,132426.61599999084]
[null,null,null,981,135.07023999999063,132503.90543999081]
[null,null,null,982,135.01127999999062,132581.07695999078]
[null,null,null,983,134.95231999999061,132658.13055999076]
[null,null,null,984,134.89335999999059,132735.06623999073]
[null,null,null,985,134.83439999999058,132811.88399999074]
[null,null,null,986,134.77543999999057,132888.58383999069]
[null,null,null,987,134.71647999999055,132965.16575999069]
[null,null,null,988,134.65751999999054,133041.62975999067]
[null,null,null,989,134.59855999999053,133117.97583999063]
[null,null,null,990,134.53959999999051,133194.2039999906]
[null,null,null,991,134.4806399999905,133270.31423999058]
[null,null,null,992,134.42167999999049,133346.30655999057]
[null,null,null,993,134.36271999999047,133422.18095999054]
[null,null,null,994,134.30375999999046,133497.93743999052]
[null,null,null,995,134.24479999999045,133573.57599999048]
[null,null,null,996,134.18583999999043,{"$f":"E1013*D1013","v":133649.09663999049}]
[null,null,null,997,134.12687999999042,133724.49935999044]
[null,null,null,998,134.06791999999041,133799.78415999044]
[null,null,null,999,134.0089599999904,133874.95103999041]
[null,null,null,1000,133.94999999999038,133949.9999999904]
[null,null,null,1001,{"$f":"E1017-$F$12","v":133.93659999999039},134070.53659999039]
[null,null,null,1002,133.9231999999904,134191.04639999039]
[null,null,null,1003,133.90979999999041,134311.5293999904]
[null,null,null,1004,133.89639999999042,134431.98559999038]
[null,null,null,1005,133.88299999999043,134552.41499999037]
[null,null,null,1006,133.86959999999044,134672.81759999038]
[null,null,null,1007,133.85619999999045,134793.19339999038]
[null,null,null,1008,133.84279999999046,134913.54239999037]
[null,null,null,1009,133.82939999999047,135033.8645999904]
[null,null,null,1010,133.81599999999048,135154.1599999904]
[null,null,null,1011,133.80259999999049,135274.42859999038]
[null,null,null,1012,133.7891999999905,135394.6703999904]
[null,null,null,1013,133.77579999999051,135514.88539999039]
[null,null,null,1014,133.76239999999052,135635.0735999904]
[null,null,null,1015,133.74899999999053,135755.23499999038]
[null,null,null,1016,133.73559999999054,135875.3695999904]
[null,null,null,1017,133.72219999999055,135995.4773999904]
[null,null,null,1018,133.70879999999056,136115.5583999904]
[null,null,null,1019,133.69539999999057,136235.61259999039]
[null,null,null,1020,133.68199999999058,136355.63999999038]
[null,null,null,1021,133.66859999999059,136475.64059999038]
[null,null,null,1022,133.6551999999906,136595.61439999039]
[null,null,null,1023,133.64179999999061,136715.5613999904]
[null,null,null,1024,133.62839999999062,136835.48159999039]
[null,null,null,1025,133.61499999999063,136955.3749999904]
[null,null,null,1026,133.60159999999064,137075.2415999904]
[null,null,null,1027,133.58819999999065,137195.08139999039]
[null,null,null,1028,133.57479999999066,137314.89439999039]
[null,null,null,1029,133.56139999999067,137434.68059999039]
[null,null,null,1030,133.54799999999068,137554.4399999904]
[null,null,null,1031,133.53459999999069,137674.17259999039]
[null,null,null,1032,133.5211999999907,137793.87839999041]
[null,null,null,1033,133.50779999999071,137913.55739999042]
[null,null,null,1034,133.49439999999072,138033.2095999904]
[null,null,null,1035,133.48099999999073,138152.83499999042]
[null,null,null,1036,133.46759999999074,138272.43359999041]
[null,null,null,1037,133.45419999999075,138392.00539999042]
[null,null,null,1038,133.44079999999076,138511.5503999904]
[null,null,null,1039,133.42739999999077,138631.06859999039]
[null,null,null,1040,133.41399999999078,138750.55999999042]
[null,null,null,1041,133.40059999999079,138870.0245999904]
[null,null,null,1042,133.3871999999908,138989.46239999041]
[null,null,null,1043,133.37379999999081,139108.87339999041]
[null,null,null,1044,133.36039999999082,139228.25759999041]
[null,null,null,1045,133.34699999999083,139347.61499999042]
[null,null,null,1046,133.33359999999084,139466.94559999043]
[null,null,null,1047,133.32019999999085,139586.24939999043]
[null,null,null,1048,133.30679999999086,139705.52639999043]
[null,null,null,1049,133.29339999999087,139824.77659999041]
[null,null,null,1050,133.27999999999088,139943.99999999042]
[null,null,null,1051,133.26659999999089,140063.19659999042]
[null,null,null,1052,133.2531999999909,140182.36639999042]
[null,null,null,1053,133.23979999999091,140301.50939999043]
[null,null,null,1054,133.22639999999092,140420.62559999042]
[null,null,null,1055,133.21299999999093,140539.71499999042]
[null,null,null,1056,133.19959999999094,140658.77759999043]
[null,null,null,1057,133.18619999999095,140777.81339999044]
[null,null,null,1058,133.17279999999096,140896.82239999043]
[null,null,null,1059,133.15939999999097,141015.80459999043]
[null,null,null,1060,133.14599999999098,{"$f":"E1077*D1077","v":141134.75999999043}]
[null,null,null,1061,133.13259999999099,141253.68859999045]
[null,null,null,1062,133.119199999991,141372.59039999044]
[null,null,null,1063,133.10579999999101,141491.46539999044]
[null,null,null,1064,133.09239999999102,141610.31359999045]
[null,null,null,1065,{"$f":"E1081-$F$12","v":133.07899999999103},141729.13499999043]
[null,null,null,1066,133.06559999999104,141847.92959999046]
[null,null,null,1067,133.05219999999105,141966.69739999046]
[null,null,null,1068,133.03879999999106,142085.43839999044]
[null,null,null,1069,133.02539999999107,142204.15259999046]
[null,null,null,1070,133.01199999999108,142322.83999999045]
[null,null,null,1071,132.99859999999109,142441.50059999045]
[null,null,null,1072,132.9851999999911,142560.13439999046]
[null,null,null,1073,132.97179999999111,142678.74139999045]
[null,null,null,1074,132.95839999999112,142797.32159999045]
[null,null,null,1075,132.94499999999113,142915.87499999045]
[null,null,null,1076,132.93159999999114,143034.40159999047]
[null,null,null,1077,132.91819999999115,143152.90139999046]
[null,null,null,1078,132.90479999999116,143271.37439999045]
[null,null,null,1079,132.89139999999117,143389.82059999046]
[null,null,null,1080,132.87799999999118,143508.23999999047]
[null,null,null,1081,132.86459999999119,143626.63259999047]
[null,null,null,1082,132.85119999999119,143744.99839999047]
[null,null,null,1083,132.8377999999912,143863.33739999047]
[null,null,null,1084,132.82439999999121,143981.64959999049]
[null,null,null,1085,132.81099999999122,144099.93499999048]
[null,null,null,1086,132.79759999999123,144218.19359999048]
[null,null,null,1087,132.78419999999124,144336.42539999049]
[null,null,null,1088,132.77079999999125,144454.63039999048]
[null,null,null,1089,132.75739999999126,144572.80859999047]
[null,null,null,1090,132.74399999999127,144690.95999999047]
[null,null,null,1091,132.73059999999128,144809.08459999049]
[null,null,null,1092,132.71719999999129,144927.1823999905]
[null,null,null,1093,132.7037999999913,145045.2533999905]
[null,null,null,1094,132.69039999999131,145163.2975999905]
[null,null,null,1095,132.67699999999132,145281.31499999049]
[null,null,null,1096,132.66359999999133,145399.3055999905]
[null,null,null,1097,132.65019999999134,145517.2693999905]
[null,null,null,1098,132.63679999999135,145635.20639999051]
[null,null,null,1099,132.62339999999136,145753.11659999052]
[null,null,null,1100,132.60999999999137,145870.99999999051]
[null,null,null,1101,132.59659999999138,145988.85659999051]
[null,null,null,1102,132.58319999999139,146106.68639999052]
[null,null,null,1103,132.5697999999914,146224.4893999905]
[null,null,null,1104,132.55639999999141,146342.26559999053]
[null,null,null,1105,132.54299999999142,146460.01499999053]
[null,null,null,1106,132.52959999999143,146577.73759999053]
[null,null,null,1107,132.51619999999144,146695.43339999052]
[null,null,null,1108,132.50279999999145,146813.10239999052]
[null,null,null,1109,132.48939999999146,146930.74459999052]
[null,null,null,1110,132.47599999999147,147048.35999999053]
[null,null,null,1111,132.46259999999148,147165.94859999054]
[null,null,null,1112,132.44919999999149,147283.51039999054]
[null,null,null,1113,132.4357999999915,147401.04539999054]
[null,null,null,1114,132.42239999999151,147518.55359999056]
[null,null,null,1115,132.40899999999152,147636.03499999054]
[null,null,null,1116,132.39559999999153,147753.48959999054]
[null,null,null,1117,132.38219999999154,147870.91739999055]
[null,null,null,1118,132.36879999999155,147988.31839999056]
[null,null,null,1119,132.35539999999156,148105.69259999055]
[null,null,null,1120,132.34199999999157,148223.03999999055]
[null,null,null,1121,132.32859999999158,148340.36059999056]
[null,null,null,1122,132.31519999999159,148457.65439999057]
[null,null,null,1123,132.3017999999916,148574.92139999056]
[null,null,null,1124,132.28839999999161,{"$f":"E1141*D1141","v":148692.16159999056}]
[null,null,null,1125,132.27499999999162,148809.37499999057]
[null,null,null,1126,132.26159999999163,148926.56159999059]
[null,null,null,1127,132.24819999999164,149043.72139999058]
[null,null,null,1128,132.23479999999165,149160.85439999058]
[null,null,null,1129,{"$f":"E1145-$F$12","v":132.22139999999166},149277.96059999059]
[null,null,null,1130,132.20799999999167,149395.03999999058]
[null,null,null,1131,132.19459999999168,149512.0925999906]
[null,null,null,1132,132.18119999999169,149629.11839999061]
[null,null,null,1133,132.1677999999917,149746.11739999059]
[null,null,null,1134,132.15439999999171,149863.08959999061]
[null,null,null,1135,132.14099999999172,149980.0349999906]
[null,null,null,1136,132.12759999999173,150096.95359999061]
[null,null,null,1137,132.11419999999174,150213.84539999062]
[null,null,null,1138,132.10079999999175,150330.71039999061]
[null,null,null,1139,132.08739999999176,150447.54859999061]
[null,null,null,1140,132.07399999999177,150564.35999999061]
[null,null,null,1141,132.06059999999178,150681.14459999063]
[null,null,null,1142,132.04719999999179,150797.90239999062]
[null,null,null,1143,132.0337999999918,150914.63339999062]
[null,null,null,1144,132.02039999999181,151031.33759999063]
[null,null,null,1145,132.00699999999182,151148.01499999064]
[null,null,null,1146,131.99359999999183,151264.66559999064]
[null,null,null,1147,131.98019999999184,151381.28939999064]
[null,null,null,1148,131.96679999999185,151497.88639999065]
[null,null,null,1149,131.95339999999186,151614.45659999063]
[null,null,null,1150,131.93999999999187,151730.99999999066]
[null,null,null,1151,131.92659999999188,151847.51659999066]
[null,null,null,1152,131.91319999999189,151964.00639999064]
[null,null,null,1153,131.8997999999919,152080.46939999066]
[null,null,null,1154,131.88639999999191,152196.90559999066]
[null,null,null,1155,131.87299999999192,152313.31499999066]
[null,null,null,1156,131.85959999999193,152429.69759999067]
[null,null,null,1157,131.84619999999194,152546.05339999066]
[null,null,null,1158,131.83279999999195,152662.38239999069]
[null,null,null,1159,131.81939999999196,152778.68459999067]
[null,null,null,1160,131.80599999999197,152894.95999999068]
[null,null,null,1161,131.79259999999198,153011.2085999907]
[null,null,null,1162,131.77919999999199,153127.4303999907]
[null,null,null,1163,131.765799999992,153243.62539999071]
[null,null,null,1164,131.75239999999201,153359.79359999069]
[null,null,null,1165,131.73899999999202,153475.93499999071]
[null,null,null,1166,131.72559999999203,153592.04959999071]
[null,null,null,1167,131.71219999999204,153708.13739999069]
[null,null,null,1168,131.69879999999205,153824.19839999071]
[null,null,null,1169,131.68539999999206,153940.2325999907]
[null,null,null,1170,131.67199999999207,154056.23999999071]
[null,null,null,1171,131.65859999999208,154172.22059999072]
[null,null,null,1172,131.64519999999209,154288.17439999073]
[null,null,null,1173,131.6317999999921,154404.10139999073]
[null,null,null,1174,131.61839999999211,154520.00159999073]
[null,null,null,1175,131.60499999999212,154635.87499999074]
[null,null,null,1176,131.59159999999213,154751.72159999073]
[null,null,null,1177,131.57819999999214,154867.54139999073]
[null,null,null,1178,131.56479999999215,154983.33439999074]
[null,null,null,1179,131.55139999999216,155099.10059999075]
[null,null,null,1180,131.53799999999217,155214.83999999077]
[null,null,null,1181,131.52459999999218,155330.55259999077]
[null,null,null,1182,131.51119999999219,155446.23839999078]
[null,null,null,1183,131.4977999999922,155561.89739999076]
[null,null,null,1184,131.48439999999221,155677.52959999078]
[null,null,null,1185,131.47099999999222,155793.13499999078]
[null,null,null,1186,131.45759999999223,155908.71359999079]
[null,null,null,1187,131.44419999999224,156024.26539999078]
[null,null,null,1188,131.43079999999225,{"$f":"E1205*D1205","v":156139.7903999908}]
[null,null,null,1189,131.41739999999226,156255.2885999908]
[null,null,null,1190,131.40399999999227,156370.75999999078]
[null,null,null,1191,131.39059999999228,156486.2045999908]
[null,null,null,1192,131.37719999999229,156601.6223999908]
[null,null,null,1193,{"$f":"E1209-$F$12","v":131.3637999999923},156717.0133999908]
[null,null,null,1194,131.35039999999231,156832.37759999081]
[null,null,null,1195,131.33699999999232,156947.71499999083]
[null,null,null,1196,131.32359999999233,157063.02559999083]
[null,null,null,1197,131.31019999999234,157178.30939999083]
[null,null,null,1198,131.29679999999234,157293.56639999084]
[null,null,null,1199,131.28339999999235,157408.79659999083]
[null,null,null,1200,131.26999999999236,157523.99999999083]
[null,null,null,1201,131.25659999999237,157639.17659999084]
[null,null,null,1202,131.24319999999238,157754.32639999085]
[null,null,null,1203,131.22979999999239,157869.44939999084]
[null,null,null,1204,131.2163999999924,157984.54559999084]
[null,null,null,1205,131.20299999999241,158099.61499999085]
[null,null,null,1206,131.18959999999242,158214.65759999087]
[null,null,null,1207,131.17619999999243,158329.67339999086]
[null,null,null,1208,131.16279999999244,158444.66239999086]
[null,null,null,1209,131.14939999999245,158559.62459999087]
[null,null,null,1210,131.13599999999246,158674.55999999089]
[null,null,null,1211,131.12259999999247,158789.46859999088]
[null,null,null,1212,131.10919999999248,158904.35039999089]
[null,null,null,1213,131.09579999999249,159019.2053999909]
[null,null,null,1214,131.0823999999925,159134.03359999089]
[null,null,null,1215,131.06899999999251,159248.83499999091]
[null,null,null,1216,131.05559999999252,159363.60959999092]
[null,null,null,1217,131.04219999999253,159478.3573999909]
[null,null,null,1218,131.02879999999254,159593.07839999092]
[null,null,null,1219,131.01539999999255,159707.77259999092]
[null,null,null,1220,131.00199999999256,159822.43999999092]
[null,null,null,1221,130.98859999999257,159937.08059999094]
[null,null,null,1222,130.97519999999258,160051.69439999093]
[null,null,null,1223,130.96179999999259,160166.28139999093]
[null,null,null,1224,130.9483999999926,160280.84159999093]
[null,null,null,1225,130.93499999999261,160395.37499999095]
[null,null,null,1226,130.92159999999262,160509.88159999094]
[null,null,null,1227,130.90819999999263,160624.36139999097]
[null,null,null,1228,130.89479999999264,160738.81439999095]
[null,null,null,1229,130.88139999999265,160853.24059999097]
[null,null,null,1230,130.86799999999266,160967.63999999096]
[null,null,null,1231,130.85459999999267,161082.01259999097]
[null,null,null,1232,130.84119999999268,161196.35839999098]
[null,null,null,1233,130.82779999999269,161310.67739999099]
[null,null,null,1234,130.8143999999927,161424.96959999099]
[null,null,null,1235,130.80099999999271,161539.23499999099]
[null,null,null,1236,130.78759999999272,161653.473599991]
[null,null,null,1237,130.77419999999273,161767.68539999099]
[null,null,null,1238,130.76079999999274,161881.87039999102]
[null,null,null,1239,130.74739999999275,161996.02859999103]
[null,null,null,1240,130.73399999999276,162110.15999999101]
[null,null,null,1241,130.72059999999277,162224.26459999103]
[null,null,null,1242,130.70719999999278,162338.34239999103]
[null,null,null,1243,130.69379999999279,162452.39339999104]
[null,null,null,1244,130.6803999999928,162566.41759999105]
[null,null,null,1245,130.66699999999281,162680.41499999104]
[null,null,null,1246,130.65359999999282,162794.38559999104]
[null,null,null,1247,130.64019999999283,162908.32939999105]
[null,null,null,1248,130.62679999999284,163022.24639999107]
[null,null,null,1249,130.61339999999285,163136.13659999106]
[null,null,null,1250,130.59999999999286,163249.99999999107]
[null,null,null,1251,130.58659999999287,163363.83659999107]
[null,null,null,1252,130.57319999999288,{"$f":"E1269*D1269","v":163477.64639999109}]
[null,null,null,1253,130.55979999999289,163591.42939999109]
[null,null,null,1254,130.5463999999929,163705.18559999109]
[null,null,null,1255,130.53299999999291,163818.9149999911]
[null,null,null,1256,130.51959999999292,163932.61759999112]
[null,null,null,1257,{"$f":"E1273-$F$12","v":130.50619999999293},164046.29339999112]
[null,null,null,1258,130.49279999999294,164159.94239999112]
[null,null,null,1259,130.47939999999295,164273.56459999114]
[null,null,null,1260,130.46599999999296,164387.15999999113]
[null,null,null,1261,130.45259999999297,164500.72859999113]
[null,null,null,1262,130.43919999999298,164614.27039999113]
[null,null,null,1263,130.42579999999299,164727.78539999115]
[null,null,null,1264,130.412399999993,164841.27359999114]
[null,null,null,1265,130.39899999999301,164954.73499999117]
[null,null,null,1266,130.38559999999302,165068.16959999118]
[null,null,null,1267,130.37219999999303,165181.57739999116]
[null,null,null,1268,130.35879999999304,165294.95839999118]
[null,null,null,1269,130.34539999999305,165408.31259999119]
[null,null,null,1270,130.33199999999306,165521.6399999912]
[null,null,null,1271,130.31859999999307,165634.94059999118]
[null,null,null,1272,130.30519999999308,165748.21439999121]
[null,null,null,1273,130.29179999999309,165861.46139999121]
[null,null,null,1274,130.2783999999931,165974.68159999122]
[null,null,null,1275,130.26499999999311,166087.87499999121]
[null,null,null,1276,130.25159999999312,166201.04159999121]
[null,null,null,1277,130.23819999999313,166314.18139999121]
[null,null,null,1278,130.22479999999314,166427.29439999122]
[null,null,null,1279,130.21139999999315,166540.38059999124]
[null,null,null,1280,130.19799999999316,166653.43999999124]
[null,null,null,1281,130.18459999999317,166766.47259999125]
[null,null,null,1282,130.17119999999318,166879.47839999126]
[null,null,null,1283,130.15779999999319,166992.45739999125]
[null,null,null,1284,130.1443999999932,167105.40959999125]
[null,null,null,1285,130.13099999999321,167218.33499999126]
[null,null,null,1286,130.11759999999322,167331.23359999128]
[null,null,null,1287,130.10419999999323,167444.10539999127]
[null,null,null,1288,130.09079999999324,167556.9503999913]
[null,null,null,1289,130.07739999999325,167669.76859999131]
[null,null,null,1290,130.06399999999326,167782.5599999913]
[null,null,null,1291,130.05059999999327,167895.32459999132]
[null,null,null,1292,130.03719999999328,168008.06239999132]
[null,null,null,1293,130.02379999999329,168120.77339999133]
[null,null,null,1294,130.0103999999933,168233.45759999132]
[null,null,null,1295,129.99699999999331,168346.11499999132]
[null,null,null,1296,129.98359999999332,168458.74559999135]
[null,null,null,1297,129.97019999999333,168571.34939999133]
[null,null,null,1298,129.95679999999334,168683.92639999135]
[null,null,null,1299,129.94339999999335,168796.47659999135]
[null,null,null,1300,129.92999999999336,168908.99999999136]
[null,null,null,1301,129.91659999999337,169021.49659999137]
[null,null,null,1302,129.90319999999338,169133.96639999136]
[null,null,null,1303,129.88979999999339,169246.40939999139]
[null,null,null,1304,129.8763999999934,169358.8255999914]
[null,null,null,1305,129.86299999999341,169471.21499999138]
[null,null,null,1306,129.84959999999342,169583.5775999914]
[null,null,null,1307,129.83619999999343,169695.9133999914]
[null,null,null,1308,129.82279999999344,169808.22239999141]
[null,null,null,1309,129.80939999999345,169920.50459999143]
[null,null,null,1310,129.79599999999346,170032.75999999142]
[null,null,null,1311,129.78259999999347,170144.98859999143]
[null,null,null,1312,129.76919999999348,170257.19039999144]
[null,null,null,1313,129.75579999999349,170369.36539999145]
[null,null,null,1314,129.74239999999349,170481.51359999145]
[null,null,null,1315,129.7289999999935,170593.63499999145]
[null,null,null,1316,129.71559999999351,{"$f":"E1333*D1333","v":170705.72959999146}]
[null,null,null,1317,129.70219999999352,170817.79739999148]
[null,null,null,1318,129.68879999999353,170929.83839999148]
[null,null,null,1319,129.67539999999354,171041.85259999149]
[null,null,null,1320,129.66199999999355,171153.8399999915]
[null,null,null,1321,{"$f":"E1337-$F$12","v":129.64859999999356},171265.80059999149]
[null,null,null,1322,129.63519999999357,171377.73439999152]
[null,null,null,1323,129.62179999999358,171489.64139999152]
[null,null,null,1324,129.60839999999359,171601.52159999151]
[null,null,null,1325,129.5949999999936,171713.37499999153]
[null,null,null,1326,129.58159999999361,171825.20159999153]
[null,null,null,1327,129.56819999999362,171937.00139999154]
[null,null,null,1328,129.55479999999363,172048.77439999155]
[null,null,null,1329,129.54139999999364,172160.52059999155]
[null,null,null,1330,129.52799999999365,172272.23999999155]
[null,null,null,1331,129.51459999999366,172383.93259999156]
[null,null,null,1332,129.50119999999367,172495.59839999158]
[null,null,null,1333,129.48779999999368,172607.23739999157]
[null,null,null,1334,129.47439999999369,172718.84959999158]
[null,null,null,1335,129.4609999999937,172830.43499999159]
[null,null,null,1336,129.44759999999371,172941.99359999161]
[null,null,null,1337,129.43419999999372,173053.5253999916]
[null,null,null,1338,129.42079999999373,173165.03039999161]
[null,null,null,1339,129.40739999999374,173276.50859999162]
[null,null,null,1340,129.39399999999375,173387.95999999164]
[null,null,null,1341,129.38059999999376,173499.38459999164]
[null,null,null,1342,129.36719999999377,173610.78239999164]
[null,null,null,1343,129.35379999999378,173722.15339999166]
[null,null,null,1344,129.34039999999379,173833.49759999165]
[null,null,null,1345,129.3269999999938,173944.81499999165]
[null,null,null,1346,129.31359999999381,174056.10559999166]
[null,null,null,1347,129.30019999999382,174167.36939999167]
[null,null,null,1348,129.28679999999383,174278.6063999917]
[null,null,null,1349,129.27339999999384,174389.8165999917]
[null,null,null,1350,129.25999999999385,174500.99999999171]
[null,null,null,1351,129.24659999999386,174612.15659999169]
[null,null,null,1352,129.23319999999387,174723.28639999172]
[null,null,null,1353,129.21979999999388,174834.38939999172]
[null,null,null,1354,129.20639999999389,174945.46559999173]
[null,null,null,1355,129.1929999999939,175056.51499999175]
[null,null,null,1356,129.17959999999391,175167.53759999175]
[null,null,null,1357,129.16619999999392,175278.53339999175]
[null,null,null,1358,129.15279999999393,175389.50239999176]
[null,null,null,1359,129.13939999999394,175500.44459999175]
[null,null,null,1360,129.12599999999395,175611.35999999178]
[null,null,null,1361,129.11259999999396,175722.24859999178]
[null,null,null,1362,129.09919999999397,175833.1103999918]
[null,null,null,1363,129.08579999999398,175943.94539999179]
[null,null,null,1364,129.07239999999399,176054.75359999179]
[null,null,null,1365,129.058999999994,176165.5349999918]
[null,null,null,1366,129.04559999999401,176276.28959999181]
[null,null,null,1367,129.03219999999402,176387.01739999183]
[null,null,null,1368,129.01879999999403,176497.71839999183]
[null,null,null,1369,129.00539999999404,176608.39259999184]
[null,null,null,1370,128.99199999999405,176719.03999999186]
[null,null,null,1371,128.97859999999406,176829.66059999185]
[null,null,null,1372,128.96519999999407,176940.25439999186]
[null,null,null,1373,128.95179999999408,177050.82139999187]
[null,null,null,1374,128.93839999999409,177161.36159999188]
[null,null,null,1375,128.9249999999941,177271.87499999188]
[null,null,null,1376,128.91159999999411,177382.36159999188]
[null,null,null,1377,128.89819999999412,177492.8213999919]
[null,null,null,1378,128.88479999999413,177603.25439999191]
[null,null,null,1379,128.87139999999414,177713.66059999191]
[null,null,null,1380,128.85799999999415,{"$f":"E1397*D1397","v":177824.03999999192}]
[null,null,null,1381,128.84459999999416,177934.39259999193]
[null,null,null,1382,128.83119999999417,178044.71839999195]
[null,null,null,1383,128.81779999999418,178155.01739999195]
[null,null,null,1384,128.80439999999419,178265.28959999196]
[null,null,null,1385,{"$f":"E1401-$F$12","v":128.7909999999942},178375.53499999197]
[null,null,null,1386,128.77759999999421,178485.75359999196]
[null,null,null,1387,128.76419999999422,178595.94539999199]
[null,null,null,1388,128.75079999999423,178706.110399992]
[null,null,null,1389,128.73739999999424,178816.24859999199]
[null,null,null,1390,128.72399999999425,178926.35999999201]
[null,null,null,1391,128.71059999999426,179036.44459999201]
[null,null,null,1392,128.69719999999427,179146.50239999202]
[null,null,null,1393,128.68379999999428,179256.53339999204]
[null,null,null,1394,128.67039999999429,179366.53759999204]
[null,null,null,1395,128.6569999999943,179476.51499999204]
[null,null,null,1396,128.64359999999431,179586.46559999205]
[null,null,null,1397,128.63019999999432,179696.38939999207]
[null,null,null,1398,128.61679999999433,179806.28639999207]
[null,null,null,1399,128.60339999999434,179916.15659999207]
[null,null,null,1400,128.58999999999435,180025.99999999208]
[null,null,null,1401,128.57659999999436,180135.8165999921]
[null,null,null,1402,128.56319999999437,180245.6063999921]
[null,null,null,1403,128.54979999999438,180355.36939999211]
[null,null,null,1404,128.53639999999439,180465.10559999212]
[null,null,null,1405,128.5229999999944,180574.81499999212]
[null,null,null,1406,128.50959999999441,180684.49759999214]
[null,null,null,1407,128.49619999999442,180794.15339999215]
[null,null,null,1408,128.48279999999443,180903.78239999217]
[null,null,null,1409,128.46939999999444,181013.38459999216]
[null,null,null,1410,128.45599999999445,181122.95999999216]
[null,null,null,1411,128.44259999999446,181232.50859999217]
[null,null,null,1412,128.42919999999447,181342.03039999219]
[null,null,null,1413,128.41579999999448,181451.52539999218]
[null,null,null,1414,128.40239999999449,181560.99359999222]
[null,null,null,1415,128.3889999999945,181670.4349999922]
[null,null,null,1416,128.37559999999451,181779.84959999222]
[null,null,null,1417,128.36219999999452,181889.23739999224]
[null,null,null,1418,128.34879999999453,181998.59839999225]
[null,null,null,1419,128.33539999999454,182107.93259999226]
[null,null,null,1420,128.32199999999455,182217.23999999225]
[null,null,null,1421,128.30859999999456,182326.52059999228]
[null,null,null,1422,128.29519999999457,182435.77439999228]
[null,null,null,1423,128.28179999999458,182545.00139999227]
[null,null,null,1424,128.26839999999459,182654.20159999229]
[null,null,null,1425,128.2549999999946,182763.37499999229]
[null,null,null,1426,128.24159999999461,182872.52159999229]
[null,null,null,1427,128.22819999999462,182981.64139999231]
[null,null,null,1428,128.21479999999463,183090.73439999233]
[null,null,null,1429,128.20139999999463,183199.80059999233]
[null,null,null,1430,128.18799999999464,183308.83999999234]
[null,null,null,1431,128.17459999999465,183417.85259999236]
[null,null,null,1432,128.16119999999466,183526.83839999235]
[null,null,null,1433,128.14779999999467,183635.79739999236]
[null,null,null,1434,128.13439999999468,183744.72959999237]
[null,null,null,1435,128.12099999999469,183853.63499999238]
[null,null,null,1436,128.1075999999947,183962.51359999241]
[null,null,null,1437,128.09419999999471,184071.36539999241]
[null,null,null,1438,128.08079999999472,184180.19039999243]
[null,null,null,1439,128.06739999999473,184288.98859999242]
[null,null,null,1440,128.05399999999474,184397.75999999244]
[null,null,null,1441,128.04059999999475,184506.50459999245]
[null,null,null,1442,128.02719999999476,184615.22239999246]
[null,null,null,1443,128.01379999999477,184723.91339999245]
[null,null,null,1444,128.00039999999478,{"$f":"E1461*D1461","v":184832.57759999248}]
[null,null,null,1445,127.98699999999478,184941.21499999246]
[null,null,null,1446,127.97359999999478,185049.82559999244]
[null,null,null,1447,127.96019999999477,185158.40939999244]
[null,null,null,1448,127.94679999999477,185266.96639999241]
[null,null,null,1449,{"$f":"E1465-$F$12","v":127.93339999999476},185375.49659999242]
[null,null,null,1450,127.91999999999476,185483.9999999924]
[null,null,null,1451,127.90659999999475,185592.4765999924]
[null,null,null,1452,127.89319999999475,185700.92639999237]
[null,null,null,1453,127.87979999999475,185809.34939999235]
[null,null,null,1454,127.86639999999474,185917.74559999234]
[null,null,null,1455,127.85299999999474,186026.11499999234]
[null,null,null,1456,127.83959999999473,186134.45759999234]
[null,null,null,1457,127.82619999999473,186242.77339999232]
[null,null,null,1458,127.81279999999472,186351.06239999231]
[null,null,null,1459,127.79939999999472,186459.32459999231]
[null,null,null,1460,127.78599999999471,186567.55999999229]
[null,null,null,1461,127.77259999999471,186675.76859999227]
[null,null,null,1462,127.75919999999471,186783.95039999226]
[null,null,null,1463,127.7457999999947,186892.10539999226]
[null,null,null,1464,127.7323999999947,187000.23359999224]
[null,null,null,1465,127.71899999999469,187108.33499999222]
[null,null,null,1466,127.70559999999469,187216.40959999221]
[null,null,null,1467,127.69219999999468,187324.45739999221]
[null,null,null,1468,127.67879999999468,187432.47839999219]
[null,null,null,1469,127.66539999999468,187540.47259999218]
[null,null,null,1470,127.65199999999467,187648.43999999217]
[null,null,null,1471,127.63859999999467,187756.38059999215]
[null,null,null,1472,127.62519999999466,187864.29439999216]
[null,null,null,1473,127.61179999999466,187972.18139999214]
[null,null,null,1474,127.59839999999465,188080.04159999211]
[null,null,null,1475,127.58499999999465,188187.87499999211]
[null,null,null,1476,127.57159999999465,188295.68159999209]
[null,null,null,1477,127.55819999999464,188403.46139999208]
[null,null,null,1478,127.54479999999464,188511.21439999208]
[null,null,null,1479,127.53139999999463,188618.94059999206]
[null,null,null,1480,127.51799999999463,188726.63999999204]
[null,null,null,1481,127.50459999999462,188834.31259999203]
[null,null,null,1482,127.49119999999462,188941.95839999203]
[null,null,null,1483,127.47779999999462,189049.57739999201]
[null,null,null,1484,127.46439999999461,189157.16959999199]
[null,null,null,1485,127.45099999999461,189264.73499999198]
[null,null,null,1486,127.4375999999946,189372.27359999198]
[null,null,null,1487,127.4241999999946,189479.78539999196]
[null,null,null,1488,127.41079999999459,189587.27039999195]
[null,null,null,1489,127.39739999999459,189694.72859999194]
[null,null,null,1490,127.38399999999459,189802.15999999194]
[null,null,null,1491,127.37059999999458,189909.56459999192]
[null,null,null,1492,127.35719999999458,190016.94239999191]
[null,null,null,1493,127.34379999999457,190124.2933999919]
[null,null,null,1494,127.33039999999457,190231.61759999188]
[null,null,null,1495,127.31699999999456,190338.91499999189]
[null,null,null,1496,127.30359999999456,190446.18559999185]
[null,null,null,1497,127.29019999999456,190553.42939999184]
[null,null,null,1498,127.27679999999455,190660.64639999185]
[null,null,null,1499,127.26339999999455,190767.83659999183]
[null,null,null,1500,127.24999999999454,190874.99999999182]
[null,null,null,1501,127.23659999999454,190982.13659999179]
[null,null,null,1502,127.22319999999453,191089.2463999918]
[null,null,null,1503,127.20979999999453,191196.32939999178]
[null,null,null,1504,127.19639999999453,191303.38559999177]
[null,null,null,1505,127.18299999999452,191410.41499999174]
[null,null,null,1506,127.16959999999452,191517.41759999175]
[null,null,null,1507,127.15619999999451,191624.39339999174]
[null,null,null,1508,127.14279999999451,{"$f":"E1525*D1525","v":191731.34239999173}]
[null,null,null,1509,127.1293999999945,191838.2645999917]
[null,null,null,1510,127.1159999999945,191945.15999999171]
[null,null,null,1511,127.1025999999945,192052.0285999917]
[null,null,null,1512,127.08919999999449,192158.87039999166]
[null,null,null,1513,{"$f":"E1529-$F$12","v":127.07579999999449},192265.68539999166]
[null,null,null,1514,127.06239999999448,192372.47359999164]
[null,null,null,1515,127.04899999999448,192479.23499999163]
[null,null,null,1516,127.03559999999447,192585.96959999163]
[null,null,null,1517,127.02219999999447,192692.6773999916]
[null,null,null,1518,127.00879999999447,192799.35839999159]
[null,null,null,1519,126.99539999999446,192906.01259999158]
[null,null,null,1520,126.98199999999446,193012.63999999157]
[null,null,null,1521,126.96859999999445,193119.24059999155]
[null,null,null,1522,126.95519999999445,193225.81439999156]
[null,null,null,1523,126.94179999999444,193332.36139999153]
[null,null,null,1524,126.92839999999444,193438.88159999152]
[null,null,null,1525,126.91499999999444,193545.3749999915]
[null,null,null,1526,126.90159999999443,193651.84159999152]
[null,null,null,1527,126.88819999999443,193758.28139999148]
[null,null,null,1528,126.87479999999442,193864.69439999148]
[null,null,null,1529,126.86139999999442,193971.08059999146]
[null,null,null,1530,126.84799999999441,194077.43999999145]
[null,null,null,1531,126.83459999999441,194183.77259999144]
[null,null,null,1532,126.82119999999441,194290.07839999144]
[null,null,null,1533,126.8077999999944,194396.35739999142]
[null,null,null,1534,126.7943999999944,194502.60959999141]
[null,null,null,1535,126.78099999999439,194608.83499999141]
[null,null,null,1536,126.76759999999439,194715.03359999138]
[null,null,null,1537,126.75419999999438,194821.20539999136]
[null,null,null,1538,126.74079999999438,194927.35039999135]
[null,null,null,1539,126.72739999999438,195033.46859999135]
[null,null,null,1540,126.71399999999437,195139.55999999132]
[null,null,null,1541,126.70059999999437,195245.62459999131]
[null,null,null,1542,126.68719999999436,195351.6623999913]
[null,null,null,1543,126.67379999999436,195457.6733999913]
[null,null,null,1544,126.66039999999435,195563.65759999127]
[null,null,null,1545,126.64699999999435,195669.61499999126]
[null,null,null,1546,126.63359999999435,195775.54559999125]
[null,null,null,1547,126.62019999999434,195881.44939999125]
[null,null,null,1548,126.60679999999434,195987.32639999123]
[null,null,null,1549,126.59339999999433,196093.17659999122]
[null,null,null,1550,126.57999999999433,196198.99999999121]
[null,null,null,1551,126.56659999999432,196304.79659999118]
[null,null,null,1552,126.55319999999432,196410.56639999119]
[null,null,null,1553,126.53979999999432,196516.30939999118]
[null,null,null,1554,126.52639999999431,196622.02559999115]
[null,null,null,1555,126.51299999999431,196727.71499999115]
[null,null,null,1556,126.4995999999943,196833.37759999113]
[null,null,null,1557,126.4861999999943,196939.01339999112]
[null,null,null,1558,126.47279999999429,197044.62239999112]
[null,null,null,1559,126.45939999999429,197150.20459999109]
[null,null,null,1560,126.44599999999429,197255.75999999107]
[null,null,null,1561,126.43259999999428,197361.28859999106]
[null,null,null,1562,126.41919999999428,197466.79039999106]
[null,null,null,1563,126.40579999999427,197572.26539999104]
[null,null,null,1564,126.39239999999427,197677.71359999102]
[null,null,null,1565,126.37899999999426,197783.13499999102]
[null,null,null,1566,126.36559999999426,197888.52959999102]
[null,null,null,1567,126.35219999999426,197993.89739999099]
[null,null,null,1568,126.33879999999425,198099.23839999098]
[null,null,null,1569,126.32539999999425,198204.55259999097]
[null,null,null,1570,126.31199999999424,198309.83999999097]
[null,null,null,1571,126.29859999999424,198415.10059999095]
[null,null,null,1572,126.28519999999423,{"$f":"E1589*D1589","v":198520.33439999094}]
[null,null,null,1573,126.27179999999423,198625.54139999094]
[null,null,null,1574,126.25839999999423,198730.72159999091]
[null,null,null,1575,126.24499999999422,198835.87499999089]
[null,null,null,1576,126.23159999999422,198941.00159999088]
[null,null,null,1577,{"$f":"E1593-$F$12","v":126.21819999999421},199046.10139999088]
[null,null,null,1578,126.20479999999421,199151.17439999085]
[null,null,null,1579,126.1913999999942,199256.22059999083]
[null,null,null,1580,126.1779999999942,199361.23999999082]
[null,null,null,1581,126.16459999999419,199466.23259999082]
[null,null,null,1582,126.15119999999419,199571.1983999908]
[null,null,null,1583,126.13779999999419,199676.13739999081]
[null,null,null,1584,126.12439999999418,199781.04959999077]
[null,null,null,1585,126.11099999999418,199885.93499999077]
[null,null,null,1586,126.09759999999417,199990.79359999075]
[null,null,null,1587,126.08419999999417,200095.62539999073]
[null,null,null,1588,126.07079999999416,200200.43039999073]
[null,null,null,1589,126.05739999999416,200305.20859999073]
[null,null,null,1590,126.04399999999416,200409.95999999071]
[null,null,null,1591,126.03059999999415,200514.68459999069]
[null,null,null,1592,126.01719999999415,200619.38239999069]
[null,null,null,1593,126.00379999999414,200724.05339999066]
[null,null,null,1594,125.99039999999414,200828.69759999067]
[null,null,null,1595,125.97699999999413,200933.31499999063]
[null,null,null,1596,125.96359999999413,201037.90559999063]
[null,null,null,1597,125.95019999999413,201142.46939999063]
[null,null,null,1598,125.93679999999412,201247.00639999061]
[null,null,null,1599,125.92339999999412,201351.5165999906]
[null,null,null,1600,125.90999999999411,201455.99999999057]
[null,null,null,1601,125.89659999999411,201560.45659999058]
[null,null,null,1602,125.8831999999941,201664.88639999056]
[null,null,null,1603,125.8697999999941,201769.28939999055]
[null,null,null,1604,125.8563999999941,201873.66559999052]
[null,null,null,1605,125.84299999999409,201978.01499999053]
[null,null,null,1606,125.82959999999409,202082.33759999051]
[null,null,null,1607,125.81619999999408,202186.6333999905]
[null,null,null,1608,125.80279999999408,202290.90239999047]
[null,null,null,1609,125.78939999999407,202395.14459999045]
[null,null,null,1610,125.77599999999407,202499.35999999044]
[null,null,null,1611,125.76259999999407,202603.54859999043]
[null,null,null,1612,125.74919999999406,202707.71039999044]
[null,null,null,1613,125.73579999999406,202811.84539999042]
[null,null,null,1614,125.72239999999405,202915.9535999904]
[null,null,null,1615,125.70899999999405,203020.0349999904]
[null,null,null,1616,125.69559999999404,203124.08959999037]
[null,null,null,1617,125.68219999999404,203228.11739999035]
[null,null,null,1618,125.66879999999404,203332.11839999034]
[null,null,null,1619,125.65539999999403,203436.09259999034]
[null,null,null,1620,125.64199999999403,203540.03999999032]
[null,null,null,1621,125.62859999999402,203643.9605999903]
[null,null,null,1622,125.61519999999402,203747.85439999029]
[null,null,null,1623,125.60179999999401,203851.72139999029]
[null,null,null,1624,125.58839999999401,203955.56159999027]
[null,null,null,1625,125.57499999999401,204059.37499999025]
[null,null,null,1626,125.561599999994,204163.16159999024]
[null,null,null,1627,125.548199999994,204266.92139999024]
[null,null,null,1628,125.53479999999399,204370.65439999022]
[null,null,null,1629,125.52139999999399,204474.36059999021]
[null,null,null,1630,125.50799999999398,204578.0399999902]
[null,null,null,1631,125.49459999999398,204681.69259999017]
[null,null,null,1632,125.48119999999398,204785.31839999018]
[null,null,null,1633,125.46779999999397,204888.91739999017]
[null,null,null,1634,125.45439999999397,204992.48959999013]
[null,null,null,1635,125.44099999999396,205096.03499999014]
[null,null,null,1636,125.42759999999396,{"$f":"E1653*D1653","v":205199.55359999012}]
[null,null,null,1637,125.41419999999395,205303.04539999011]
[null,null,null,1638,125.40079999999395,205406.5103999901]
[null,null,null,1639,125.38739999999395,205509.94859999008]
[null,null,null,1640,125.37399999999394,205613.35999999006]
[null,null,null,1641,{"$f":"E1657-$F$12","v":125.36059999999394},205716.74459999005]
[null,null,null,1642,125.34719999999393,205820.10239999005]
[null,null,null,1643,125.33379999999393,205923.43339999003]
[null,null,null,1644,125.32039999999392,206026.73759999001]
[null,null,null,1645,125.30699999999392,206130.01499999]
[null,null,null,1646,125.29359999999392,206233.26559998997]
[null,null,null,1647,125.28019999999391,206336.48939998998]
[null,null,null,1648,125.26679999999391,206439.68639998997]
[null,null,null,1649,125.2533999999939,206542.85659998996]
[null,null,null,1650,125.2399999999939,206645.99999998993]
[null,null,null,1651,125.22659999999389,206749.11659998991]
[null,null,null,1652,125.21319999999389,206852.2063999899]
[null,null,null,1653,125.19979999999389,206955.26939998989]
[null,null,null,1654,125.18639999999388,207058.30559998989]
[null,null,null,1655,125.17299999999388,207161.31499998987]
[null,null,null,1656,125.15959999999387,207264.29759998986]
[null,null,null,1657,125.14619999999387,207367.25339998983]
[null,null,null,1658,125.13279999999386,207470.18239998983]
[null,null,null,1659,125.11939999999386,207573.08459998982]
[null,null,null,1660,125.10599999999386,207675.95999998981]
[null,null,null,1661,125.09259999999385,207778.80859998977]
[null,null,null,1662,125.07919999999385,207881.63039998978]
[null,null,null,1663,125.06579999999384,207984.42539998976]
[null,null,null,1664,125.05239999999384,208087.19359998975]
[null,null,null,1665,125.03899999999383,208189.93499998972]
[null,null,null,1666,125.02559999999383,208292.64959998973]
[null,null,null,1667,125.01219999999383,208395.33739998972]
[null,null,null,1668,124.99879999999382,208497.99839998968]
[null,null,null,1669,124.98539999999382,208600.63259998968]
[null,null,null,1670,124.97199999999381,208703.23999998966]
[null,null,null,1671,124.95859999999381,208805.82059998965]
[null,null,null,1672,124.9451999999938,208908.37439998964]
[null,null,null,1673,124.9317999999938,209010.90139998961]
[null,null,null,1674,124.9183999999938,209113.40159998962]
[null,null,null,1675,124.90499999999379,209215.87499998961]
[null,null,null,1676,124.89159999999379,209318.32159998958]
[null,null,null,1677,124.87819999999378,209420.74139998958]
[null,null,null,1678,124.86479999999378,209523.13439998956]
[null,null,null,1679,124.85139999999377,209625.50059998955]
[null,null,null,1680,124.83799999999377,209727.83999998952]
[null,null,null,1681,124.82459999999377,209830.15259998952]
[null,null,null,1682,124.81119999999376,209932.43839998951]
[null,null,null,1683,124.79779999999376,210034.6973999895]
[null,null,null,1684,124.78439999999375,210136.92959998947]
[null,null,null,1685,124.77099999999375,210239.13499998947]
[null,null,null,1686,124.75759999999374,210341.31359998946]
[null,null,null,1687,124.74419999999374,210443.46539998945]
[null,null,null,1688,124.73079999999374,210545.59039998942]
[null,null,null,1689,124.71739999999373,210647.6885999894]
[null,null,null,1690,124.70399999999373,210749.75999998939]
[null,null,null,1691,124.69059999999372,210851.80459998938]
[null,null,null,1692,124.67719999999372,210953.82239998938]
[null,null,null,1693,124.66379999999371,211055.81339998936]
[null,null,null,1694,124.65039999999371,211157.77759998935]
[null,null,null,1695,124.63699999999371,211259.71499998934]
[null,null,null,1696,124.6235999999937,211361.62559998932]
[null,null,null,1697,124.6101999999937,211463.5093999893]
[null,null,null,1698,124.59679999999369,211565.36639998929]
[null,null,null,1699,124.58339999999369,211667.19659998929]
[null,null,null,1700,124.56999999999368,{"$f":"E1717*D1717","v":211768.99999998926}]
[null,null,null,1701,124.55659999999368,211870.77659998924]
[null,null,null,1702,124.54319999999367,211972.52639998923]
[null,null,null,1703,124.52979999999367,212074.24939998923]
[null,null,null,1704,124.51639999999367,212175.94559998921]
[null,null,null,1705,{"$f":"E1721-$F$12","v":124.50299999999366},212277.61499998919]
[null,null,null,1706,124.48959999999366,212379.25759998919]
[null,null,null,1707,124.47619999999365,212480.87339998916]
[null,null,null,1708,124.46279999999365,212582.46239998916]
[null,null,null,1709,124.44939999999364,212684.02459998915]
[null,null,null,1710,124.43599999999364,212785.55999998911]
[null,null,null,1711,124.42259999999364,212887.06859998911]
[null,null,null,1712,124.40919999999363,212988.55039998909]
[null,null,null,1713,124.39579999999363,213090.00539998908]
[null,null,null,1714,124.38239999999362,213191.43359998908]
[null,null,null,1715,124.36899999999362,213292.83499998905]
[null,null,null,1716,124.35559999999361,213394.20959998903]
[null,null,null,1717,124.34219999999361,213495.55739998902]
[null,null,null,1718,124.32879999999361,213596.87839998901]
[null,null,null,1719,124.3153999999936,213698.17259998899]
[null,null,null,1720,124.3019999999936,213799.439999989]
[null,null,null,1721,124.28859999999359,213900.68059998896]
[null,null,null,1722,124.27519999999359,214001.89439998896]
[null,null,null,1723,124.26179999999358,214103.08139998894]
[null,null,null,1724,124.24839999999358,214204.24159998892]
[null,null,null,1725,124.23499999999358,214305.37499998891]
[null,null,null,1726,124.22159999999357,214406.48159998891]
[null,null,null,1727,124.20819999999357,214507.56139998889]
[null,null,null,1728,124.19479999999356,214608.61439998887]
[null,null,null,1729,124.18139999999356,214709.64059998887]
[null,null,null,1730,124.16799999999355,214810.63999998884]
[null,null,null,1731,124.15459999999355,214911.61259998885]
[null,null,null,1732,124.14119999999355,215012.55839998883]
[null,null,null,1733,124.12779999999354,215113.4773999888]
[null,null,null,1734,124.11439999999354,215214.3695999888]
[null,null,null,1735,124.10099999999353,215315.23499998878]
[null,null,null,1736,124.08759999999353,215416.07359998877]
[null,null,null,1737,124.07419999999352,215516.88539998877]
[null,null,null,1738,124.06079999999352,215617.67039998874]
[null,null,null,1739,124.04739999999352,215718.42859998872]
[null,null,null,1740,124.03399999999351,215819.15999998871]
[null,null,null,1741,124.02059999999351,215919.86459998871]
[null,null,null,1742,124.0071999999935,216020.54239998868]
[null,null,null,1743,123.9937999999935,216121.19339998867]
[null,null,null,1744,123.98039999999349,216221.81759998866]
[null,null,null,1745,123.96699999999349,216322.41499998863]
[null,null,null,1746,123.95359999999349,216422.98559998863]
[null,null,null,1747,123.94019999999348,216523.52939998862]
[null,null,null,1748,123.92679999999348,216624.04639998861]
[null,null,null,1749,123.91339999999347,216724.53659998858]
[null,null,null,1750,123.89999999999347,216824.99999998856]
[null,null,null,1751,123.88659999999346,216925.43659998855]
[null,null,null,1752,123.87319999999346,217025.84639998854]
[null,null,null,1753,123.85979999999346,217126.22939998852]
[null,null,null,1754,123.84639999999345,217226.58559998852]
[null,null,null,1755,123.83299999999345,217326.91499998851]
[null,null,null,1756,123.81959999999344,217427.21759998848]
[null,null,null,1757,123.80619999999344,217527.49339998848]
[null,null,null,1758,123.79279999999343,217627.74239998846]
[null,null,null,1759,123.77939999999343,217727.96459998845]
[null,null,null,1760,123.76599999999343,217828.15999998842]
[null,null,null,1761,123.75259999999342,217928.32859998842]
[null,null,null,1762,123.73919999999342,218028.47039998841]
[null,null,null,1763,123.72579999999341,218128.5853999884]
[null,null,null,1764,123.71239999999341,{"$f":"E1781*D1781","v":218228.67359998837}]
[null,null,null,1765,123.6989999999934,218328.73499998834]
[null,null,null,1766,123.6855999999934,218428.76959998836]
[null,null,null,1767,123.6721999999934,218528.77739998832]
[null,null,null,1768,123.65879999999339,218628.75839998832]
[null,null,null,1769,{"$f":"E1785-$F$12","v":123.64539999999339},218728.7125999883]
[null,null,null,1770,123.63199999999338,218828.63999998829]
[null,null,null,1771,123.61859999999338,218928.54059998828]
[null,null,null,1772,123.60519999999337,219028.41439998825]
[null,null,null,1773,123.59179999999337,219128.26139998823]
[null,null,null,1774,123.57839999999337,219228.08159998822]
[null,null,null,1775,123.56499999999336,219327.87499998821]
[null,null,null,1776,123.55159999999336,219427.64159998822]
[null,null,null,1777,123.53819999999335,219527.3813999882]
[null,null,null,1778,123.52479999999335,219627.09439998819]
[null,null,null,1779,123.51139999999334,219726.78059998815]
[null,null,null,1780,123.49799999999334,219826.43999998816]
[null,null,null,1781,123.48459999999334,219926.07259998814]
[null,null,null,1782,123.47119999999333,220025.67839998813]
[null,null,null,1783,123.45779999999333,220125.2573999881]
[null,null,null,1784,123.44439999999332,220224.80959998808]
[null,null,null,1785,123.43099999999332,220324.33499998806]
[null,null,null,1786,123.41759999999331,220423.83359998805]
[null,null,null,1787,123.40419999999331,220523.30539998805]
[null,null,null,1788,123.39079999999331,220622.75039998803]
[null,null,null,1789,123.3773999999933,220722.16859998801]
[null,null,null,1790,123.3639999999933,220821.55999998801]
[null,null,null,1791,123.35059999999329,220920.92459998798]
[null,null,null,1792,123.33719999999329,221020.26239998796]
[null,null,null,1793,123.32379999999328,221119.57339998794]
[null,null,null,1794,123.31039999999328,221218.85759998794]
[null,null,null,1795,123.29699999999328,221318.11499998794]
[null,null,null,1796,123.28359999999327,221417.34559998792]
[null,null,null,1797,123.27019999999327,221516.54939998791]
[null,null,null,1798,123.25679999999326,221615.72639998788]
[null,null,null,1799,123.24339999999326,221714.87659998788]
[null,null,null,1800,123.22999999999325,221813.99999998786]
[null,null,null,1801,123.21659999999325,221913.09659998785]
[null,null,null,1802,123.20319999999325,222012.16639998782]
[null,null,null,1803,123.18979999999324,222111.20939998783]
[null,null,null,1804,123.17639999999324,222210.22559998781]
[null,null,null,1805,123.16299999999323,222309.21499998777]
[null,null,null,1806,123.14959999999323,222408.17759998777]
[null,null,null,1807,123.13619999999322,222507.11339998775]
[null,null,null,1808,123.12279999999322,222606.02239998773]
[null,null,null,1809,123.10939999999322,222704.90459998773]
[null,null,null,1810,123.09599999999321,222803.7599999877]
[null,null,null,1811,123.08259999999321,222902.58859998771]
[null,null,null,1812,123.0691999999932,223001.39039998769]
[null,null,null,1813,123.0557999999932,223100.16539998766]
[null,null,null,1814,123.04239999999319,223198.91359998766]
[null,null,null,1815,123.02899999999319,223297.63499998764]
[null,null,null,1816,123.01559999999319,223396.32959998763]
[null,null,null,1817,123.00219999999318,223494.99739998762]
[null,null,null,1818,122.98879999999318,223593.6383999876]
[null,null,null,1819,122.97539999999317,223692.25259998758]
[null,null,null,1820,122.96199999999317,223790.83999998757]
[null,null,null,1821,122.94859999999316,223889.40059998754]
[null,null,null,1822,122.93519999999316,223987.93439998754]
[null,null,null,1823,122.92179999999315,224086.44139998753]
[null,null,null,1824,122.90839999999315,224184.92159998752]
[null,null,null,1825,122.89499999999315,224283.37499998749]
[null,null,null,1826,122.88159999999314,224381.80159998749]
[null,null,null,1827,122.86819999999314,224480.20139998748]
[null,null,null,1828,122.85479999999313,{"$f":"E1845*D1845","v":224578.57439998744}]
[null,null,null,1829,122.84139999999313,224676.92059998744]
[null,null,null,1830,122.82799999999312,224775.23999998742]
[null,null,null,1831,122.81459999999312,224873.5325999874]
[null,null,null,1832,122.80119999999312,224971.7983999874]
[null,null,null,1833,{"$f":"E1849-$F$12","v":122.78779999999311},225070.03739998737]
[null,null,null,1834,122.77439999999311,225168.24959998735]
[null,null,null,1835,122.7609999999931,225266.43499998734]
[null,null,null,1836,122.7475999999931,225364.59359998733]
[null,null,null,1837,122.73419999999309,225462.72539998731]
[null,null,null,1838,122.72079999999309,225560.83039998729]
[null,null,null,1839,122.70739999999309,225658.90859998728]
[null,null,null,1840,122.69399999999308,225756.95999998727]
[null,null,null,1841,122.68059999999308,225854.98459998725]
[null,null,null,1842,122.66719999999307,225952.98239998723]
[null,null,null,1843,122.65379999999307,226050.95339998722]
[null,null,null,1844,122.64039999999306,226148.89759998722]
[null,null,null,1845,122.62699999999306,226246.8149999872]
[null,null,null,1846,122.61359999999306,226344.70559998718]
[null,null,null,1847,122.60019999999305,226442.56939998717]
[null,null,null,1848,122.58679999999305,226540.40639998714]
[null,null,null,1849,122.57339999999304,226638.21659998715]
[null,null,null,1850,122.55999999999304,226735.99999998714]
[null,null,null,1851,122.54659999999303,226833.7565999871]
[null,null,null,1852,122.53319999999303,226931.4863999871]
[null,null,null,1853,122.51979999999303,227029.18939998708]
[null,null,null,1854,122.50639999999302,227126.86559998707]
[null,null,null,1855,122.49299999999302,227224.51499998703]
[null,null,null,1856,122.47959999999301,227322.13759998704]
[null,null,null,1857,122.46619999999301,227419.73339998702]
[null,null,null,1858,122.452799999993,227517.30239998701]
[null,null,null,1859,122.439399999993,227614.844599987]
[null,null,null,1860,122.425999999993,227712.35999998698]
[null,null,null,1861,122.41259999999299,227809.84859998696]
[null,null,null,1862,122.39919999999299,227907.31039998695]
[null,null,null,1863,122.38579999999298,228004.74539998692]
[null,null,null,1864,122.37239999999298,228102.15359998692]
[null,null,null,1865,122.35899999999297,228199.53499998691]
[null,null,null,1866,122.34559999999297,228296.88959998687]
[null,null,null,1867,122.33219999999297,228394.21739998687]
[null,null,null,1868,122.31879999999296,228491.51839998685]
[null,null,null,1869,122.30539999999296,228588.79259998683]
[null,null,null,1870,122.29199999999295,228686.03999998682]
[null,null,null,1871,122.27859999999295,228783.2605999868]
[null,null,null,1872,122.26519999999294,228880.4543999868]
[null,null,null,1873,122.25179999999294,228977.62139998679]
[null,null,null,1874,122.23839999999294,229074.76159998676]
[null,null,null,1875,122.22499999999293,229171.87499998676]
[null,null,null,1876,122.21159999999293,229268.96159998674]
[null,null,null,1877,122.19819999999292,229366.02139998673]
[null,null,null,1878,122.18479999999292,229463.05439998669]
[null,null,null,1879,122.17139999999291,229560.0605999867]
[null,null,null,1880,122.15799999999291,229657.03999998668]
[null,null,null,1881,122.14459999999291,229753.99259998667]
[null,null,null,1882,122.1311999999929,229850.91839998664]
[null,null,null,1883,122.1177999999929,229947.81739998661]
[null,null,null,1884,122.10439999999289,230044.6895999866]
[null,null,null,1885,122.09099999999289,230141.53499998659]
[null,null,null,1886,122.07759999999288,230238.35359998659]
[null,null,null,1887,122.06419999999288,230335.14539998656]
[null,null,null,1888,122.05079999999288,230431.91039998655]
[null,null,null,1889,122.03739999999287,230528.64859998654]
[null,null,null,1890,122.02399999999287,230625.35999998651]
[null,null,null,1891,122.01059999999286,230722.04459998649]
[null,null,null,1892,121.99719999999286,{"$f":"E1909*D1909","v":230818.70239998648}]
[null,null,null,1893,121.98379999999285,230915.33339998647]
[null,null,null,1894,121.97039999999285,231011.93759998647]
[null,null,null,1895,121.95699999999285,231108.51499998645]
[null,null,null,1896,121.94359999999284,231205.06559998644]
[null,null,null,1897,{"$f":"E1913-$F$12","v":121.93019999999284},231301.58939998641]
[null,null,null,1898,121.91679999999283,231398.08639998641]
[null,null,null,1899,121.90339999999283,231494.55659998639]
[null,null,null,1900,121.88999999999282,231590.99999998638]
[null,null,null,1901,121.87659999999282,231687.41659998635]
[null,null,null,1902,121.86319999999282,231783.80639998632]
[null,null,null,1903,121.84979999999281,231880.16939998631]
[null,null,null,1904,121.83639999999281,231976.5055999863]
[null,null,null,1905,121.8229999999928,232072.81499998629]
[null,null,null,1906,121.8095999999928,232169.09759998627]
[null,null,null,1907,121.79619999999279,232265.35339998626]
[null,null,null,1908,121.78279999999279,232361.58239998625]
[null,null,null,1909,121.76939999999279,232457.78459998622]
[null,null,null,1910,121.75599999999278,232553.95999998623]
[null,null,null,1911,121.74259999999278,232650.10859998618]
[null,null,null,1912,121.72919999999277,232746.23039998618]
[null,null,null,1913,121.71579999999277,232842.32539998618]
[null,null,null,1914,121.70239999999276,232938.39359998616]
[null,null,null,1915,121.68899999999276,233034.43499998614]
[null,null,null,1916,121.67559999999276,233130.44959998611]
[null,null,null,1917,121.66219999999275,233226.43739998611]
[null,null,null,1918,121.64879999999275,233322.39839998609]
[null,null,null,1919,121.63539999999274,233418.33259998608]
[null,null,null,1920,121.62199999999274,233514.23999998605]
[null,null,null,1921,121.60859999999273,233610.12059998605]
[null,null,null,1922,121.59519999999273,233705.97439998604]
[null,null,null,1923,121.58179999999273,233801.801399986]
[null,null,null,1924,121.56839999999272,233897.601599986]
[null,null,null,1925,121.55499999999272,233993.37499998597]
[null,null,null,1926,121.54159999999271,234089.12159998596]
[null,null,null,1927,121.52819999999271,234184.84139998595]
[null,null,null,1928,121.5147999999927,234280.53439998595]
[null,null,null,1929,121.5013999999927,234376.20059998592]
[null,null,null,1930,121.4879999999927,234471.83999998591]
[null,null,null,1931,121.47459999999269,234567.45259998587]
[null,null,null,1932,121.46119999999269,234663.03839998588]
[null,null,null,1933,121.44779999999268,234758.59739998585]
[null,null,null,1934,121.43439999999268,234854.12959998584]
[null,null,null,1935,121.42099999999267,234949.63499998584]
[null,null,null,1936,121.40759999999267,235045.11359998581]
[null,null,null,1937,121.39419999999267,235140.56539998579]
[null,null,null,1938,121.38079999999266,235235.99039998578]
[null,null,null,1939,121.36739999999266,235331.38859998577]
[null,null,null,1940,121.35399999999265,235426.75999998575]
[null,null,null,1941,121.34059999999265,235522.10459998573]
[null,null,null,1942,121.32719999999264,235617.42239998572]
[null,null,null,1943,121.31379999999264,235712.71339998569]
[null,null,null,1944,121.30039999999264,235807.97759998569]
[null,null,null,1945,121.28699999999263,235903.21499998568]
[null,null,null,1946,121.27359999999263,235998.42559998564]
[null,null,null,1947,121.26019999999262,236093.60939998564]
[null,null,null,1948,121.24679999999262,236188.76639998562]
[null,null,null,1949,121.23339999999261,236283.8965999856]
[null,null,null,1950,121.21999999999261,236378.99999998559]
[null,null,null,1951,121.2065999999926,236474.07659998556]
[null,null,null,1952,121.1931999999926,236569.12639998554]
[null,null,null,1953,121.1797999999926,236664.14939998553]
[null,null,null,1954,121.16639999999259,236759.14559998552]
[null,null,null,1955,121.15299999999259,236854.1149999855]
[null,null,null,1956,121.13959999999258,{"$f":"E1973*D1973","v":236949.05759998551}]
[null,null,null,1957,121.12619999999258,237043.97339998547]
[null,null,null,1958,121.11279999999257,237138.86239998546]
[null,null,null,1959,121.09939999999257,237233.72459998543]
[null,null,null,1960,121.08599999999257,237328.55999998542]
[null,null,null,1961,{"$f":"E1977-$F$12","v":121.07259999999256},237423.36859998541]
[null,null,null,1962,121.05919999999256,237518.1503999854]
[null,null,null,1963,121.04579999999255,237612.90539998538]
[null,null,null,1964,121.03239999999255,237707.63359998536]
[null,null,null,1965,121.01899999999254,237802.33499998535]
[null,null,null,1966,121.00559999999254,237897.00959998532]
[null,null,null,1967,120.99219999999254,237991.65739998533]
[null,null,null,1968,120.97879999999253,238086.27839998531]
[null,null,null,1969,120.96539999999253,238180.87259998528]
[null,null,null,1970,120.95199999999252,238275.43999998528]
[null,null,null,1971,120.93859999999252,238369.98059998525]
[null,null,null,1972,120.92519999999251,238464.49439998524]
[null,null,null,1973,120.91179999999251,238558.98139998523]
[null,null,null,1974,120.89839999999251,238653.44159998521]
[null,null,null,1975,120.8849999999925,238747.87499998519]
[null,null,null,1976,120.8715999999925,238842.28159998517]
[null,null,null,1977,120.85819999999249,238936.66139998517]
[null,null,null,1978,120.84479999999249,239031.01439998514]
[null,null,null,1979,120.83139999999248,239125.34059998512]
[null,null,null,1980,120.81799999999248,239219.63999998511]
[null,null,null,1981,120.80459999999248,239313.91259998511]
[null,null,null,1982,120.79119999999247,239408.15839998508]
[null,null,null,1983,120.77779999999247,239502.37739998507]
[null,null,null,1984,120.76439999999246,239596.56959998506]
[null,null,null,1985,120.75099999999246,239690.73499998503]
[null,null,null,1986,120.73759999999245,239784.873599985]
[null,null,null,1987,120.72419999999245,239878.98539998499]
[null,null,null,1988,120.71079999999245,239973.07039998498]
[null,null,null,1989,120.69739999999244,240067.12859998498]
[null,null,null,1990,120.68399999999244,240161.15999998496]
[null,null,null,1991,120.67059999999243,240255.16459998494]
[null,null,null,1992,120.65719999999243,240349.14239998491]
[null,null,null,1993,120.64379999999242,240443.09339998491]
[null,null,null,1994,120.63039999999242,240537.01759998489]
[null,null,null,1995,120.61699999999242,240630.91499998487]
[null,null,null,1996,120.60359999999241,240724.78559998484]
[null,null,null,1997,120.59019999999241,240818.62939998484]
[null,null,null,1998,120.5767999999924,240912.44639998482]
[null,null,null,1999,120.5633999999924,241006.23659998481]
[null,null,null,2000,120.54999999999239,241099.99999998478]
[null,null,null,2001,{"$f":"$E$13","v":120.55},241220.55]
[null,null,null,2002,120.55,241341.1]
[null,null,null,2003,120.55,241461.65]
[null,null,null,2004,120.55,241582.19999999998]
[null,null,null,2005,120.55,241702.75]
[null,null,null,2006,120.55,241823.3]
[null,null,null,2007,120.55,241943.85]
[null,null,null,2008,120.55,242064.4]
[null,null,null,2009,120.55,242184.94999999998]
[null,null,null,2010,120.55,242305.5]
[null,null,null,2011,120.55,242426.05]
[null,null,null,2012,120.55,242546.6]
[null,null,null,2013,120.55,242667.15]
[null,null,null,2014,120.55,242787.69999999998]
[null,null,null,2015,120.55,242908.25]
[null,null,null,2016,120.55,243028.8]
[null,null,null,2017,120.55,243149.35]
[null,null,null,2018,120.55,243269.9]
[null,null,null,2019,120.55,243390.44999999998]
[null,null,null,2020,120.55,{"$f":"E2037*D2037","v":243511}]
[null,null,null,2021,120.55,243631.55]
[null,null,null,2022,120.55,243752.1]
[null,null,null,2023,120.55,243872.65]
[null,null,null,2024,120.55,243993.19999999998]
[null,null,null,2025,120.55,244113.75]
[null,null,null,2026,120.55,244234.3]
[null,null,null,2027,120.55,244354.85]
[null,null,null,2028,120.55,244475.4]
[null,null,null,2029,120.55,244595.94999999998]
[null,null,null,2030,120.55,244716.5]
[null,null,null,2031,120.55,244837.05]
[null,null,null,2032,120.55,244957.6]
[null,null,null,2033,120.55,245078.15]
[null,null,null,2034,120.55,245198.69999999998]
[null,null,null,2035,120.55,245319.25]
[null,null,null,2036,120.55,245439.8]
[null,null,null,2037,120.55,245560.35]
[null,null,null,2038,120.55,245680.9]
[null,null,null,2039,120.55,245801.44999999998]
[null,null,null,2040,120.55,245922]
[null,null,null,2041,120.55,246042.55]
[null,null,null,2042,120.55,246163.1]
[null,null,null,2043,120.55,246283.65]
[null,null,null,2044,120.55,246404.19999999998]
[null,null,null,2045,120.55,246524.75]
[null,null,null,2046,120.55,246645.3]
[null,null,null,2047,120.55,246765.85]
[null,null,null,2048,120.55,246886.39999999999]
[null,null,null,2049,120.55,247006.94999999998]
[null,null,null,2050,120.55,247127.5]
[null,null,null,2051,120.55,247248.05]
[null,null,null,2052,120.55,247368.6]
[null,null,null,2053,120.55,247489.15]
[null,null,null,2054,120.55,247609.69999999998]
[null,null,null,2055,120.55,247730.25]
[null,null,null,2056,120.55,247850.8]
[null,null,null,2057,120.55,247971.35]
[null,null,null,2058,120.55,248091.9]
[null,null,null,2059,120.55,248212.44999999998]
[null,null,null,2060,120.55,248333]
[null,null,null,2061,120.55,248453.55]
[null,null,null,2062,120.55,248574.1]
[null,null,null,2063,120.55,248694.65]
[null,null,null,2064,120.55,248815.19999999998]
[null,null,null,2065,{"$f":"$E$13","v":120.55},248935.75]
[null,null,null,2066,120.55,249056.3]
[null,null,null,2067,120.55,249176.85]
[null,null,null,2068,120.55,249297.4]
[null,null,null,2069,120.55,249417.94999999998]
[null,null,null,2070,120.55,249538.5]
[null,null,null,2071,120.55,249659.05]
[null,null,null,2072,120.55,249779.6]
[null,null,null,2073,120.55,249900.15]
[null,null,null,2074,120.55,250020.69999999998]
[null,null,null,2075,120.55,250141.25]
[null,null,null,2076,120.55,250261.8]
[null,null,null,2077,120.55,250382.35]
[null,null,null,2078,120.55,250502.9]
[null,null,null,2079,120.55,250623.44999999998]
[null,null,null,2080,120.55,250744]
[null,null,null,2081,120.55,250864.55]
[null,null,null,2082,120.55,250985.1]
[null,null,null,2083,120.55,251105.65]
[null,null,null,2084,120.55,{"$f":"E2101*D2101","v":251226.19999999998}]
[null,null,null,2085,120.55,251346.75]
[null,null,null,2086,120.55,251467.3]
[null,null,null,2087,120.55,251587.85]
[null,null,null,2088,120.55,251708.4]
[null,null,null,2089,120.55,251828.94999999998]
[null,null,null,2090,120.55,251949.5]
[null,null,null,2091,120.55,252070.05]
[null,null,null,2092,120.55,252190.6]
[null,null,null,2093,120.55,252311.15]
[null,null,null,2094,120.55,252431.69999999998]
[null,null,null,2095,120.55,252552.25]
[null,null,null,2096,120.55,252672.8]
[null,null,null,2097,120.55,252793.35]
[null,null,null,2098,120.55,252913.9]
[null,null,null,2099,120.55,253034.44999999998]
[null,null,null,2100,120.55,253155]
[null,null,null,2101,120.55,253275.55]
[null,null,null,2102,120.55,253396.1]
[null,null,null,2103,120.55,253516.65]
[null,null,null,2104,120.55,253637.19999999998]
[null,null,null,2105,120.55,253757.75]
[null,null,null,2106,120.55,253878.3]
[null,null,null,2107,120.55,253998.85]
[null,null,null,2108,120.55,254119.4]
[null,null,null,2109,120.55,254239.94999999998]
[null,null,null,2110,120.55,254360.5]
[null,null,null,2111,120.55,254481.05]
[null,null,null,2112,120.55,254601.60000000001]
[null,null,null,2113,120.55,254722.15]
[null,null,null,2114,120.55,254842.69999999998]
[null,null,null,2115,120.55,254963.25]
[null,null,null,2116,120.55,255083.8]
[null,null,null,2117,120.55,255204.35]
[null,null,null,2118,120.55,255324.9]
[null,null,null,2119,120.55,255445.44999999998]
[null,null,null,2120,120.55,255566]
[null,null,null,2121,120.55,255686.55]
[null,null,null,2122,120.55,255807.1]
[null,null,null,2123,120.55,255927.65]
[null,null,null,2124,120.55,256048.19999999998]
[null,null,null,2125,120.55,256168.75]
[null,null,null,2126,120.55,256289.3]
[null,null,null,2127,120.55,256409.85]
[null,null,null,2128,120.55,256530.4]
[null,null,null,2129,{"$f":"$E$13","v":120.55},256650.94999999998]
[null,null,null,2130,120.55,256771.5]
[null,null,null,2131,120.55,256892.05]
[null,null,null,2132,120.55,257012.6]
[null,null,null,2133,120.55,257133.15]
[null,null,null,2134,120.55,257253.69999999998]
[null,null,null,2135,120.55,257374.25]
[null,null,null,2136,120.55,257494.8]
[null,null,null,2137,120.55,257615.35]
[null,null,null,2138,120.55,257735.9]
[null,null,null,2139,120.55,257856.44999999998]
[null,null,null,2140,120.55,257977]
[null,null,null,2141,120.55,258097.55]
[null,null,null,2142,120.55,258218.1]
[null,null,null,2143,120.55,258338.65]
[null,null,null,2144,120.55,258459.19999999998]
[null,null,null,2145,120.55,258579.75]
[null,null,null,2146,120.55,258700.3]
[null,null,null,2147,120.55,258820.85]
[null,null,null,2148,120.55,{"$f":"E2165*D2165","v":258941.4}]
[null,null,null,2149,120.55,259061.94999999998]
[null,null,null,2150,120.55,259182.5]
[null,null,null,2151,120.55,259303.05]
[null,null,null,2152,120.55,259423.6]
[null,null,null,2153,120.55,259544.15]
[null,null,null,2154,120.55,259664.69999999998]
[null,null,null,2155,120.55,259785.25]
[null,null,null,2156,120.55,259905.8]
[null,null,null,2157,120.55,260026.35]
[null,null,null,2158,120.55,260146.9]
[null,null,null,2159,120.55,260267.44999999998]
[null,null,null,2160,120.55,260388]
[null,null,null,2161,120.55,260508.55]
[null,null,null,2162,120.55,260629.1]
[null,null,null,2163,120.55,260749.65]
[null,null,null,2164,120.55,260870.19999999998]
[null,null,null,2165,120.55,260990.75]
[null,null,null,2166,120.55,261111.3]
[null,null,null,2167,120.55,261231.85]
[null,null,null,2168,120.55,261352.4]
[null,null,null,2169,120.55,261472.94999999998]
[null,null,null,2170,120.55,261593.5]
[null,null,null,2171,120.55,261714.05]
[null,null,null,2172,120.55,261834.6]
[null,null,null,2173,120.55,261955.15]
[null,null,null,2174,120.55,262075.69999999998]
[null,null,null,2175,120.55,262196.25]
[null,null,null,2176,120.55,262316.79999999999]
[null,null,null,2177,120.55,262437.34999999998]
[null,null,null,2178,120.55,262557.89999999997]
[null,null,null,2179,120.55,262678.45]
[null,null,null,2180,120.55,262799]
[null,null,null,2181,120.55,262919.55]
[null,null,null,2182,120.55,263040.09999999998]
[null,null,null,2183,120.55,263160.64999999997]
[null,null,null,2184,120.55,263281.2]
[null,null,null,2185,120.55,263401.75]
[null,null,null,2186,120.55,263522.3]
[null,null,null,2187,120.55,263642.84999999998]
[null,null,null,2188,120.55,263763.39999999997]
[null,null,null,2189,120.55,263883.95]
[null,null,null,2190,120.55,264004.5]
[null,null,null,2191,120.55,264125.05]
[null,null,null,2192,120.55,264245.59999999998]
[null,null,null,2193,{"$f":"$E$13","v":120.55},264366.14999999997]
[null,null,null,2194,120.55,264486.7]
[null,null,null,2195,120.55,264607.25]
[null,null,null,2196,120.55,264727.8]
[null,null,null,2197,120.55,264848.34999999998]
[null,null,null,2198,120.55,264968.89999999997]
[null,null,null,2199,120.55,265089.45]
[null,null,null,2200,120.55,265210]
[null,null,null,2201,120.55,265330.55]
[null,null,null,2202,120.55,265451.09999999998]
[null,null,null,2203,120.55,265571.64999999997]
[null,null,null,2204,120.55,265692.2]
[null,null,null,2205,120.55,265812.75]
[null,null,null,2206,120.55,265933.3]
[null,null,null,2207,120.55,266053.84999999998]
[null,null,null,2208,120.55,266174.39999999997]
[null,null,null,2209,120.55,266294.95]
[null,null,null,2210,120.55,266415.5]
[null,null,null,2211,120.55,266536.05]
[null,null,null,2212,120.55,{"$f":"E2229*D2229","v":266656.59999999998}]
[null,null,null,2213,120.55,266777.14999999997]
[null,null,null,2214,120.55,266897.7]
[null,null,null,2215,120.55,267018.25]
[null,null,null,2216,120.55,267138.8]
[null,null,null,2217,120.55,267259.34999999998]
[null,null,null,2218,120.55,267379.89999999997]
[null,null,null,2219,120.55,267500.45]
[null,null,null,2220,120.55,267621]
[null,null,null,2221,120.55,267741.55]
[null,null,null,2222,120.55,267862.09999999998]
[null,null,null,2223,120.55,267982.64999999997]
[null,null,null,2224,120.55,268103.2]
[null,null,null,2225,120.55,268223.75]
[null,null,null,2226,120.55,268344.3]
[null,null,null,2227,120.55,268464.84999999998]
[null,null,null,2228,120.55,268585.39999999997]
[null,null,null,2229,120.55,268705.95]
[null,null,null,2230,120.55,268826.5]
[null,null,null,2231,120.55,268947.05]
[null,null,null,2232,120.55,269067.59999999998]
[null,null,null,2233,120.55,269188.14999999997]
[null,null,null,2234,120.55,269308.7]
[null,null,null,2235,120.55,269429.25]
[null,null,null,2236,120.55,269549.8]
[null,null,null,2237,120.55,269670.34999999998]
[null,null,null,2238,120.55,269790.89999999997]
[null,null,null,2239,120.55,269911.45]
[null,null,null,2240,120.55,270032]
[null,null,null,2241,120.55,270152.55]
[null,null,null,2242,120.55,270273.09999999998]
[null,null,null,2243,120.55,270393.64999999997]
[null,null,null,2244,120.55,270514.2]
[null,null,null,2245,120.55,270634.75]
[null,null,null,2246,120.55,270755.3]
[null,null,null,2247,120.55,270875.84999999998]
[null,null,null,2248,120.55,270996.39999999997]
[null,null,null,2249,120.55,271116.95]
[null,null,null,2250,120.55,271237.5]
[null,null,null,2251,120.55,271358.05]
[null,null,null,2252,120.55,271478.59999999998]
[null,null,null,2253,120.55,271599.14999999997]
[null,null,null,2254,120.55,271719.7]
[null,null,null,2255,120.55,271840.25]
[null,null,null,2256,120.55,271960.8]
[null,null,null,2257,{"$f":"$E$13","v":120.55},272081.34999999998]
[null,null,null,2258,120.55,272201.89999999997]
[null,null,null,2259,120.55,272322.45]
[null,null,null,2260,120.55,272443]
[null,null,null,2261,120.55,272563.55]
[null,null,null,2262,120.55,272684.09999999998]
[null,null,null,2263,120.55,272804.64999999997]
[null,null,null,2264,120.55,272925.2]
[null,null,null,2265,120.55,273045.75]
[null,null,null,2266,120.55,273166.3]
[null,null,null,2267,120.55,273286.84999999998]
[null,null,null,2268,120.55,273407.39999999997]
[null,null,null,2269,120.55,273527.95]
[null,null,null,2270,120.55,273648.5]
[null,null,null,2271,120.55,273769.05]
[null,null,null,2272,120.55,273889.59999999998]
[null,null,null,2273,120.55,274010.14999999997]
[null,null,null,2274,120.55,274130.7]
[null,null,null,2275,120.55,274251.25]
[null,null,null,2276,120.55,{"$f":"E2293*D2293","v":274371.8}]
[null,null,null,2277,120.55,274492.34999999998]
[null,null,null,2278,120.55,274612.89999999997]
[null,null,null,2279,120.55,274733.45]
[null,null,null,2280,120.55,274854]
[null,null,null,2281,120.55,274974.55]
[null,null,null,2282,120.55,275095.09999999998]
[null,null,null,2283,120.55,275215.64999999997]
[null,null,null,2284,120.55,275336.2]
[null,null,null,2285,120.55,275456.75]
[null,null,null,2286,120.55,275577.3]
[null,null,null,2287,120.55,275697.84999999998]
[null,null,null,2288,120.55,275818.39999999997]
[null,null,null,2289,120.55,275938.95]
[null,null,null,2290,120.55,276059.5]
[null,null,null,2291,120.55,276180.05]
[null,null,null,2292,120.55,276300.59999999998]
[null,null,null,2293,120.55,276421.14999999997]
[null,null,null,2294,120.55,276541.7]
[null,null,null,2295,120.55,276662.25]
[null,null,null,2296,120.55,276782.8]
[null,null,null,2297,120.55,276903.34999999998]
[null,null,null,2298,120.55,277023.89999999997]
[null,null,null,2299,120.55,277144.45]
[null,null,null,2300,120.55,277265]
[null,null,null,2301,120.55,277385.55]
[null,null,null,2302,120.55,277506.09999999998]
[null,null,null,2303,120.55,277626.64999999997]
[null,null,null,2304,120.55,277747.20000000001]
[null,null,null,2305,120.55,277867.75]
[null,null,null,2306,120.55,277988.3]
[null,null,null,2307,120.55,278108.84999999998]
[null,null,null,2308,120.55,278229.39999999997]
[null,null,null,2309,120.55,278349.95]
[null,null,null,2310,120.55,278470.5]
[null,null,null,2311,120.55,278591.05]
[null,null,null,2312,120.55,278711.59999999998]
[null,null,null,2313,120.55,278832.14999999997]
[null,null,null,2314,120.55,278952.7]
[null,null,null,2315,120.55,279073.25]
[null,null,null,2316,120.55,279193.8]
[null,null,null,2317,120.55,279314.34999999998]
[null,null,null,2318,120.55,279434.89999999997]
[null,null,null,2319,120.55,279555.45]
[null,null,null,2320,120.55,279676]
[null,null,null,2321,{"$f":"$E$13","v":120.55},279796.55]
[null,null,null,2322,120.55,279917.09999999998]
[null,null,null,2323,120.55,280037.64999999997]
[null,null,null,2324,120.55,280158.2]
[null,null,null,2325,120.55,280278.75]
[null,null,null,2326,120.55,280399.3]
[null,null,null,2327,120.55,280519.84999999998]
[null,null,null,2328,120.55,280640.39999999997]
[null,null,null,2329,120.55,280760.95]
[null,null,null,2330,120.55,280881.5]
[null,null,null,2331,120.55,281002.05]
[null,null,null,2332,120.55,281122.59999999998]
[null,null,null,2333,120.55,281243.14999999997]
[null,null,null,2334,120.55,281363.7]
[null,null,null,2335,120.55,281484.25]
[null,null,null,2336,120.55,281604.8]
[null,null,null,2337,120.55,281725.34999999998]
[null,null,null,2338,120.55,281845.89999999997]
[null,null,null,2339,120.55,281966.45]
[null,null,null,2340,120.55,{"$f":"E2357*D2357","v":282087}]
[null,null,null,2341,120.55,282207.55]
[null,null,null,2342,120.55,282328.09999999998]
[null,null,null,2343,120.55,282448.64999999997]
[null,null,null,2344,120.55,282569.2]
[null,null,null,2345,120.55,282689.75]
[null,null,null,2346,120.55,282810.3]
[null,null,null,2347,120.55,282930.84999999998]
[null,null,null,2348,120.55,283051.39999999997]
[null,null,null,2349,120.55,283171.95]
[null,null,null,2350,120.55,283292.5]
[null,null,null,2351,120.55,283413.05]
[null,null,null,2352,120.55,283533.59999999998]
[null,null,null,2353,120.55,283654.14999999997]
[null,null,null,2354,120.55,283774.7]
[null,null,null,2355,120.55,283895.25]
[null,null,null,2356,120.55,284015.8]
[null,null,null,2357,120.55,284136.34999999998]
[null,null,null,2358,120.55,284256.89999999997]
[null,null,null,2359,120.55,284377.45]
[null,null,null,2360,120.55,284498]
[null,null,null,2361,120.55,284618.55]
[null,null,null,2362,120.55,284739.09999999998]
[null,null,null,2363,120.55,284859.64999999997]
[null,null,null,2364,120.55,284980.2]
[null,null,null,2365,120.55,285100.75]
[null,null,null,2366,120.55,285221.3]
[null,null,null,2367,120.55,285341.84999999998]
[null,null,null,2368,120.55,285462.39999999997]
[null,null,null,2369,120.55,285582.95]
[null,null,null,2370,120.55,285703.5]
[null,null,null,2371,120.55,285824.05]
[null,null,null,2372,120.55,285944.59999999998]
[null,null,null,2373,120.55,286065.14999999997]
[null,null,null,2374,120.55,286185.7]
[null,null,null,2375,120.55,286306.25]
[null,null,null,2376,120.55,286426.8]
[null,null,null,2377,120.55,286547.34999999998]
[null,null,null,2378,120.55,286667.89999999997]
[null,null,null,2379,120.55,286788.45]
[null,null,null,2380,120.55,286909]
[null,null,null,2381,120.55,287029.55]
[null,null,null,2382,120.55,287150.09999999998]
[null,null,null,2383,120.55,287270.64999999997]
[null,null,null,2384,120.55,287391.2]
[null,null,null,2385,{"$f":"$E$13","v":120.55},287511.75]
[null,null,null,2386,120.55,287632.3]
[null,null,null,2387,120.55,287752.84999999998]
[null,null,null,2388,120.55,287873.39999999997]
[null,null,null,2389,120.55,287993.95]
[null,null,null,2390,120.55,288114.5]
[null,null,null,2391,120.55,288235.05]
[null,null,null,2392,120.55,288355.59999999998]
[null,null,null,2393,120.55,288476.14999999997]
[null,null,null,2394,120.55,288596.7]
[null,null,null,2395,120.55,288717.25]
[null,null,null,2396,120.55,288837.8]
[null,null,null,2397,120.55,288958.34999999998]
[null,null,null,2398,120.55,289078.89999999997]
[null,null,null,2399,120.55,289199.45]
[null,null,null,2400,120.55,289320]
[null,null,null,2401,120.55,289440.55]
[null,null,null,2402,120.55,289561.09999999998]
[null,null,null,2403,120.55,289681.64999999997]
[null,null,null,2404,120.55,{"$f":"E2421*D2421","v":289802.2}]
[null,null,null,2405,120.55,289922.75]
[null,null,null,2406,120.55,290043.3]
[null,null,null,2407,120.55,290163.84999999998]
[null,null,null,2408,120.55,290284.39999999997]
[null,null,null,2409,120.55,290404.95]
[null,null,null,2410,120.55,290525.5]
[null,null,null,2411,120.55,290646.05]
[null,null,null,2412,120.55,290766.59999999998]
[null,null,null,2413,120.55,290887.14999999997]
[null,null,null,2414,120.55,291007.7]
[null,null,null,2415,120.55,291128.25]
[null,null,null,2416,120.55,291248.8]
[null,null,null,2417,120.55,291369.34999999998]
[null,null,null,2418,120.55,291489.89999999997]
[null,null,null,2419,120.55,291610.45]
[null,null,null,2420,120.55,291731]
[null,null,null,2421,120.55,291851.55]
[null,null,null,2422,120.55,291972.09999999998]
[null,null,null,2423,120.55,292092.64999999997]
[null,null,null,2424,120.55,292213.2]
[null,null,null,2425,120.55,292333.75]
[null,null,null,2426,120.55,292454.3]
[null,null,null,2427,120.55,292574.84999999998]
[null,null,null,2428,120.55,292695.39999999997]
[null,null,null,2429,120.55,292815.95]
[null,null,null,2430,120.55,292936.5]
[null,null,null,2431,120.55,293057.05]
[null,null,null,2432,120.55,293177.59999999998]
[null,null,null,2433,120.55,293298.14999999997]
[null,null,null,2434,120.55,293418.7]
[null,null,null,2435,120.55,293539.25]
[null,null,null,2436,120.55,293659.8]
[null,null,null,2437,120.55,293780.34999999998]
[null,null,null,2438,120.55,293900.89999999997]
[null,null,null,2439,120.55,294021.45]
[null,null,null,2440,120.55,294142]
[null,null,null,2441,120.55,294262.55]
[null,null,null,2442,120.55,294383.09999999998]
[null,null,null,2443,120.55,294503.64999999997]
[null,null,null,2444,120.55,294624.2]
[null,null,null,2445,120.55,294744.75]
[null,null,null,2446,120.55,294865.3]
[null,null,null,2447,120.55,294985.84999999998]
[null,null,null,2448,120.55,295106.39999999997]
[null,null,null,2449,{"$f":"$E$13","v":120.55},295226.95]
[null,null,null,2450,120.55,295347.5]
[null,null,null,2451,120.55,295468.05]
[null,null,null,2452,120.55,295588.59999999998]
[null,null,null,2453,120.55,295709.14999999997]
[null,null,null,2454,120.55,295829.7]
[null,null,null,2455,120.55,295950.25]
[null,null,null,2456,120.55,296070.8]
[null,null,null,2457,120.55,296191.34999999998]
[null,null,null,2458,120.55,296311.89999999997]
[null,null,null,2459,120.55,296432.45]
[null,null,null,2460,120.55,296553]
[null,null,null,2461,120.55,296673.55]
[null,null,null,2462,120.55,296794.09999999998]
[null,null,null,2463,120.55,296914.64999999997]
[null,null,null,2464,120.55,297035.2]
[null,null,null,2465,120.55,297155.75]
[null,null,null,2466,120.55,297276.3]
[null,null,null,2467,120.55,297396.84999999998]
[null,null,null,2468,120.55,{"$f":"E2485*D2485","v":297517.39999999997}]
[null,null,null,2469,120.55,297637.95]
[null,null,null,2470,120.55,297758.5]
[null,null,null,2471,120.55,297879.05]
[null,null,null,2472,120.55,297999.59999999998]
[null,null,null,2473,120.55,298120.14999999997]
[null,null,null,2474,120.55,298240.7]
[null,null,null,2475,120.55,298361.25]
[null,null,null,2476,120.55,298481.8]
[null,null,null,2477,120.55,298602.34999999998]
[null,null,null,2478,120.55,298722.89999999997]
[null,null,null,2479,120.55,298843.45]
[null,null,null,2480,120.55,298964]
[null,null,null,2481,120.55,299084.55]
[null,null,null,2482,120.55,299205.09999999998]
[null,null,null,2483,120.55,299325.64999999997]
[null,null,null,2484,120.55,299446.2]
[null,null,null,2485,120.55,299566.75]
[null,null,null,2486,120.55,299687.3]
[null,null,null,2487,120.55,299807.84999999998]
[null,null,null,2488,120.55,299928.39999999997]
[null,null,null,2489,120.55,300048.95]
[null,null,null,2490,120.55,300169.5]
[null,null,null,2491,120.55,300290.05]
[null,null,null,2492,120.55,300410.59999999998]
[null,null,null,2493,120.55,300531.14999999997]
[null,null,null,2494,120.55,300651.7]
[null,null,null,2495,120.55,300772.25]
[null,null,null,2496,120.55,300892.79999999999]
[null,null,null,2497,120.55,301013.34999999998]
[null,null,null,2498,120.55,301133.89999999997]
[null,null,null,2499,120.55,301254.45]
[null,null,null,2500,120.55,301375]
[null,null,null,2501,120.55,301495.55]
[null,null,null,2502,120.55,301616.09999999998]
[null,null,null,2503,120.55,301736.64999999997]
[null,null,null,2504,120.55,301857.2]
[null,null,null,2505,120.55,301977.75]
[null,null,null,2506,120.55,302098.3]
[null,null,null,2507,120.55,302218.84999999998]
[null,null,null,2508,120.55,302339.39999999997]
[null,null,null,2509,120.55,302459.95]
[null,null,null,2510,120.55,302580.5]
[null,null,null,2511,120.55,302701.05]
[null,null,null,2512,120.55,302821.59999999998]
[null,null,null,2513,{"$f":"$E$13","v":120.55},302942.14999999997]
[null,null,null,2514,120.55,303062.7]
[null,null,null,2515,120.55,303183.25]
[null,null,null,2516,120.55,303303.8]
[null,null,null,2517,120.55,303424.34999999998]
[null,null,null,2518,120.55,303544.89999999997]
[null,null,null,2519,120.55,303665.45]
[null,null,null,2520,120.55,303786]
[null,null,null,2521,120.55,303906.55]
[null,null,null,2522,120.55,304027.09999999998]
[null,null,null,2523,120.55,304147.64999999997]
[null,null,null,2524,120.55,304268.2]
[null,null,null,2525,120.55,304388.75]
[null,null,null,2526,120.55,304509.3]
[null,null,null,2527,120.55,304629.84999999998]
[null,null,null,2528,120.55,304750.39999999997]
[null,null,null,2529,120.55,304870.95]
[null,null,null,2530,120.55,304991.5]
[null,null,null,2531,120.55,305112.05]
[null,null,null,2532,120.55,{"$f":"E2549*D2549","v":305232.59999999998}]
[null,null,null,2533,120.55,305353.14999999997]
[null,null,null,2534,120.55,305473.7]
[null,null,null,2535,120.55,305594.25]
[null,null,null,2536,120.55,305714.8]
[null,null,null,2537,120.55,305835.34999999998]
[null,null,null,2538,120.55,305955.89999999997]
[null,null,null,2539,120.55,306076.45]
[null,null,null,2540,120.55,306197]
[null,null,null,2541,120.55,306317.55]
[null,null,null,2542,120.55,306438.09999999998]
[null,null,null,2543,120.55,306558.64999999997]
[null,null,null,2544,120.55,306679.2]
[null,null,null,2545,120.55,306799.75]
[null,null,null,2546,120.55,306920.3]
[null,null,null,2547,120.55,307040.84999999998]
[null,null,null,2548,120.55,307161.39999999997]
[null,null,null,2549,120.55,307281.95]
[null,null,null,2550,120.55,307402.5]
[null,null,null,2551,120.55,307523.05]
[null,null,null,2552,120.55,307643.59999999998]
[null,null,null,2553,120.55,307764.14999999997]
[null,null,null,2554,120.55,307884.7]
[null,null,null,2555,120.55,308005.25]
[null,null,null,2556,120.55,308125.8]
[null,null,null,2557,120.55,308246.34999999998]
[null,null,null,2558,120.55,308366.89999999997]
[null,null,null,2559,120.55,308487.45]
[null,null,null,2560,120.55,308608]
[null,null,null,2561,120.55,308728.55]
[null,null,null,2562,120.55,308849.09999999998]
[null,null,null,2563,120.55,308969.64999999997]
[null,null,null,2564,120.55,309090.2]
[null,null,null,2565,120.55,309210.75]
[null,null,null,2566,120.55,309331.3]
[null,null,null,2567,120.55,309451.84999999998]
[null,null,null,2568,120.55,309572.39999999997]
[null,null,null,2569,120.55,309692.95]
[null,null,null,2570,120.55,309813.5]
[null,null,null,2571,120.55,309934.05]
[null,null,null,2572,120.55,310054.59999999998]
[null,null,null,2573,120.55,310175.14999999997]
[null,null,null,2574,120.55,310295.7]
[null,null,null,2575,120.55,310416.25]
[null,null,null,2576,120.55,310536.8]
[null,null,null,2577,{"$f":"$E$13","v":120.55},310657.34999999998]
[null,null,null,2578,120.55,310777.89999999997]
[null,null,null,2579,120.55,310898.45]
[null,null,null,2580,120.55,311019]
[null,null,null,2581,120.55,311139.55]
[null,null,null,2582,120.55,311260.09999999998]
[null,null,null,2583,120.55,311380.64999999997]
[null,null,null,2584,120.55,311501.2]
[null,null,null,2585,120.55,311621.75]
[null,null,null,2586,120.55,311742.3]
[null,null,null,2587,120.55,311862.84999999998]
[null,null,null,2588,120.55,311983.39999999997]
[null,null,null,2589,120.55,312103.95]
[null,null,null,2590,120.55,312224.5]
[null,null,null,2591,120.55,312345.05]
[null,null,null,2592,120.55,312465.59999999998]
[null,null,null,2593,120.55,312586.14999999997]
[null,null,null,2594,120.55,312706.7]
[null,null,null,2595,120.55,312827.25]
[null,null,null,2596,120.55,{"$f":"E2613*D2613","v":312947.8}]
[null,null,null,2597,120.55,313068.34999999998]
[null,null,null,2598,120.55,313188.89999999997]
[null,null,null,2599,120.55,313309.45]
[null,null,null,2600,120.55,313430]
[null,null,null,2601,120.55,313550.55]
[null,null,null,2602,120.55,313671.09999999998]
[null,null,null,2603,120.55,313791.64999999997]
[null,null,null,2604,120.55,313912.2]
[null,null,null,2605,120.55,314032.75]
[null,null,null,2606,120.55,314153.3]
[null,null,null,2607,120.55,314273.84999999998]
[null,null,null,2608,120.55,314394.39999999997]
[null,null,null,2609,120.55,314514.95]
[null,null,null,2610,120.55,314635.5]
[null,null,null,2611,120.55,314756.05]
[null,null,null,2612,120.55,314876.59999999998]
[null,null,null,2613,120.55,314997.14999999997]
[null,null,null,2614,120.55,315117.7]
[null,null,null,2615,120.55,315238.25]
[null,null,null,2616,120.55,315358.8]
[null,null,null,2617,120.55,315479.34999999998]
[null,null,null,2618,120.55,315599.89999999997]
[null,null,null,2619,120.55,315720.45]
[null,null,null,2620,120.55,315841]
[null,null,null,2621,120.55,315961.55]
[null,null,null,2622,120.55,316082.09999999998]
[null,null,null,2623,120.55,316202.64999999997]
[null,null,null,2624,120.55,316323.20000000001]
[null,null,null,2625,120.55,316443.75]
[null,null,null,2626,120.55,316564.3]
[null,null,null,2627,120.55,316684.84999999998]
[null,null,null,2628,120.55,316805.39999999997]
[null,null,null,2629,120.55,316925.95]
[null,null,null,2630,120.55,317046.5]
[null,null,null,2631,120.55,317167.05]
[null,null,null,2632,120.55,317287.59999999998]
[null,null,null,2633,120.55,317408.14999999997]
[null,null,null,2634,120.55,317528.7]
[null,null,null,2635,120.55,317649.25]
[null,null,null,2636,120.55,317769.8]
[null,null,null,2637,120.55,317890.34999999998]
[null,null,null,2638,120.55,318010.89999999997]
[null,null,null,2639,120.55,318131.45]
[null,null,null,2640,120.55,318252]
[null,null,null,2641,{"$f":"$E$13","v":120.55},318372.55]
[null,null,null,2642,120.55,318493.09999999998]
[null,null,null,2643,120.55,318613.64999999997]
[null,null,null,2644,120.55,318734.2]
[null,null,null,2645,120.55,318854.75]
[null,null,null,2646,120.55,318975.3]
[null,null,null,2647,120.55,319095.84999999998]
[null,null,null,2648,120.55,319216.39999999997]
[null,null,null,2649,120.55,319336.95]
[null,null,null,2650,120.55,319457.5]
[null,null,null,2651,120.55,319578.05]
[null,null,null,2652,120.55,319698.59999999998]
[null,null,null,2653,120.55,319819.14999999997]
[null,null,null,2654,120.55,319939.7]
[null,null,null,2655,120.55,320060.25]
[null,null,null,2656,120.55,320180.8]
[null,null,null,2657,120.55,320301.34999999998]
[null,null,null,2658,120.55,320421.89999999997]
[null,null,null,2659,120.55,320542.45]
[null,null,null,2660,120.55,{"$f":"E2677*D2677","v":320663}]
[null,null,null,2661,120.55,320783.55]
[null,null,null,2662,120.55,320904.09999999998]
[null,null,null,2663,120.55,321024.64999999997]
[null,null,null,2664,120.55,321145.2]
[null,null,null,2665,120.55,321265.75]
[null,null,null,2666,120.55,321386.3]
[null,null,null,2667,120.55,321506.84999999998]
[null,null,null,2668,120.55,321627.39999999997]
[null,null,null,2669,120.55,321747.95]
[null,null,null,2670,120.55,321868.5]
[null,null,null,2671,120.55,321989.05]
[null,null,null,2672,120.55,322109.59999999998]
[null,null,null,2673,120.55,322230.14999999997]
[null,null,null,2674,120.55,322350.7]
[null,null,null,2675,120.55,322471.25]
[null,null,null,2676,120.55,322591.8]
[null,null,null,2677,120.55,322712.34999999998]
[null,null,null,2678,120.55,322832.89999999997]
[null,null,null,2679,120.55,322953.45]
[null,null,null,2680,120.55,323074]
[null,null,null,2681,120.55,323194.55]
[null,null,null,2682,120.55,323315.09999999998]
[null,null,null,2683,120.55,323435.64999999997]
[null,null,null,2684,120.55,323556.2]
[null,null,null,2685,120.55,323676.75]
[null,null,null,2686,120.55,323797.3]
[null,null,null,2687,120.55,323917.84999999998]
[null,null,null,2688,120.55,324038.39999999997]
[null,null,null,2689,120.55,324158.95]
[null,null,null,2690,120.55,324279.5]
[null,null,null,2691,120.55,324400.05]
[null,null,null,2692,120.55,324520.59999999998]
[null,null,null,2693,120.55,324641.14999999997]
[null,null,null,2694,120.55,324761.7]
[null,null,null,2695,120.55,324882.25]
[null,null,null,2696,120.55,325002.8]
[null,null,null,2697,120.55,325123.34999999998]
[null,null,null,2698,120.55,325243.89999999997]
[null,null,null,2699,120.55,325364.45]
[null,null,null,2700,120.55,325485]
[null,null,null,2701,120.55,325605.55]
[null,null,null,2702,120.55,325726.09999999998]
[null,null,null,2703,120.55,325846.64999999997]
[null,null,null,2704,120.55,325967.2]
[null,null,null,2705,{"$f":"$E$13","v":120.55},326087.75]
[null,null,null,2706,120.55,326208.3]
[null,null,null,2707,120.55,326328.84999999998]
[null,null,null,2708,120.55,326449.39999999997]
[null,null,null,2709,120.55,326569.95]
[null,null,null,2710,120.55,326690.5]
[null,null,null,2711,120.55,326811.05]
[null,null,null,2712,120.55,326931.59999999998]
[null,null,null,2713,120.55,327052.14999999997]
[null,null,null,2714,120.55,327172.7]
[null,null,null,2715,120.55,327293.25]
[null,null,null,2716,120.55,327413.8]
[null,null,null,2717,120.55,327534.34999999998]
[null,null,null,2718,120.55,327654.89999999997]
[null,null,null,2719,120.55,327775.45]
[null,null,null,2720,120.55,327896]
[null,null,null,2721,120.55,328016.55]
[null,null,null,2722,120.55,328137.09999999998]
[null,null,null,2723,120.55,328257.64999999997]
[null,null,null,2724,120.55,{"$f":"E2741*D2741","v":328378.2}]
[null,null,null,2725,120.55,328498.75]
[null,null,null,2726,120.55,328619.3]
[null,null,null,2727,120.55,328739.84999999998]
[null,null,null,2728,120.55,328860.39999999997]
[null,null,null,2729,120.55,328980.95]
[null,null,null,2730,120.55,329101.5]
[null,null,null,2731,120.55,329222.05]
[null,null,null,2732,120.55,329342.59999999998]
[null,null,null,2733,120.55,329463.14999999997]
[null,null,null,2734,120.55,329583.7]
[null,null,null,2735,120.55,329704.25]
[null,null,null,2736,120.55,329824.8]
[null,null,null,2737,120.55,329945.34999999998]
[null,null,null,2738,120.55,330065.89999999997]
[null,null,null,2739,120.55,330186.45]
[null,null,null,2740,120.55,330307]
[null,null,null,2741,120.55,330427.55]
[null,null,null,2742,120.55,330548.09999999998]
[null,null,null,2743,120.55,330668.64999999997]
[null,null,null,2744,120.55,330789.2]
[null,null,null,2745,120.55,330909.75]
[null,null,null,2746,120.55,331030.3]
[null,null,null,2747,120.55,331150.84999999998]
[null,null,null,2748,120.55,331271.39999999997]
[null,null,null,2749,120.55,331391.95]
[null,null,null,2750,120.55,331512.5]
[null,null,null,2751,120.55,331633.05]
[null,null,null,2752,120.55,331753.59999999998]
[null,null,null,2753,120.55,331874.14999999997]
[null,null,null,2754,120.55,331994.7]
[null,null,null,2755,120.55,332115.25]
[null,null,null,2756,120.55,332235.8]
[null,null,null,2757,120.55,332356.34999999998]
[null,null,null,2758,120.55,332476.89999999997]
[null,null,null,2759,120.55,332597.45]
[null,null,null,2760,120.55,332718]
[null,null,null,2761,120.55,332838.55]
[null,null,null,2762,120.55,332959.09999999998]
[null,null,null,2763,120.55,333079.64999999997]
[null,null,null,2764,120.55,333200.2]
[null,null,null,2765,120.55,333320.75]
[null,null,null,2766,120.55,333441.3]
[null,null,null,2767,120.55,333561.84999999998]
[null,null,null,2768,120.55,333682.39999999997]
[null,null,null,2769,{"$f":"$E$13","v":120.55},333802.95]
[null,null,null,2770,120.55,333923.5]
[null,null,null,2771,120.55,334044.05]
[null,null,null,2772,120.55,334164.59999999998]
[null,null,null,2773,120.55,334285.14999999997]
[null,null,null,2774,120.55,334405.7]
[null,null,null,2775,120.55,334526.25]
[null,null,null,2776,120.55,334646.8]
[null,null,null,2777,120.55,334767.34999999998]
[null,null,null,2778,120.55,334887.89999999997]
[null,null,null,2779,120.55,335008.45]
[null,null,null,2780,120.55,335129]
[null,null,null,2781,120.55,335249.55]
[null,null,null,2782,120.55,335370.09999999998]
[null,null,null,2783,120.55,335490.64999999997]
[null,null,null,2784,120.55,335611.2]
[null,null,null,2785,120.55,335731.75]
[null,null,null,2786,120.55,335852.3]
[null,null,null,2787,120.55,335972.85]
[null,null,null,2788,120.55,{"$f":"E2805*D2805","v":336093.39999999997}]
[null,null,null,2789,120.55,336213.95]
[null,null,null,2790,120.55,336334.5]
[null,null,null,2791,120.55,336455.05]
[null,null,null,2792,120.55,336575.6]
[null,null,null,2793,120.55,336696.14999999997]
[null,null,null,2794,120.55,336816.7]
[null,null,null,2795,120.55,336937.25]
[null,null,null,2796,120.55,337057.8]
[null,null,null,2797,120.55,337178.35]
[null,null,null,2798,120.55,337298.89999999997]
[null,null,null,2799,120.55,337419.45]
[null,null,null,2800,120.55,337540]
[null,null,null,2801,120.55,337660.55]
[null,null,null,2802,120.55,337781.1]
[null,null,null,2803,120.55,337901.64999999997]
[null,null,null,2804,120.55,338022.2]
[null,null,null,2805,120.55,338142.75]
[null,null,null,2806,120.55,338263.3]
[null,null,null,2807,120.55,338383.85]
[null,null,null,2808,120.55,338504.39999999997]
[null,null,null,2809,120.55,338624.95]
[null,null,null,2810,120.55,338745.5]
[null,null,null,2811,120.55,338866.05]
[null,null,null,2812,120.55,338986.6]
[null,null,null,2813,120.55,339107.14999999997]
[null,null,null,2814,120.55,339227.7]
[null,null,null,2815,120.55,339348.25]
[null,null,null,2816,120.55,339468.79999999999]
[null,null,null,2817,120.55,339589.35]
[null,null,null,2818,120.55,339709.89999999997]
[null,null,null,2819,120.55,339830.45]
[null,null,null,2820,120.55,339951]
[null,null,null,2821,120.55,340071.55]
[null,null,null,2822,120.55,340192.1]
[null,null,null,2823,120.55,340312.64999999997]
[null,null,null,2824,120.55,340433.2]
[null,null,null,2825,120.55,340553.75]
[null,null,null,2826,120.55,340674.3]
[null,null,null,2827,120.55,340794.85]
[null,null,null,2828,120.55,340915.39999999997]
[null,null,null,2829,120.55,341035.95]
[null,null,null,2830,120.55,341156.5]
[null,null,null,2831,120.55,341277.05]
[null,null,null,2832,120.55,341397.6]
[null,null,null,2833,{"$f":"$E$13","v":120.55},341518.14999999997]
[null,null,null,2834,120.55,341638.7]
[null,null,null,2835,120.55,341759.25]
[null,null,null,2836,120.55,341879.8]
[null,null,null,2837,120.55,342000.35]
[null,null,null,2838,120.55,342120.89999999997]
[null,null,null,2839,120.55,342241.45]
[null,null,null,2840,120.55,342362]
[null,null,null,2841,120.55,342482.55]
[null,null,null,2842,120.55,342603.1]
[null,null,null,2843,120.55,342723.64999999997]
[null,null,null,2844,120.55,342844.2]
[null,null,null,2845,120.55,342964.75]
[null,null,null,2846,120.55,343085.3]
[null,null,null,2847,120.55,343205.85]
[null,null,null,2848,120.55,343326.39999999997]
[null,null,null,2849,120.55,343446.95]
[null,null,null,2850,120.55,343567.5]
[null,null,null,2851,120.55,343688.05]
[null,null,null,2852,120.55,{"$f":"E2869*D2869","v":343808.6}]
[null,null,null,2853,120.55,343929.14999999997]
[null,null,null,2854,120.55,344049.7]
[null,null,null,2855,120.55,344170.25]
[null,null,null,2856,120.55,344290.8]
[null,null,null,2857,120.55,344411.35]
[null,null,null,2858,120.55,344531.89999999997]
[null,null,null,2859,120.55,344652.45]
[null,null,null,2860,120.55,344773]
[null,null,null,2861,120.55,344893.55]
[null,null,null,2862,120.55,345014.1]
[null,null,null,2863,120.55,345134.64999999997]
[null,null,null,2864,120.55,345255.2]
[null,null,null,2865,120.55,345375.75]
[null,null,null,2866,120.55,345496.3]
[null,null,null,2867,120.55,345616.85]
[null,null,null,2868,120.55,345737.39999999997]
[null,null,null,2869,120.55,345857.95]
[null,null,null,2870,120.55,345978.5]
[null,null,null,2871,120.55,346099.05]
[null,null,null,2872,120.55,346219.6]
[null,null,null,2873,120.55,346340.14999999997]
[null,null,null,2874,120.55,346460.7]
[null,null,null,2875,120.55,346581.25]
[null,null,null,2876,120.55,346701.8]
[null,null,null,2877,120.55,346822.35]
[null,null,null,2878,120.55,346942.89999999997]
[null,null,null,2879,120.55,347063.45]
[null,null,null,2880,120.55,347184]
[null,null,null,2881,120.55,347304.55]
[null,null,null,2882,120.55,347425.1]
[null,null,null,2883,120.55,347545.64999999997]
[null,null,null,2884,120.55,347666.2]
[null,null,null,2885,120.55,347786.75]
[null,null,null,2886,120.55,347907.3]
[null,null,null,2887,120.55,348027.85]
[null,null,null,2888,120.55,348148.39999999997]
[null,null,null,2889,120.55,348268.95]
[null,null,null,2890,120.55,348389.5]
[null,null,null,2891,120.55,348510.05]
[null,null,null,2892,120.55,348630.6]
[null,null,null,2893,120.55,348751.14999999997]
[null,null,null,2894,120.55,348871.7]
[null,null,null,2895,120.55,348992.25]
[null,null,null,2896,120.55,349112.8]
[null,null,null,2897,{"$f":"$E$13","v":120.55},349233.35]
[null,null,null,2898,120.55,349353.89999999997]
[null,null,null,2899,120.55,349474.45]
[null,null,null,2900,120.55,349595]
[null,null,null,2901,120.55,349715.55]
[null,null,null,2902,120.55,349836.1]
[null,null,null,2903,120.55,349956.64999999997]
[null,null,null,2904,120.55,350077.2]
[null,null,null,2905,120.55,350197.75]
[null,null,null,2906,120.55,350318.3]
[null,null,null,2907,120.55,350438.85]
[null,null,null,2908,120.55,350559.39999999997]
[null,null,null,2909,120.55,350679.95]
[null,null,null,2910,120.55,350800.5]
[null,null,null,2911,120.55,350921.05]
[null,null,null,2912,120.55,351041.6]
[null,null,null,2913,120.55,351162.14999999997]
[null,null,null,2914,120.55,351282.7]
[null,null,null,2915,120.55,351403.25]
[null,null,null,2916,120.55,{"$f":"E2933*D2933","v":351523.8}]
[null,null,null,2917,120.55,351644.35]
[null,null,null,2918,120.55,351764.89999999997]
[null,null,null,2919,120.55,351885.45]
[null,null,null,2920,120.55,352006]
[null,null,null,2921,120.55,352126.55]
[null,null,null,2922,120.55,352247.1]
[null,null,null,2923,120.55,352367.64999999997]
[null,null,null,2924,120.55,352488.2]
[null,null,null,2925,120.55,352608.75]
[null,null,null,2926,120.55,352729.3]
[null,null,null,2927,120.55,352849.85]
[null,null,null,2928,120.55,352970.39999999997]
[null,null,null,2929,120.55,353090.95]
[null,null,null,2930,120.55,353211.5]
[null,null,null,2931,120.55,353332.05]
[null,null,null,2932,120.55,353452.6]
[null,null,null,2933,120.55,353573.14999999997]
[null,null,null,2934,120.55,353693.7]
[null,null,null,2935,120.55,353814.25]
[null,null,null,2936,120.55,353934.8]
[null,null,null,2937,120.55,354055.35]
[null,null,null,2938,120.55,354175.89999999997]
[null,null,null,2939,120.55,354296.45]
[null,null,null,2940,120.55,354417]
[null,null,null,2941,120.55,354537.55]
[null,null,null,2942,120.55,354658.1]
[null,null,null,2943,120.55,354778.64999999997]
[null,null,null,2944,120.55,354899.20000000001]
[null,null,null,2945,120.55,355019.75]
[null,null,null,2946,120.55,355140.3]
[null,null,null,2947,120.55,355260.85]
[null,null,null,2948,120.55,355381.39999999997]
[null,null,null,2949,120.55,355501.95]
[null,null,null,2950,120.55,355622.5]
[null,null,null,2951,120.55,355743.05]
[null,null,null,2952,120.55,355863.6]
[null,null,null,2953,120.55,355984.14999999997]
[null,null,null,2954,120.55,356104.7]
[null,null,null,2955,120.55,356225.25]
[null,null,null,2956,120.55,356345.8]
[null,null,null,2957,120.55,356466.35]
[null,null,null,2958,120.55,356586.89999999997]
[null,null,null,2959,120.55,356707.45]
[null,null,null,2960,120.55,356828]
[null,null,null,2961,{"$f":"$E$13","v":120.55},356948.55]
[null,null,null,2962,120.55,357069.1]
[null,null,null,2963,120.55,357189.64999999997]
[null,null,null,2964,120.55,357310.2]
[null,null,null,2965,120.55,357430.75]
[null,null,null,2966,120.55,357551.3]
[null,null,null,2967,120.55,357671.85]
[null,null,null,2968,120.55,357792.39999999997]
[null,null,null,2969,120.55,357912.95]
[null,null,null,2970,120.55,358033.5]
[null,null,null,2971,120.55,358154.05]
[null,null,null,2972,120.55,358274.6]
[null,null,null,2973,120.55,358395.14999999997]
[null,null,null,2974,120.55,358515.7]
[null,null,null,2975,120.55,358636.25]
[null,null,null,2976,120.55,358756.8]
[null,null,null,2977,120.55,358877.35]
[null,null,null,2978,120.55,358997.89999999997]
[null,null,null,2979,120.55,359118.45]
[null,null,null,2980,120.55,{"$f":"E2997*D2997","v":359239}]
[null,null,null,2981,120.55,359359.55]
[null,null,null,2982,120.55,359480.1]
[null,null,null,2983,120.55,359600.64999999997]
[null,null,null,2984,120.55,359721.2]
[null,null,null,2985,120.55,359841.75]
[null,null,null,2986,120.55,359962.3]
[null,null,null,2987,120.55,360082.85]
[null,null,null,2988,120.55,360203.39999999997]
[null,null,null,2989,120.55,360323.95]
[null,null,null,2990,120.55,360444.5]
[null,null,null,2991,120.55,360565.05]
[null,null,null,2992,120.55,360685.6]
[null,null,null,2993,120.55,360806.14999999997]
[null,null,null,2994,120.55,360926.7]
[null,null,null,2995,120.55,361047.25]
[null,null,null,2996,120.55,361167.8]
[null,null,null,2997,120.55,361288.35]
[null,null,null,2998,120.55,361408.89999999997]
[null,null,null,2999,120.55,361529.45]
[null,null,null,3000,120.55,361650]
[null,null,null,3001,120.55,361770.55]
[null,null,null,3002,120.55,361891.1]
[null,null,null,3003,120.55,362011.64999999997]
[null,null,null,3004,120.55,362132.2]
[null,null,null,3005,120.55,362252.75]
[null,null,null,3006,120.55,362373.3]
[null,null,null,3007,120.55,362493.85]
[null,null,null,3008,120.55,362614.39999999997]
[null,null,null,3009,120.55,362734.95]
[null,null,null,3010,120.55,362855.5]
[null,null,null,3011,120.55,362976.05]
[null,null,null,3012,120.55,363096.6]
[null,null,null,3013,120.55,363217.14999999997]
[null,null,null,3014,120.55,363337.7]
[null,null,null,3015,120.55,363458.25]
[null,null,null,3016,120.55,363578.8]
[null,null,null,3017,120.55,363699.35]
[null,null,null,3018,120.55,363819.89999999997]
[null,null,null,3019,120.55,363940.45]
[null,null,null,3020,120.55,364061]
[null,null,null,3021,120.55,364181.55]
[null,null,null,3022,120.55,364302.1]
[null,null,null,3023,120.55,364422.64999999997]
[null,null,null,3024,120.55,364543.2]
[null,null,null,3025,{"$f":"$E$13","v":120.55},364663.75]
[null,null,null,3026,120.55,364784.3]
[null,null,null,3027,120.55,364904.85]
[null,null,null,3028,120.55,365025.39999999997]
[null,null,null,3029,120.55,365145.95]
[null,null,null,3030,120.55,365266.5]
[null,null,null,3031,120.55,365387.05]
[null,null,null,3032,120.55,365507.6]
[null,null,null,3033,120.55,365628.14999999997]
[null,null,null,3034,120.55,365748.7]
[null,null,null,3035,120.55,365869.25]
[null,null,null,3036,120.55,365989.8]
[null,null,null,3037,120.55,366110.35]
[null,null,null,3038,120.55,366230.89999999997]
[null,null,null,3039,120.55,366351.45]
[null,null,null,3040,120.55,366472]
[null,null,null,3041,120.55,366592.55]
[null,null,null,3042,120.55,366713.1]
[null,null,null,3043,120.55,366833.64999999997]
[null,null,null,3044,120.55,{"$f":"E3061*D3061","v":366954.2}]
[null,null,null,3045,120.55,367074.75]
[null,null,null,3046,120.55,367195.3]
[null,null,null,3047,120.55,367315.85]
[null,null,null,3048,120.55,367436.39999999997]
[null,null,null,3049,120.55,367556.95]
[null,null,null,3050,120.55,367677.5]
[null,null,null,3051,120.55,367798.05]
[null,null,null,3052,120.55,367918.6]
[null,null,null,3053,120.55,368039.14999999997]
[null,null,null,3054,120.55,368159.7]
[null,null,null,3055,120.55,368280.25]
[null,null,null,3056,120.55,368400.8]
[null,null,null,3057,120.55,368521.35]
[null,null,null,3058,120.55,368641.89999999997]
[null,null,null,3059,120.55,368762.45]
[null,null,null,3060,120.55,368883]
[null,null,null,3061,120.55,369003.55]
[null,null,null,3062,120.55,369124.1]
[null,null,null,3063,120.55,369244.64999999997]
[null,null,null,3064,120.55,369365.2]
[null,null,null,3065,120.55,369485.75]
[null,null,null,3066,120.55,369606.3]
[null,null,null,3067,120.55,369726.85]
[null,null,null,3068,120.55,369847.39999999997]
[null,null,null,3069,120.55,369967.95]
[null,null,null,3070,120.55,370088.5]
[null,null,null,3071,120.55,370209.05]
[null,null,null,3072,120.55,370329.59999999998]
[null,null,null,3073,120.55,370450.14999999997]
[null,null,null,3074,120.55,370570.7]
[null,null,null,3075,120.55,370691.25]
[null,null,null,3076,120.55,370811.8]
[null,null,null,3077,120.55,370932.35]
[null,null,null,3078,120.55,371052.89999999997]
[null,null,null,3079,120.55,371173.45]
[null,null,null,3080,120.55,371294]
[null,null,null,3081,120.55,371414.55]
[null,null,null,3082,120.55,371535.1]
[null,null,null,3083,120.55,371655.64999999997]
[null,null,null,3084,120.55,371776.2]
[null,null,null,3085,120.55,371896.75]
[null,null,null,3086,120.55,372017.3]
[null,null,null,3087,120.55,372137.85]
[null,null,null,3088,120.55,372258.39999999997]
[null,null,null,3089,{"$f":"$E$13","v":120.55},372378.95]
[null,null,null,3090,120.55,372499.5]
[null,null,null,3091,120.55,372620.05]
[null,null,null,3092,120.55,372740.6]
[null,null,null,3093,120.55,372861.14999999997]
[null,null,null,3094,120.55,372981.7]
[null,null,null,3095,120.55,373102.25]
[null,null,null,3096,120.55,373222.8]
[null,null,null,3097,120.55,373343.35]
[null,null,null,3098,120.55,373463.89999999997]
[null,null,null,3099,120.55,373584.45]
[null,null,null,3100,120.55,373705]
[null,null,null,3101,120.55,373825.55]
[null,null,null,3102,120.55,373946.1]
[null,null,null,3103,120.55,374066.64999999997]
[null,null,null,3104,120.55,374187.2]
[null,null,null,3105,120.55,374307.75]
[null,null,null,3106,120.55,374428.3]
[null,null,null,3107,120.55,374548.85]
[null,null,null,3108,120.55,{"$f":"E3125*D3125","v":374669.39999999997}]
[null,null,null,3109,120.55,374789.95]
[null,null,null,3110,120.55,374910.5]
[null,null,null,3111,120.55,375031.05]
[null,null,null,3112,120.55,375151.6]
[null,null,null,3113,120.55,375272.14999999997]
[null,null,null,3114,120.55,375392.7]
[null,null,null,3115,120.55,375513.25]
[null,null,null,3116,120.55,375633.8]
[null,null,null,3117,120.55,375754.35]
[null,null,null,3118,120.55,375874.89999999997]
[null,null,null,3119,120.55,375995.45]
[null,null,null,3120,120.55,376116]
[null,null,null,3121,120.55,376236.55]
[null,null,null,3122,120.55,376357.1]
[null,null,null,3123,120.55,376477.64999999997]
[null,null,null,3124,120.55,376598.2]
[null,null,null,3125,120.55,376718.75]
[null,null,null,3126,120.55,376839.3]
[null,null,null,3127,120.55,376959.85]
[null,null,null,3128,120.55,377080.39999999997]
[null,null,null,3129,120.55,377200.95]
[null,null,null,3130,120.55,377321.5]
[null,null,null,3131,120.55,377442.05]
[null,null,null,3132,120.55,377562.6]
[null,null,null,3133,120.55,377683.14999999997]
[null,null,null,3134,120.55,377803.7]
[null,null,null,3135,120.55,377924.25]
[null,null,null,3136,120.55,378044.8]
[null,null,null,3137,120.55,378165.35]
[null,null,null,3138,120.55,378285.89999999997]
[null,null,null,3139,120.55,378406.45]
[null,null,null,3140,120.55,378527]
[null,null,null,3141,120.55,378647.55]
[null,null,null,3142,120.55,378768.1]
[null,null,null,3143,120.55,378888.64999999997]
[null,null,null,3144,120.55,379009.2]
[null,null,null,3145,120.55,379129.75]
[null,null,null,3146,120.55,379250.3]
[null,null,null,3147,120.55,379370.85]
[null,null,null,3148,120.55,379491.39999999997]
[null,null,null,3149,120.55,379611.95]
[null,null,null,3150,120.55,379732.5]
[null,null,null,3151,120.55,379853.05]
[null,null,null,3152,120.55,379973.6]
[null,null,null,3153,{"$f":"$E$13","v":120.55},380094.14999999997]
[null,null,null,3154,120.55,380214.7]
[null,null,null,3155,120.55,380335.25]
[null,null,null,3156,120.55,380455.8]
[null,null,null,3157,120.55,380576.35]
[null,null,null,3158,120.55,380696.89999999997]
[null,null,null,3159,120.55,380817.45]
[null,null,null,3160,120.55,380938]
[null,null,null,3161,120.55,381058.55]
[null,null,null,3162,120.55,381179.1]
[null,null,null,3163,120.55,381299.64999999997]
[null,null,null,3164,120.55,381420.2]
[null,null,null,3165,120.55,381540.75]
[null,null,null,3166,120.55,381661.3]
[null,null,null,3167,120.55,381781.85]
[null,null,null,3168,120.55,381902.39999999997]
[null,null,null,3169,120.55,382022.95]
[null,null,null,3170,120.55,382143.5]
[null,null,null,3171,120.55,382264.05]
[null,null,null,3172,120.55,{"$f":"E3189*D3189","v":382384.6}]
[null,null,null,3173,120.55,382505.14999999997]
[null,null,null,3174,120.55,382625.7]
[null,null,null,3175,120.55,382746.25]
[null,null,null,3176,120.55,382866.8]
[null,null,null,3177,120.55,382987.35]
[null,null,null,3178,120.55,383107.89999999997]
[null,null,null,3179,120.55,383228.45]
[null,null,null,3180,120.55,383349]
[null,null,null,3181,120.55,383469.55]
[null,null,null,3182,120.55,383590.1]
[null,null,null,3183,120.55,383710.64999999997]
[null,null,null,3184,120.55,383831.2]
[null,null,null,3185,120.55,383951.75]
[null,null,null,3186,120.55,384072.3]
[null,null,null,3187,120.55,384192.85]
[null,null,null,3188,120.55,384313.39999999997]
[null,null,null,3189,120.55,384433.95]
[null,null,null,3190,120.55,384554.5]
[null,null,null,3191,120.55,384675.05]
[null,null,null,3192,120.55,384795.6]
[null,null,null,3193,120.55,384916.14999999997]
[null,null,null,3194,120.55,385036.7]
[null,null,null,3195,120.55,385157.25]
[null,null,null,3196,120.55,385277.8]
[null,null,null,3197,120.55,385398.35]
[null,null,null,3198,120.55,385518.89999999997]
[null,null,null,3199,120.55,385639.45]
[null,null,null,3200,120.55,385760]
[null,null,null,3201,120.55,385880.55]
[null,null,null,3202,120.55,386001.1]
[null,null,null,3203,120.55,386121.64999999997]
[null,null,null,3204,120.55,386242.2]
[null,null,null,3205,120.55,386362.75]
[null,null,null,3206,120.55,386483.3]
[null,null,null,3207,120.55,386603.85]
[null,null,null,3208,120.55,386724.39999999997]
[null,null,null,3209,120.55,386844.95]
[null,null,null,3210,120.55,386965.5]
[null,null,null,3211,120.55,387086.05]
[null,null,null,3212,120.55,387206.6]
[null,null,null,3213,120.55,387327.14999999997]
[null,null,null,3214,120.55,387447.7]
[null,null,null,3215,120.55,387568.25]
[null,null,null,3216,120.55,387688.8]
[null,null,null,3217,{"$f":"$E$13","v":120.55},387809.35]
[null,null,null,3218,120.55,387929.89999999997]
[null,null,null,3219,120.55,388050.45]
[null,null,null,3220,120.55,388171]
[null,null,null,3221,120.55,388291.55]
[null,null,null,3222,120.55,388412.1]
[null,null,null,3223,120.55,388532.64999999997]
[null,null,null,3224,120.55,388653.2]
[null,null,null,3225,120.55,388773.75]
[null,null,null,3226,120.55,388894.3]
[null,null,null,3227,120.55,389014.85]
[null,null,null,3228,120.55,389135.39999999997]
[null,null,null,3229,120.55,389255.95]
[null,null,null,3230,120.55,389376.5]
[null,null,null,3231,120.55,389497.05]
[null,null,null,3232,120.55,389617.6]
[null,null,null,3233,120.55,389738.14999999997]
[null,null,null,3234,120.55,389858.7]
[null,null,null,3235,120.55,389979.25]
[null,null,null,3236,120.55,{"$f":"E3253*D3253","v":390099.8}]
[null,null,null,3237,120.55,390220.35]
[null,null,null,3238,120.55,390340.89999999997]
[null,null,null,3239,120.55,390461.45]
[null,null,null,3240,120.55,390582]
[null,null,null,3241,120.55,390702.55]
[null,null,null,3242,120.55,390823.1]
[null,null,null,3243,120.55,390943.64999999997]
[null,null,null,3244,120.55,391064.2]
[null,null,null,3245,120.55,391184.75]
[null,null,null,3246,120.55,391305.3]
[null,null,null,3247,120.55,391425.85]
[null,null,null,3248,120.55,391546.39999999997]
[null,null,null,3249,120.55,391666.95]
[null,null,null,3250,120.55,391787.5]
[null,null,null,3251,120.55,391908.05]
[null,null,null,3252,120.55,392028.6]
[null,null,null,3253,120.55,392149.14999999997]
[null,null,null,3254,120.55,392269.7]
[null,null,null,3255,120.55,392390.25]
[null,null,null,3256,120.55,392510.8]
[null,null,null,3257,120.55,392631.35]
[null,null,null,3258,120.55,392751.89999999997]
[null,null,null,3259,120.55,392872.45]
[null,null,null,3260,120.55,392993]
[null,null,null,3261,120.55,393113.55]
[null,null,null,3262,120.55,393234.1]
[null,null,null,3263,120.55,393354.64999999997]
[null,null,null,3264,120.55,393475.2]
[null,null,null,3265,120.55,393595.75]
[null,null,null,3266,120.55,393716.3]
[null,null,null,3267,120.55,393836.85]
[null,null,null,3268,120.55,393957.39999999997]
[null,null,null,3269,120.55,394077.95]
[null,null,null,3270,120.55,394198.5]
[null,null,null,3271,120.55,394319.05]
[null,null,null,3272,120.55,394439.6]
[null,null,null,3273,120.55,394560.14999999997]
[null,null,null,3274,120.55,394680.7]
[null,null,null,3275,120.55,394801.25]
[null,null,null,3276,120.55,394921.8]
[null,null,null,3277,120.55,395042.35]
[null,null,null,3278,120.55,395162.89999999997]
[null,null,null,3279,120.55,395283.45]
[null,null,null,3280,120.55,395404]
[null,null,null,3281,{"$f":"$E$13","v":120.55},395524.55]
[null,null,null,3282,120.55,395645.1]
[null,null,null,3283,120.55,395765.64999999997]
[null,null,null,3284,120.55,395886.2]
[null,null,null,3285,120.55,396006.75]
[null,null,null,3286,120.55,396127.3]
[null,null,null,3287,120.55,396247.85]
[null,null,null,3288,120.55,396368.39999999997]
[null,null,null,3289,120.55,396488.95]
[null,null,null,3290,120.55,396609.5]
[null,null,null,3291,120.55,396730.05]
[null,null,null,3292,120.55,396850.6]
[null,null,null,3293,120.55,396971.14999999997]
[null,null,null,3294,120.55,397091.7]
[null,null,null,3295,120.55,397212.25]
[null,null,null,3296,120.55,397332.8]
[null,null,null,3297,120.55,397453.35]
[null,null,null,3298,120.55,397573.89999999997]
[null,null,null,3299,120.55,397694.45]
[null,null,null,3300,120.55,{"$f":"E3317*D3317","v":397815}]
[null,null,null,3301,120.55,397935.55]
[null,null,null,3302,120.55,398056.1]
[null,null,null,3303,120.55,398176.64999999997]
[null,null,null,3304,120.55,398297.2]
[null,null,null,3305,120.55,398417.75]
[null,null,null,3306,120.55,398538.3]
[null,null,null,3307,120.55,398658.85]
[null,null,null,3308,120.55,398779.39999999997]
[null,null,null,3309,120.55,398899.95]
[null,null,null,3310,120.55,399020.5]
[null,null,null,3311,120.55,399141.05]
[null,null,null,3312,120.55,399261.6]
[null,null,null,3313,120.55,399382.14999999997]
[null,null,null,3314,120.55,399502.7]
[null,null,null,3315,120.55,399623.25]
[null,null,null,3316,120.55,399743.8]
[null,null,null,3317,120.55,399864.35]
[null,null,null,3318,120.55,399984.89999999997]
[null,null,null,3319,120.55,400105.45]
[null,null,null,3320,120.55,400226]
[null,null,null,3321,120.55,400346.55]
[null,null,null,3322,120.55,400467.1]
[null,null,null,3323,120.55,400587.64999999997]
[null,null,null,3324,120.55,400708.2]
[null,null,null,3325,120.55,400828.75]
[null,null,null,3326,120.55,400949.3]
[null,null,null,3327,120.55,401069.85]
[null,null,null,3328,120.55,401190.39999999997]
[null,null,null,3329,120.55,401310.95]
[null,null,null,3330,120.55,401431.5]
[null,null,null,3331,120.55,401552.05]
[null,null,null,3332,120.55,401672.6]
[null,null,null,3333,120.55,401793.14999999997]
[null,null,null,3334,120.55,401913.7]
[null,null,null,3335,120.55,402034.25]
[null,null,null,3336,120.55,402154.8]
[null,null,null,3337,120.55,402275.35]
[null,null,null,3338,120.55,402395.89999999997]
[null,null,null,3339,120.55,402516.45]
[null,null,null,3340,120.55,402637]
[null,null,null,3341,120.55,402757.55]
[null,null,null,3342,120.55,402878.1]
[null,null,null,3343,120.55,402998.64999999997]
[null,null,null,3344,120.55,403119.2]
[null,null,null,3345,{"$f":"$E$13","v":120.55},403239.75]
[null,null,null,3346,120.55,403360.3]
[null,null,null,3347,120.55,403480.85]
[null,null,null,3348,120.55,403601.39999999997]
[null,null,null,3349,120.55,403721.95]
[null,null,null,3350,120.55,403842.5]
[null,null,null,3351,120.55,403963.05]
[null,null,null,3352,120.55,404083.6]
[null,null,null,3353,120.55,404204.14999999997]
[null,null,null,3354,120.55,404324.7]
[null,null,null,3355,120.55,404445.25]
[null,null,null,3356,120.55,404565.8]
[null,null,null,3357,120.55,404686.35]
[null,null,null,3358,120.55,404806.89999999997]
[null,null,null,3359,120.55,404927.45]
[null,null,null,3360,120.55,405048]
[null,null,null,3361,120.55,405168.55]
[null,null,null,3362,120.55,405289.1]
[null,null,null,3363,120.55,405409.64999999997]
[null,null,null,3364,120.55,{"$f":"E3381*D3381","v":405530.2}]
[null,null,null,3365,120.55,405650.75]
[null,null,null,3366,120.55,405771.3]
[null,null,null,3367,120.55,405891.85]
[null,null,null,3368,120.55,406012.39999999997]
[null,null,null,3369,120.55,406132.95]
[null,null,null,3370,120.55,406253.5]
[null,null,null,3371,120.55,406374.05]
[null,null,null,3372,120.55,406494.6]
[null,null,null,3373,120.55,406615.14999999997]
[null,null,null,3374,120.55,406735.7]
[null,null,null,3375,120.55,406856.25]
[null,null,null,3376,120.55,406976.8]
[null,null,null,3377,120.55,407097.35]
[null,null,null,3378,120.55,407217.89999999997]
[null,null,null,3379,120.55,407338.45]
[null,null,null,3380,120.55,407459]
[null,null,null,3381,120.55,407579.55]
[null,null,null,3382,120.55,407700.1]
[null,null,null,3383,120.55,407820.64999999997]
[null,null,null,3384,120.55,407941.2]
[null,null,null,3385,120.55,408061.75]
[null,null,null,3386,120.55,408182.3]
[null,null,null,3387,120.55,408302.85]
[null,null,null,3388,120.55,408423.39999999997]
[null,null,null,3389,120.55,408543.95]
[null,null,null,3390,120.55,408664.5]
[null,null,null,3391,120.55,408785.05]
[null,null,null,3392,120.55,408905.6]
[null,null,null,3393,120.55,409026.14999999997]
[null,null,null,3394,120.55,409146.7]
[null,null,null,3395,120.55,409267.25]
[null,null,null,3396,120.55,409387.8]
[null,null,null,3397,120.55,409508.35]
[null,null,null,3398,120.55,409628.89999999997]
[null,null,null,3399,120.55,409749.45]
[null,null,null,3400,120.55,409870]
[null,null,null,3401,120.55,409990.55]
[null,null,null,3402,120.55,410111.1]
[null,null,null,3403,120.55,410231.64999999997]
[null,null,null,3404,120.55,410352.2]
[null,null,null,3405,120.55,410472.75]
[null,null,null,3406,120.55,410593.3]
[null,null,null,3407,120.55,410713.85]
[null,null,null,3408,120.55,410834.39999999997]
[null,null,null,3409,{"$f":"$E$13","v":120.55},410954.95]
[null,null,null,3410,120.55,411075.5]
[null,null,null,3411,120.55,411196.05]
[null,null,null,3412,120.55,411316.6]
[null,null,null,3413,120.55,411437.14999999997]
[null,null,null,3414,120.55,411557.7]
[null,null,null,3415,120.55,411678.25]
[null,null,null,3416,120.55,411798.8]
[null,null,null,3417,120.55,411919.35]
[null,null,null,3418,120.55,412039.89999999997]
[null,null,null,3419,120.55,412160.45]
[null,null,null,3420,120.55,412281]
[null,null,null,3421,120.55,412401.55]
[null,null,null,3422,120.55,412522.1]
[null,null,null,3423,120.55,412642.64999999997]
[null,null,null,3424,120.55,412763.2]
[null,null,null,3425,120.55,412883.75]
[null,null,null,3426,120.55,413004.3]
[null,null,null,3427,120.55,413124.85]
[null,null,null,3428,120.55,{"$f":"E3445*D3445","v":413245.39999999997}]
[null,null,null,3429,120.55,413365.95]
[null,null,null,3430,120.55,413486.5]
[null,null,null,3431,120.55,413607.05]
[null,null,null,3432,120.55,413727.6]
[null,null,null,3433,120.55,413848.14999999997]
[null,null,null,3434,120.55,413968.7]
[null,null,null,3435,120.55,414089.25]
[null,null,null,3436,120.55,414209.8]
[null,null,null,3437,120.55,414330.35]
[null,null,null,3438,120.55,414450.89999999997]
[null,null,null,3439,120.55,414571.45]
[null,null,null,3440,120.55,414692]
[null,null,null,3441,120.55,414812.55]
[null,null,null,3442,120.55,414933.1]
[null,null,null,3443,120.55,415053.64999999997]
[null,null,null,3444,120.55,415174.2]
[null,null,null,3445,120.55,415294.75]
[null,null,null,3446,120.55,415415.3]
[null,null,null,3447,120.55,415535.85]
[null,null,null,3448,120.55,415656.39999999997]
[null,null,null,3449,120.55,415776.95]
[null,null,null,3450,120.55,415897.5]
[null,null,null,3451,120.55,416018.05]
[null,null,null,3452,120.55,416138.6]
[null,null,null,3453,120.55,416259.14999999997]
[null,null,null,3454,120.55,416379.7]
[null,null,null,3455,120.55,416500.25]
[null,null,null,3456,120.55,416620.79999999999]
[null,null,null,3457,120.55,416741.35]
[null,null,null,3458,120.55,416861.89999999997]
[null,null,null,3459,120.55,416982.45]
[null,null,null,3460,120.55,417103]
[null,null,null,3461,120.55,417223.55]
[null,null,null,3462,120.55,417344.1]
[null,null,null,3463,120.55,417464.64999999997]
[null,null,null,3464,120.55,417585.2]
[null,null,null,3465,120.55,417705.75]
[null,null,null,3466,120.55,417826.3]
[null,null,null,3467,120.55,417946.85]
[null,null,null,3468,120.55,418067.39999999997]
[null,null,null,3469,120.55,418187.95]
[null,null,null,3470,120.55,418308.5]
[null,null,null,3471,120.55,418429.05]
[null,null,null,3472,120.55,418549.6]
[null,null,null,3473,{"$f":"$E$13","v":120.55},418670.14999999997]
[null,null,null,3474,120.55,418790.7]
[null,null,null,3475,120.55,418911.25]
[null,null,null,3476,120.55,419031.8]
[null,null,null,3477,120.55,419152.35]
[null,null,null,3478,120.55,419272.89999999997]
[null,null,null,3479,120.55,419393.45]
[null,null,null,3480,120.55,419514]
[null,null,null,3481,120.55,419634.55]
[null,null,null,3482,120.55,419755.1]
[null,null,null,3483,120.55,419875.64999999997]
[null,null,null,3484,120.55,419996.2]
[null,null,null,3485,120.55,420116.75]
[null,null,null,3486,120.55,420237.3]
[null,null,null,3487,120.55,420357.85]
[null,null,null,3488,120.55,420478.39999999997]
[null,null,null,3489,120.55,420598.95]
[null,null,null,3490,120.55,420719.5]
[null,null,null,3491,120.55,420840.05]
[null,null,null,3492,120.55,{"$f":"E3509*D3509","v":420960.6}]
[null,null,null,3493,120.55,421081.14999999997]
[null,null,null,3494,120.55,421201.7]
[null,null,null,3495,120.55,421322.25]
[null,null,null,3496,120.55,421442.8]
[null,null,null,3497,120.55,421563.35]
[null,null,null,3498,120.55,421683.89999999997]
[null,null,null,3499,120.55,421804.45]
[null,null,null,3500,120.55,421925]
[null,null,null,3501,120.55,422045.55]
[null,null,null,3502,120.55,422166.1]
[null,null,null,3503,120.55,422286.64999999997]
[null,null,null,3504,120.55,422407.2]
[null,null,null,3505,120.55,422527.75]
[null,null,null,3506,120.55,422648.3]
[null,null,null,3507,120.55,422768.85]
[null,null,null,3508,120.55,422889.39999999997]
[null,null,null,3509,120.55,423009.95]
[null,null,null,3510,120.55,423130.5]
[null,null,null,3511,120.55,423251.05]
[null,null,null,3512,120.55,423371.6]
[null,null,null,3513,120.55,423492.14999999997]
[null,null,null,3514,120.55,423612.7]
[null,null,null,3515,120.55,423733.25]
[null,null,null,3516,120.55,423853.8]
[null,null,null,3517,120.55,423974.35]
[null,null,null,3518,120.55,424094.89999999997]
[null,null,null,3519,120.55,424215.45]
[null,null,null,3520,120.55,424336]
[null,null,null,3521,120.55,424456.55]
[null,null,null,3522,120.55,424577.1]
[null,null,null,3523,120.55,424697.64999999997]
[null,null,null,3524,120.55,424818.2]
[null,null,null,3525,120.55,424938.75]
[null,null,null,3526,120.55,425059.3]
[null,null,null,3527,120.55,425179.85]
[null,null,null,3528,120.55,425300.39999999997]
[null,null,null,3529,120.55,425420.95]
[null,null,null,3530,120.55,425541.5]
[null,null,null,3531,120.55,425662.05]
[null,null,null,3532,120.55,425782.6]
[null,null,null,3533,120.55,425903.14999999997]
[null,null,null,3534,120.55,426023.7]
[null,null,null,3535,120.55,426144.25]
[null,null,null,3536,120.55,426264.8]
[null,null,null,3537,{"$f":"$E$13","v":120.55},426385.35]
[null,null,null,3538,120.55,426505.89999999997]
[null,null,null,3539,120.55,426626.45]
[null,null,null,3540,120.55,426747]
[null,null,null,3541,120.55,426867.55]
[null,null,null,3542,120.55,426988.1]
[null,null,null,3543,120.55,427108.64999999997]
[null,null,null,3544,120.55,427229.2]
[null,null,null,3545,120.55,427349.75]
[null,null,null,3546,120.55,427470.3]
[null,null,null,3547,120.55,427590.85]
[null,null,null,3548,120.55,427711.39999999997]
[null,null,null,3549,120.55,427831.95]
[null,null,null,3550,120.55,427952.5]
[null,null,null,3551,120.55,428073.05]
[null,null,null,3552,120.55,428193.6]
[null,null,null,3553,120.55,428314.14999999997]
[null,null,null,3554,120.55,428434.7]
[null,null,null,3555,120.55,428555.25]
[null,null,null,3556,120.55,{"$f":"E3573*D3573","v":428675.8}]
[null,null,null,3557,120.55,428796.35]
[null,null,null,3558,120.55,428916.89999999997]
[null,null,null,3559,120.55,429037.45]
[null,null,null,3560,120.55,429158]
[null,null,null,3561,120.55,429278.55]
[null,null,null,3562,120.55,429399.1]
[null,null,null,3563,120.55,429519.64999999997]
[null,null,null,3564,120.55,429640.2]
[null,null,null,3565,120.55,429760.75]
[null,null,null,3566,120.55,429881.3]
[null,null,null,3567,120.55,430001.85]
[null,null,null,3568,120.55,430122.39999999997]
[null,null,null,3569,120.55,430242.95]
[null,null,null,3570,120.55,430363.5]
[null,null,null,3571,120.55,430484.05]
[null,null,null,3572,120.55,430604.6]
[null,null,null,3573,120.55,430725.14999999997]
[null,null,null,3574,120.55,430845.7]
[null,null,null,3575,120.55,430966.25]
[null,null,null,3576,120.55,431086.8]
[null,null,null,3577,120.55,431207.35]
[null,null,null,3578,120.55,431327.89999999997]
[null,null,null,3579,120.55,431448.45]
[null,null,null,3580,120.55,431569]
[null,null,null,3581,120.55,431689.55]
[null,null,null,3582,120.55,431810.1]
[null,null,null,3583,120.55,431930.64999999997]
[null,null,null,3584,120.55,432051.20000000001]
[null,null,null,3585,120.55,432171.75]
[null,null,null,3586,120.55,432292.3]
[null,null,null,3587,120.55,432412.85]
[null,null,null,3588,120.55,432533.39999999997]
[null,null,null,3589,120.55,432653.95]
[null,null,null,3590,120.55,432774.5]
[null,null,null,3591,120.55,432895.05]
[null,null,null,3592,120.55,433015.6]
[null,null,null,3593,120.55,433136.14999999997]
[null,null,null,3594,120.55,433256.7]
[null,null,null,3595,120.55,433377.25]
[null,null,null,3596,120.55,433497.8]
[null,null,null,3597,120.55,433618.35]
[null,null,null,3598,120.55,433738.89999999997]
[null,null,null,3599,120.55,433859.45]
[null,null,null,3600,120.55,433980]
[null,null,null,3601,{"$f":"$E$13","v":120.55},434100.55]
[null,null,null,3602,120.55,434221.1]
[null,null,null,3603,120.55,434341.64999999997]
[null,null,null,3604,120.55,434462.2]
[null,null,null,3605,120.55,434582.75]
[null,null,null,3606,120.55,434703.3]
[null,null,null,3607,120.55,434823.85]
[null,null,null,3608,120.55,434944.39999999997]
[null,null,null,3609,120.55,435064.95]
[null,null,null,3610,120.55,435185.5]
[null,null,null,3611,120.55,435306.05]
[null,null,null,3612,120.55,435426.6]
[null,null,null,3613,120.55,435547.14999999997]
[null,null,null,3614,120.55,435667.7]
[null,null,null,3615,120.55,435788.25]
[null,null,null,3616,120.55,435908.8]
[null,null,null,3617,120.55,436029.35]
[null,null,null,3618,120.55,436149.89999999997]
[null,null,null,3619,120.55,436270.45]
[null,null,null,3620,120.55,{"$f":"E3637*D3637","v":436391}]
[null,null,null,3621,120.55,436511.55]
[null,null,null,3622,120.55,436632.1]
[null,null,null,3623,120.55,436752.64999999997]
[null,null,null,3624,120.55,436873.2]
[null,null,null,3625,120.55,436993.75]
[null,null,null,3626,120.55,437114.3]
[null,null,null,3627,120.55,437234.85]
[null,null,null,3628,120.55,437355.39999999997]
[null,null,null,3629,120.55,437475.95]
[null,null,null,3630,120.55,437596.5]
[null,null,null,3631,120.55,437717.05]
[null,null,null,3632,120.55,437837.6]
[null,null,null,3633,120.55,437958.14999999997]
[null,null,null,3634,120.55,438078.7]
[null,null,null,3635,120.55,438199.25]
[null,null,null,3636,120.55,438319.8]
[null,null,null,3637,120.55,438440.35]
[null,null,null,3638,120.55,438560.89999999997]
[null,null,null,3639,120.55,438681.45]
[null,null,null,3640,120.55,438802]
[null,null,null,3641,120.55,438922.55]
[null,null,null,3642,120.55,439043.1]
[null,null,null,3643,120.55,439163.64999999997]
[null,null,null,3644,120.55,439284.2]
[null,null,null,3645,120.55,439404.75]
[null,null,null,3646,120.55,439525.3]
[null,null,null,3647,120.55,439645.85]
[null,null,null,3648,120.55,439766.39999999997]
[null,null,null,3649,120.55,439886.95]
[null,null,null,3650,120.55,440007.5]
[null,null,null,3651,120.55,440128.05]
[null,null,null,3652,120.55,440248.6]
[null,null,null,3653,120.55,440369.14999999997]
[null,null,null,3654,120.55,440489.7]
[null,null,null,3655,120.55,440610.25]
[null,null,null,3656,120.55,440730.8]
[null,null,null,3657,120.55,440851.35]
[null,null,null,3658,120.55,440971.89999999997]
[null,null,null,3659,120.55,441092.45]
[null,null,null,3660,120.55,441213]
[null,null,null,3661,120.55,441333.55]
[null,null,null,3662,120.55,441454.1]
[null,null,null,3663,120.55,441574.64999999997]
[null,null,null,3664,120.55,441695.2]
[null,null,null,3665,{"$f":"$E$13","v":120.55},441815.75]
[null,null,null,3666,120.55,441936.3]
[null,null,null,3667,120.55,442056.85]
[null,null,null,3668,120.55,442177.39999999997]
[null,null,null,3669,120.55,442297.95]
[null,null,null,3670,120.55,442418.5]
[null,null,null,3671,120.55,442539.05]
[null,null,null,3672,120.55,442659.6]
[null,null,null,3673,120.55,442780.14999999997]
[null,null,null,3674,120.55,442900.7]
[null,null,null,3675,120.55,443021.25]
[null,null,null,3676,120.55,443141.8]
[null,null,null,3677,120.55,443262.35]
[null,null,null,3678,120.55,443382.89999999997]
[null,null,null,3679,120.55,443503.45]
[null,null,null,3680,120.55,443624]
[null,null,null,3681,120.55,443744.55]
[null,null,null,3682,120.55,443865.1]
[null,null,null,3683,120.55,443985.64999999997]
[null,null,null,3684,120.55,{"$f":"E3701*D3701","v":444106.2}]
[null,null,null,3685,120.55,444226.75]
[null,null,null,3686,120.55,444347.3]
[null,null,null,3687,120.55,444467.85]
[null,null,null,3688,120.55,444588.39999999997]
[null,null,null,3689,120.55,444708.95]
[null,null,null,3690,120.55,444829.5]
[null,null,null,3691,120.55,444950.05]
[null,null,null,3692,120.55,445070.6]
[null,null,null,3693,120.55,445191.14999999997]
[null,null,null,3694,120.55,445311.7]
[null,null,null,3695,120.55,445432.25]
[null,null,null,3696,120.55,445552.8]
[null,null,null,3697,120.55,445673.35]
[null,null,null,3698,120.55,445793.89999999997]
[null,null,null,3699,120.55,445914.45]
[null,null,null,3700,120.55,446035]
[null,null,null,3701,120.55,446155.55]
[null,null,null,3702,120.55,446276.1]
[null,null,null,3703,120.55,446396.64999999997]
[null,null,null,3704,120.55,446517.2]
[null,null,null,3705,120.55,446637.75]
[null,null,null,3706,120.55,446758.3]
[null,null,null,3707,120.55,446878.85]
[null,null,null,3708,120.55,446999.39999999997]
[null,null,null,3709,120.55,447119.95]
[null,null,null,3710,120.55,447240.5]
[null,null,null,3711,120.55,447361.05]
[null,null,null,3712,120.55,447481.59999999998]
[null,null,null,3713,120.55,447602.14999999997]
[null,null,null,3714,120.55,447722.7]
[null,null,null,3715,120.55,447843.25]
[null,null,null,3716,120.55,447963.8]
[null,null,null,3717,120.55,448084.35]
[null,null,null,3718,120.55,448204.89999999997]
[null,null,null,3719,120.55,448325.45]
[null,null,null,3720,120.55,448446]
[null,null,null,3721,120.55,448566.55]
[null,null,null,3722,120.55,448687.1]
[null,null,null,3723,120.55,448807.64999999997]
[null,null,null,3724,120.55,448928.2]
[null,null,null,3725,120.55,449048.75]
[null,null,null,3726,120.55,449169.3]
[null,null,null,3727,120.55,449289.85]
[null,null,null,3728,120.55,449410.39999999997]
[null,null,null,3729,{"$f":"$E$13","v":120.55},449530.95]
[null,null,null,3730,120.55,449651.5]
[null,null,null,3731,120.55,449772.05]
[null,null,null,3732,120.55,449892.6]
[null,null,null,3733,120.55,450013.14999999997]
[null,null,null,3734,120.55,450133.7]
[null,null,null,3735,120.55,450254.25]
[null,null,null,3736,120.55,450374.8]
[null,null,null,3737,120.55,450495.35]
[null,null,null,3738,120.55,450615.89999999997]
[null,null,null,3739,120.55,450736.45]
[null,null,null,3740,120.55,450857]
[null,null,null,3741,120.55,450977.55]
[null,null,null,3742,120.55,451098.1]
[null,null,null,3743,120.55,451218.64999999997]
[null,null,null,3744,120.55,451339.2]
[null,null,null,3745,120.55,451459.75]
[null,null,null,3746,120.55,451580.3]
[null,null,null,3747,120.55,451700.85]
[null,null,null,3748,120.55,{"$f":"E3765*D3765","v":451821.39999999997}]
[null,null,null,3749,120.55,451941.95]
[null,null,null,3750,120.55,452062.5]
[null,null,null,3751,120.55,452183.05]
[null,null,null,3752,120.55,452303.6]
[null,null,null,3753,120.55,452424.14999999997]
[null,null,null,3754,120.55,452544.7]
[null,null,null,3755,120.55,452665.25]
[null,null,null,3756,120.55,452785.8]
[null,null,null,3757,120.55,452906.35]
[null,null,null,3758,120.55,453026.89999999997]
[null,null,null,3759,120.55,453147.45]
[null,null,null,3760,120.55,453268]
[null,null,null,3761,120.55,453388.55]
[null,null,null,3762,120.55,453509.1]
[null,null,null,3763,120.55,453629.64999999997]
[null,null,null,3764,120.55,453750.2]
[null,null,null,3765,120.55,453870.75]
[null,null,null,3766,120.55,453991.3]
[null,null,null,3767,120.55,454111.85]
[null,null,null,3768,120.55,454232.39999999997]
[null,null,null,3769,120.55,454352.95]
[null,null,null,3770,120.55,454473.5]
[null,null,null,3771,120.55,454594.05]
[null,null,null,3772,120.55,454714.6]
[null,null,null,3773,120.55,454835.14999999997]
[null,null,null,3774,120.55,454955.7]
[null,null,null,3775,120.55,455076.25]
[null,null,null,3776,120.55,455196.8]
[null,null,null,3777,120.55,455317.35]
[null,null,null,3778,120.55,455437.89999999997]
[null,null,null,3779,120.55,455558.45]
[null,null,null,3780,120.55,455679]
[null,null,null,3781,120.55,455799.55]
[null,null,null,3782,120.55,455920.1]
[null,null,null,3783,120.55,456040.64999999997]
[null,null,null,3784,120.55,456161.2]
[null,null,null,3785,120.55,456281.75]
[null,null,null,3786,120.55,456402.3]
[null,null,null,3787,120.55,456522.85]
[null,null,null,3788,120.55,456643.39999999997]
[null,null,null,3789,120.55,456763.95]
[null,null,null,3790,120.55,456884.5]
[null,null,null,3791,120.55,457005.05]
[null,null,null,3792,120.55,457125.6]
[null,null,null,3793,{"$f":"$E$13","v":120.55},457246.14999999997]
[null,null,null,3794,120.55,457366.7]
[null,null,null,3795,120.55,457487.25]
[null,null,null,3796,120.55,457607.8]
[null,null,null,3797,120.55,457728.35]
[null,null,null,3798,120.55,457848.89999999997]
[null,null,null,3799,120.55,457969.45]
[null,null,null,3800,120.55,458090]
[null,null,null,3801,120.55,458210.55]
[null,null,null,3802,120.55,458331.1]
[null,null,null,3803,120.55,458451.64999999997]
[null,null,null,3804,120.55,458572.2]
[null,null,null,3805,120.55,458692.75]
[null,null,null,3806,120.55,458813.3]
[null,null,null,3807,120.55,458933.85]
[null,null,null,3808,120.55,459054.39999999997]
[null,null,null,3809,120.55,459174.95]
[null,null,null,3810,120.55,459295.5]
[null,null,null,3811,120.55,459416.05]
[null,null,null,3812,120.55,{"$f":"E3829*D3829","v":459536.6}]
[null,null,null,3813,120.55,459657.14999999997]
[null,null,null,3814,120.55,459777.7]
[null,null,null,3815,120.55,459898.25]
[null,null,null,3816,120.55,460018.8]
[null,null,null,3817,120.55,460139.35]
[null,null,null,3818,120.55,460259.89999999997]
[null,null,null,3819,120.55,460380.45]
[null,null,null,3820,120.55,460501]
[null,null,null,3821,120.55,460621.55]
[null,null,null,3822,120.55,460742.1]
[null,null,null,3823,120.55,460862.64999999997]
[null,null,null,3824,120.55,460983.2]
[null,null,null,3825,120.55,461103.75]
[null,null,null,3826,120.55,461224.3]
[null,null,null,3827,120.55,461344.85]
[null,null,null,3828,120.55,461465.39999999997]
[null,null,null,3829,120.55,461585.95]
[null,null,null,3830,120.55,461706.5]
[null,null,null,3831,120.55,461827.05]
[null,null,null,3832,120.55,461947.6]
[null,null,null,3833,120.55,462068.14999999997]
[null,null,null,3834,120.55,462188.7]
[null,null,null,3835,120.55,462309.25]
[null,null,null,3836,120.55,462429.8]
[null,null,null,3837,120.55,462550.35]
[null,null,null,3838,120.55,462670.89999999997]
[null,null,null,3839,120.55,462791.45]
[null,null,null,3840,120.55,462912]
[null,null,null,3841,120.55,463032.55]
[null,null,null,3842,120.55,463153.1]
[null,null,null,3843,120.55,463273.64999999997]
[null,null,null,3844,120.55,463394.2]
[null,null,null,3845,120.55,463514.75]
[null,null,null,3846,120.55,463635.3]
[null,null,null,3847,120.55,463755.85]
[null,null,null,3848,120.55,463876.39999999997]
[null,null,null,3849,120.55,463996.95]
[null,null,null,3850,120.55,464117.5]
[null,null,null,3851,120.55,464238.05]
[null,null,null,3852,120.55,464358.6]
[null,null,null,3853,120.55,464479.14999999997]
[null,null,null,3854,120.55,464599.7]
[null,null,null,3855,120.55,464720.25]
[null,null,null,3856,120.55,464840.8]
[null,null,null,3857,{"$f":"$E$13","v":120.55},464961.35]
[null,null,null,3858,120.55,465081.89999999997]
[null,null,null,3859,120.55,465202.45]
[null,null,null,3860,120.55,465323]
[null,null,null,3861,120.55,465443.55]
[null,null,null,3862,120.55,465564.1]
[null,null,null,3863,120.55,465684.64999999997]
[null,null,null,3864,120.55,465805.2]
[null,null,null,3865,120.55,465925.75]
[null,null,null,3866,120.55,466046.3]
[null,null,null,3867,120.55,466166.85]
[null,null,null,3868,120.55,466287.39999999997]
[null,null,null,3869,120.55,466407.95]
[null,null,null,3870,120.55,466528.5]
[null,null,null,3871,120.55,466649.05]
[null,null,null,3872,120.55,466769.6]
[null,null,null,3873,120.55,466890.14999999997]
[null,null,null,3874,120.55,467010.7]
[null,null,null,3875,120.55,467131.25]
[null,null,null,3876,120.55,{"$f":"E3893*D3893","v":467251.8}]
[null,null,null,3877,120.55,467372.35]
[null,null,null,3878,120.55,467492.89999999997]
[null,null,null,3879,120.55,467613.45]
[null,null,null,3880,120.55,467734]
[null,null,null,3881,120.55,467854.55]
[null,null,null,3882,120.55,467975.1]
[null,null,null,3883,120.55,468095.64999999997]
[null,null,null,3884,120.55,468216.2]
[null,null,null,3885,120.55,468336.75]
[null,null,null,3886,120.55,468457.3]
[null,null,null,3887,120.55,468577.85]
[null,null,null,3888,120.55,468698.39999999997]
[null,null,null,3889,120.55,468818.95]
[null,null,null,3890,120.55,468939.5]
[null,null,null,3891,120.55,469060.05]
[null,null,null,3892,120.55,469180.6]
[null,null,null,3893,120.55,469301.14999999997]
[null,null,null,3894,120.55,469421.7]
[null,null,null,3895,120.55,469542.25]
[null,null,null,3896,120.55,469662.8]
[null,null,null,3897,120.55,469783.35]
[null,null,null,3898,120.55,469903.89999999997]
[null,null,null,3899,120.55,470024.45]
[null,null,null,3900,120.55,470145]
[null,null,null,3901,120.55,470265.55]
[null,null,null,3902,120.55,470386.1]
[null,null,null,3903,120.55,470506.64999999997]
[null,null,null,3904,120.55,470627.2]
[null,null,null,3905,120.55,470747.75]
[null,null,null,3906,120.55,470868.3]
[null,null,null,3907,120.55,470988.85]
[null,null,null,3908,120.55,471109.39999999997]
[null,null,null,3909,120.55,471229.95]
[null,null,null,3910,120.55,471350.5]
[null,null,null,3911,120.55,471471.05]
[null,null,null,3912,120.55,471591.6]
[null,null,null,3913,120.55,471712.14999999997]
[null,null,null,3914,120.55,471832.7]
[null,null,null,3915,120.55,471953.25]
[null,null,null,3916,120.55,472073.8]
[null,null,null,3917,120.55,472194.35]
[null,null,null,3918,120.55,472314.89999999997]
[null,null,null,3919,120.55,472435.45]
[null,null,null,3920,120.55,472556]
[null,null,null,3921,{"$f":"$E$13","v":120.55},472676.55]
[null,null,null,3922,120.55,472797.1]
[null,null,null,3923,120.55,472917.64999999997]
[null,null,null,3924,120.55,473038.2]
[null,null,null,3925,120.55,473158.75]
[null,null,null,3926,120.55,473279.3]
[null,null,null,3927,120.55,473399.85]
[null,null,null,3928,120.55,473520.39999999997]
[null,null,null,3929,120.55,473640.95]
[null,null,null,3930,120.55,473761.5]
[null,null,null,3931,120.55,473882.05]
[null,null,null,3932,120.55,474002.6]
[null,null,null,3933,120.55,474123.14999999997]
[null,null,null,3934,120.55,474243.7]
[null,null,null,3935,120.55,474364.25]
[null,null,null,3936,120.55,474484.8]
[null,null,null,3937,120.55,474605.35]
[null,null,null,3938,120.55,474725.89999999997]
[null,null,null,3939,120.55,474846.45]
[null,null,null,3940,120.55,{"$f":"E3957*D3957","v":474967}]
[null,null,null,3941,120.55,475087.55]
[null,null,null,3942,120.55,475208.1]
[null,null,null,3943,120.55,475328.64999999997]
[null,null,null,3944,120.55,475449.2]
[null,null,null,3945,120.55,475569.75]
[null,null,null,3946,120.55,475690.3]
[null,null,null,3947,120.55,475810.85]
[null,null,null,3948,120.55,475931.39999999997]
[null,null,null,3949,120.55,476051.95]
[null,null,null,3950,120.55,476172.5]
[null,null,null,3951,120.55,476293.05]
[null,null,null,3952,120.55,476413.6]
[null,null,null,3953,120.55,476534.14999999997]
[null,null,null,3954,120.55,476654.7]
[null,null,null,3955,120.55,476775.25]
[null,null,null,3956,120.55,476895.8]
[null,null,null,3957,120.55,477016.35]
[null,null,null,3958,120.55,477136.89999999997]
[null,null,null,3959,120.55,477257.45]
[null,null,null,3960,120.55,477378]
[null,null,null,3961,120.55,477498.55]
[null,null,null,3962,120.55,477619.1]
[null,null,null,3963,120.55,477739.64999999997]
[null,null,null,3964,120.55,477860.2]
[null,null,null,3965,120.55,477980.75]
[null,null,null,3966,120.55,478101.3]
[null,null,null,3967,120.55,478221.85]
[null,null,null,3968,120.55,478342.39999999997]
[null,null,null,3969,120.55,478462.95]
[null,null,null,3970,120.55,478583.5]
[null,null,null,3971,120.55,478704.05]
[null,null,null,3972,120.55,478824.6]
[null,null,null,3973,120.55,478945.14999999997]
[null,null,null,3974,120.55,479065.7]
[null,null,null,3975,120.55,479186.25]
[null,null,null,3976,120.55,479306.8]
[null,null,null,3977,120.55,479427.35]
[null,null,null,3978,120.55,479547.89999999997]
[null,null,null,3979,120.55,479668.45]
[null,null,null,3980,120.55,479789]
[null,null,null,3981,120.55,479909.55]
[null,null,null,3982,120.55,480030.1]
[null,null,null,3983,120.55,480150.64999999997]
[null,null,null,3984,120.55,480271.2]
[null,null,null,3985,{"$f":"$E$13","v":120.55},480391.75]
[null,null,null,3986,120.55,480512.3]
[null,null,null,3987,120.55,480632.85]
[null,null,null,3988,120.55,480753.39999999997]
[null,null,null,3989,120.55,480873.95]
[null,null,null,3990,120.55,480994.5]
[null,null,null,3991,120.55,481115.05]
[null,null,null,3992,120.55,481235.6]
[null,null,null,3993,120.55,481356.14999999997]
[null,null,null,3994,120.55,481476.7]
[null,null,null,3995,120.55,481597.25]
[null,null,null,3996,120.55,481717.8]
[null,null,null,3997,120.55,481838.35]
[null,null,null,3998,120.55,481958.89999999997]
[null,null,null,3999,120.55,482079.45]
[null,null,null,4000,120.55,482200]
[null,null,null,4001,120.55,482320.55]
[null,null,null,4002,120.55,482441.1]
[null,null,null,4003,120.55,482561.64999999997]
[null,null,null,4004,120.55,{"$f":"E4021*D4021","v":482682.2}]
[null,null,null,4005,120.55,482802.75]
[null,null,null,4006,120.55,482923.3]
[null,null,null,4007,120.55,483043.85]
[null,null,null,4008,120.55,483164.39999999997]
[null,null,null,4009,120.55,483284.95]
[null,null,null,4010,120.55,483405.5]
[null,null,null,4011,120.55,483526.05]
[null,null,null,4012,120.55,483646.6]
[null,null,null,4013,120.55,483767.14999999997]
[null,null,null,4014,120.55,483887.7]
[null,null,null,4015,120.55,484008.25]
[null,null,null,4016,120.55,484128.8]
[null,null,null,4017,120.55,484249.35]
[null,null,null,4018,120.55,484369.89999999997]
[null,null,null,4019,120.55,484490.45]
[null,null,null,4020,120.55,484611]
[null,null,null,4021,120.55,484731.55]
[null,null,null,4022,120.55,484852.1]
[null,null,null,4023,120.55,484972.64999999997]
[null,null,null,4024,120.55,485093.2]
[null,null,null,4025,120.55,485213.75]
[null,null,null,4026,120.55,485334.3]
[null,null,null,4027,120.55,485454.85]
[null,null,null,4028,120.55,485575.39999999997]
[null,null,null,4029,120.55,485695.95]
[null,null,null,4030,120.55,485816.5]
[null,null,null,4031,120.55,485937.05]
[null,null,null,4032,120.55,486057.6]
[null,null,null,4033,120.55,486178.14999999997]
[null,null,null,4034,120.55,486298.7]
[null,null,null,4035,120.55,486419.25]
[null,null,null,4036,120.55,486539.8]
[null,null,null,4037,120.55,486660.35]
[null,null,null,4038,120.55,486780.89999999997]
[null,null,null,4039,120.55,486901.45]
[null,null,null,4040,120.55,487022]
[null,null,null,4041,120.55,487142.55]
[null,null,null,4042,120.55,487263.1]
[null,null,null,4043,120.55,487383.64999999997]
[null,null,null,4044,120.55,487504.2]
[null,null,null,4045,120.55,487624.75]
[null,null,null,4046,120.55,487745.3]
[null,null,null,4047,120.55,487865.85]
[null,null,null,4048,120.55,487986.39999999997]
[null,null,null,4049,{"$f":"$E$13","v":120.55},488106.95]
[null,null,null,4050,120.55,488227.5]
[null,null,null,4051,120.55,488348.05]
[null,null,null,4052,120.55,488468.6]
[null,null,null,4053,120.55,488589.14999999997]
[null,null,null,4054,120.55,488709.7]
[null,null,null,4055,120.55,488830.25]
[null,null,null,4056,120.55,488950.8]
[null,null,null,4057,120.55,489071.35]
[null,null,null,4058,120.55,489191.89999999997]
[null,null,null,4059,120.55,489312.45]
[null,null,null,4060,120.55,489433]
[null,null,null,4061,120.55,489553.55]
[null,null,null,4062,120.55,489674.1]
[null,null,null,4063,120.55,489794.64999999997]
[null,null,null,4064,120.55,489915.2]
[null,null,null,4065,120.55,490035.75]
[null,null,null,4066,120.55,490156.3]
[null,null,null,4067,120.55,490276.85]
[null,null,null,4068,120.55,{"$f":"E4085*D4085","v":490397.39999999997}]
[null,null,null,4069,120.55,490517.95]
[null,null,null,4070,120.55,490638.5]
[null,null,null,4071,120.55,490759.05]
[null,null,null,4072,120.55,490879.6]
[null,null,null,4073,120.55,491000.14999999997]
[null,null,null,4074,120.55,491120.7]
[null,null,null,4075,120.55,491241.25]
[null,null,null,4076,120.55,491361.8]
[null,null,null,4077,120.55,491482.35]
[null,null,null,4078,120.55,491602.89999999997]
[null,null,null,4079,120.55,491723.45]
[null,null,null,4080,120.55,491844]
[null,null,null,4081,120.55,491964.55]
[null,null,null,4082,120.55,492085.1]
[null,null,null,4083,120.55,492205.64999999997]
[null,null,null,4084,120.55,492326.2]
[null,null,null,4085,120.55,492446.75]
[null,null,null,4086,120.55,492567.3]
[null,null,null,4087,120.55,492687.85]
[null,null,null,4088,120.55,492808.39999999997]
[null,null,null,4089,120.55,492928.95]
[null,null,null,4090,120.55,493049.5]
[null,null,null,4091,120.55,493170.05]
[null,null,null,4092,120.55,493290.6]
[null,null,null,4093,120.55,493411.14999999997]
[null,null,null,4094,120.55,493531.7]
[null,null,null,4095,120.55,493652.25]
[null,null,null,4096,120.55,493772.79999999999]
[null,null,null,4097,120.55,493893.35]
[null,null,null,4098,120.55,494013.89999999997]
[null,null,null,4099,120.55,494134.45]
[null,null,null,4100,120.55,494255]
[null,null,null,4101,120.55,494375.55]
[null,null,null,4102,120.55,494496.1]
[null,null,null,4103,120.55,494616.64999999997]
[null,null,null,4104,120.55,494737.2]
[null,null,null,4105,120.55,494857.75]
[null,null,null,4106,120.55,494978.3]
[null,null,null,4107,120.55,495098.85]
[null,null,null,4108,120.55,495219.39999999997]
[null,null,null,4109,120.55,495339.95]
[null,null,null,4110,120.55,495460.5]
[null,null,null,4111,120.55,495581.05]
[null,null,null,4112,120.55,495701.6]
[null,null,null,4113,{"$f":"$E$13","v":120.55},495822.14999999997]
[null,null,null,4114,120.55,495942.7]
[null,null,null,4115,120.55,496063.25]
[null,null,null,4116,120.55,496183.8]
[null,null,null,4117,120.55,496304.35]
[null,null,null,4118,120.55,496424.89999999997]
[null,null,null,4119,120.55,496545.45]
[null,null,null,4120,120.55,496666]
[null,null,null,4121,120.55,496786.55]
[null,null,null,4122,120.55,496907.1]
[null,null,null,4123,120.55,497027.64999999997]
[null,null,null,4124,120.55,497148.2]
[null,null,null,4125,120.55,497268.75]
[null,null,null,4126,120.55,497389.3]
[null,null,null,4127,120.55,497509.85]
[null,null,null,4128,120.55,497630.39999999997]
[null,null,null,4129,120.55,497750.95]
[null,null,null,4130,120.55,497871.5]
[null,null,null,4131,120.55,497992.05]
[null,null,null,4132,120.55,{"$f":"E4149*D4149","v":498112.6}]
[null,null,null,4133,120.55,498233.14999999997]
[null,null,null,4134,120.55,498353.7]
[null,null,null,4135,120.55,498474.25]
[null,null,null,4136,120.55,498594.8]
[null,null,null,4137,120.55,498715.35]
[null,null,null,4138,120.55,498835.89999999997]
[null,null,null,4139,120.55,498956.45]
[null,null,null,4140,120.55,499077]
[null,null,null,4141,120.55,499197.55]
[null,null,null,4142,120.55,499318.1]
[null,null,null,4143,120.55,499438.64999999997]
[null,null,null,4144,120.55,499559.2]
[null,null,null,4145,120.55,499679.75]
[null,null,null,4146,120.55,499800.3]
[null,null,null,4147,120.55,499920.85]
[null,null,null,4148,120.55,500041.39999999997]
[null,null,null,4149,120.55,500161.95]
[null,null,null,4150,120.55,500282.5]
[null,null,null,4151,120.55,500403.05]
[null,null,null,4152,120.55,500523.6]
[null,null,null,4153,120.55,500644.14999999997]
[null,null,null,4154,120.55,500764.7]
[null,null,null,4155,120.55,500885.25]
[null,null,null,4156,120.55,501005.8]
[null,null,null,4157,120.55,501126.35]
[null,null,null,4158,120.55,501246.89999999997]
[null,null,null,4159,120.55,501367.45]
[null,null,null,4160,120.55,501488]
[null,null,null,4161,120.55,501608.55]
[null,null,null,4162,120.55,501729.1]
[null,null,null,4163,120.55,501849.64999999997]
[null,null,null,4164,120.55,501970.2]
[null,null,null,4165,120.55,502090.75]
[null,null,null,4166,120.55,502211.3]
[null,null,null,4167,120.55,502331.85]
[null,null,null,4168,120.55,502452.39999999997]
[null,null,null,4169,120.55,502572.95]
[null,null,null,4170,120.55,502693.5]
[null,null,null,4171,120.55,502814.05]
[null,null,null,4172,120.55,502934.6]
[null,null,null,4173,120.55,503055.14999999997]
[null,null,null,4174,120.55,503175.7]
[null,null,null,4175,120.55,503296.25]
[null,null,null,4176,120.55,503416.8]
[null,null,null,4177,{"$f":"$E$13","v":120.55},503537.35]
[null,null,null,4178,120.55,503657.89999999997]
[null,null,null,4179,120.55,503778.45]
[null,null,null,4180,120.55,503899]
[null,null,null,4181,120.55,504019.55]
[null,null,null,4182,120.55,504140.1]
[null,null,null,4183,120.55,504260.64999999997]
[null,null,null,4184,120.55,504381.2]
[null,null,null,4185,120.55,504501.75]
[null,null,null,4186,120.55,504622.3]
[null,null,null,4187,120.55,504742.85]
[null,null,null,4188,120.55,504863.39999999997]
[null,null,null,4189,120.55,504983.95]
[null,null,null,4190,120.55,505104.5]
[null,null,null,4191,120.55,505225.05]
[null,null,null,4192,120.55,505345.6]
[null,null,null,4193,120.55,505466.14999999997]
[null,null,null,4194,120.55,505586.7]
[null,null,null,4195,120.55,505707.25]
[null,null,null,4196,120.55,{"$f":"E4213*D4213","v":505827.8}]
[null,null,null,4197,120.55,505948.35]
[null,null,null,4198,120.55,506068.89999999997]
[null,null,null,4199,120.55,506189.45]
[null,null,null,4200,120.55,506310]
[null,null,null,4201,120.55,506430.55]
[null,null,null,4202,120.55,506551.1]
[null,null,null,4203,120.55,506671.64999999997]
[null,null,null,4204,120.55,506792.2]
[null,null,null,4205,120.55,506912.75]
[null,null,null,4206,120.55,507033.3]
[null,null,null,4207,120.55,507153.85]
[null,null,null,4208,120.55,507274.39999999997]
[null,null,null,4209,120.55,507394.95]
[null,null,null,4210,120.55,507515.5]
[null,null,null,4211,120.55,507636.05]
[null,null,null,4212,120.55,507756.6]
[null,null,null,4213,120.55,507877.14999999997]
[null,null,null,4214,120.55,507997.7]
[null,null,null,4215,120.55,508118.25]
[null,null,null,4216,120.55,508238.8]
[null,null,null,4217,120.55,508359.35]
[null,null,null,4218,120.55,508479.89999999997]
[null,null,null,4219,120.55,508600.45]
[null,null,null,4220,120.55,508721]
[null,null,null,4221,120.55,508841.55]
[null,null,null,4222,120.55,508962.1]
[null,null,null,4223,120.55,509082.64999999997]
[null,null,null,4224,120.55,509203.20000000001]
[null,null,null,4225,120.55,509323.75]
[null,null,null,4226,120.55,509444.3]
[null,null,null,4227,120.55,509564.85]
[null,null,null,4228,120.55,509685.39999999997]
[null,null,null,4229,120.55,509805.95]
[null,null,null,4230,120.55,509926.5]
[null,null,null,4231,120.55,510047.05]
[null,null,null,4232,120.55,510167.6]
[null,null,null,4233,120.55,510288.14999999997]
[null,null,null,4234,120.55,510408.7]
[null,null,null,4235,120.55,510529.25]
[null,null,null,4236,120.55,510649.8]
[null,null,null,4237,120.55,510770.35]
[null,null,null,4238,120.55,510890.89999999997]
[null,null,null,4239,120.55,511011.45]
[null,null,null,4240,120.55,511132]
[null,null,null,4241,{"$f":"$E$13","v":120.55},511252.55]
[null,null,null,4242,120.55,511373.1]
[null,null,null,4243,120.55,511493.64999999997]
[null,null,null,4244,120.55,511614.2]
[null,null,null,4245,120.55,511734.75]
[null,null,null,4246,120.55,511855.3]
[null,null,null,4247,120.55,511975.85]
[null,null,null,4248,120.55,512096.39999999997]
[null,null,null,4249,120.55,512216.95]
[null,null,null,4250,120.55,512337.5]
[null,null,null,4251,120.55,512458.05]
[null,null,null,4252,120.55,512578.6]
[null,null,null,4253,120.55,512699.14999999997]
[null,null,null,4254,120.55,512819.7]
[null,null,null,4255,120.55,512940.25]
[null,null,null,4256,120.55,513060.8]
[null,null,null,4257,120.55,513181.35]
[null,null,null,4258,120.55,513301.89999999997]
[null,null,null,4259,120.55,513422.45]
[null,null,null,4260,120.55,{"$f":"E4277*D4277","v":513543}]
[null,null,null,4261,120.55,513663.55]
[null,null,null,4262,120.55,513784.1]
[null,null,null,4263,120.55,513904.64999999997]
[null,null,null,4264,120.55,514025.2]
[null,null,null,4265,120.55,514145.75]
[null,null,null,4266,120.55,514266.3]
[null,null,null,4267,120.55,514386.85]
[null,null,null,4268,120.55,514507.39999999997]
[null,null,null,4269,120.55,514627.95]
[null,null,null,4270,120.55,514748.5]
[null,null,null,4271,120.55,514869.05]
[null,null,null,4272,120.55,514989.6]
[null,null,null,4273,120.55,515110.14999999997]
[null,null,null,4274,120.55,515230.7]
[null,null,null,4275,120.55,515351.25]
[null,null,null,4276,120.55,515471.8]
[null,null,null,4277,120.55,515592.35]
[null,null,null,4278,120.55,515712.89999999997]
[null,null,null,4279,120.55,515833.45]
[null,null,null,4280,120.55,515954]
[null,null,null,4281,120.55,516074.55]
[null,null,null,4282,120.55,516195.1]
[null,null,null,4283,120.55,516315.64999999997]
[null,null,null,4284,120.55,516436.2]
[null,null,null,4285,120.55,516556.75]
[null,null,null,4286,120.55,516677.3]
[null,null,null,4287,120.55,516797.85]
[null,null,null,4288,120.55,516918.39999999997]
[null,null,null,4289,120.55,517038.95]
[null,null,null,4290,120.55,517159.5]
[null,null,null,4291,120.55,517280.05]
[null,null,null,4292,120.55,517400.6]
[null,null,null,4293,120.55,517521.14999999997]
[null,null,null,4294,120.55,517641.7]
[null,null,null,4295,120.55,517762.25]
[null,null,null,4296,120.55,517882.8]
[null,null,null,4297,120.55,518003.35]
[null,null,null,4298,120.55,518123.89999999997]
[null,null,null,4299,120.55,518244.45]
[null,null,null,4300,120.55,518365]
[null,null,null,4301,120.55,518485.55]
[null,null,null,4302,120.55,518606.1]
[null,null,null,4303,120.55,518726.64999999997]
[null,null,null,4304,120.55,518847.2]
[null,null,null,4305,{"$f":"$E$13","v":120.55},518967.75]
[null,null,null,4306,120.55,519088.3]
[null,null,null,4307,120.55,519208.85]
[null,null,null,4308,120.55,519329.39999999997]
[null,null,null,4309,120.55,519449.95]
[null,null,null,4310,120.55,519570.5]
[null,null,null,4311,120.55,519691.05]
[null,null,null,4312,120.55,519811.6]
[null,null,null,4313,120.55,519932.14999999997]
[null,null,null,4314,120.55,520052.7]
[null,null,null,4315,120.55,520173.25]
[null,null,null,4316,120.55,520293.8]
[null,null,null,4317,120.55,520414.35]
[null,null,null,4318,120.55,520534.89999999997]
[null,null,null,4319,120.55,520655.45]
[null,null,null,4320,120.55,520776]
[null,null,null,4321,120.55,520896.55]
[null,null,null,4322,120.55,521017.1]
[null,null,null,4323,120.55,521137.64999999997]
[null,null,null,4324,120.55,{"$f":"E4341*D4341","v":521258.2}]
[null,null,null,4325,120.55,521378.75]
[null,null,null,4326,120.55,521499.3]
[null,null,null,4327,120.55,521619.85]
[null,null,null,4328,120.55,521740.39999999997]
[null,null,null,4329,120.55,521860.95]
[null,null,null,4330,120.55,521981.5]
[null,null,null,4331,120.55,522102.05]
[null,null,null,4332,120.55,522222.6]
[null,null,null,4333,120.55,522343.14999999997]
[null,null,null,4334,120.55,522463.7]
[null,null,null,4335,120.55,522584.25]
[null,null,null,4336,120.55,522704.8]
[null,null,null,4337,120.55,522825.35]
[null,null,null,4338,120.55,522945.89999999997]
[null,null,null,4339,120.55,523066.45]
[null,null,null,4340,120.55,523187]
[null,null,null,4341,120.55,523307.55]
[null,null,null,4342,120.55,523428.1]
[null,null,null,4343,120.55,523548.64999999997]
[null,null,null,4344,120.55,523669.2]
[null,null,null,4345,120.55,523789.75]
[null,null,null,4346,120.55,523910.3]
[null,null,null,4347,120.55,524030.85]
[null,null,null,4348,120.55,524151.39999999997]
[null,null,null,4349,120.55,524271.95]
[null,null,null,4350,120.55,524392.5]
[null,null,null,4351,120.55,524513.04999999993]
[null,null,null,4352,120.55,524633.59999999998]
[null,null,null,4353,120.55,524754.15]
[null,null,null,4354,120.55,524874.69999999995]
[null,null,null,4355,120.55,524995.25]
[null,null,null,4356,120.55,525115.79999999993]
[null,null,null,4357,120.55,525236.35]
[null,null,null,4358,120.55,525356.9]
[null,null,null,4359,120.55,525477.44999999995]
[null,null,null,4360,120.55,525598]
[null,null,null,4361,120.55,525718.54999999993]
[null,null,null,4362,120.55,525839.1]
[null,null,null,4363,120.55,525959.65]
[null,null,null,4364,120.55,526080.19999999995]
[null,null,null,4365,120.55,526200.75]
[null,null,null,4366,120.55,526321.29999999993]
[null,null,null,4367,120.55,526441.85]
[null,null,null,4368,120.55,526562.4]
[null,null,null,4369,{"$f":"$E$13","v":120.55},526682.94999999995]
[null,null,null,4370,120.55,526803.5]
[null,null,null,4371,120.55,526924.04999999993]
[null,null,null,4372,120.55,527044.6]
[null,null,null,4373,120.55,527165.15]
[null,null,null,4374,120.55,527285.69999999995]
[null,null,null,4375,120.55,527406.25]
[null,null,null,4376,120.55,527526.79999999993]
[null,null,null,4377,120.55,527647.35]
[null,null,null,4378,120.55,527767.9]
[null,null,null,4379,120.55,527888.44999999995]
[null,null,null,4380,120.55,528009]
[null,null,null,4381,120.55,528129.54999999993]
[null,null,null,4382,120.55,528250.1]
[null,null,null,4383,120.55,528370.65]
[null,null,null,4384,120.55,528491.19999999995]
[null,null,null,4385,120.55,528611.75]
[null,null,null,4386,120.55,528732.29999999993]
[null,null,null,4387,120.55,528852.85]
[null,null,null,4388,120.55,{"$f":"E4405*D4405","v":528973.4}]
[null,null,null,4389,120.55,529093.94999999995]
[null,null,null,4390,120.55,529214.5]
[null,null,null,4391,120.55,529335.04999999993]
[null,null,null,4392,120.55,529455.6]
[null,null,null,4393,120.55,529576.15]
[null,null,null,4394,120.55,529696.69999999995]
[null,null,null,4395,120.55,529817.25]
[null,null,null,4396,120.55,529937.79999999993]
[null,null,null,4397,120.55,530058.35]
[null,null,null,4398,120.55,530178.9]
[null,null,null,4399,120.55,530299.44999999995]
[null,null,null,4400,120.55,530420]
[null,null,null,4401,120.55,530540.54999999993]
[null,null,null,4402,120.55,530661.1]
[null,null,null,4403,120.55,530781.65]
[null,null,null,4404,120.55,530902.19999999995]
[null,null,null,4405,120.55,531022.75]
[null,null,null,4406,120.55,531143.29999999993]
[null,null,null,4407,120.55,531263.85]
[null,null,null,4408,120.55,531384.4]
[null,null,null,4409,120.55,531504.94999999995]
[null,null,null,4410,120.55,531625.5]
[null,null,null,4411,120.55,531746.04999999993]
[null,null,null,4412,120.55,531866.6]
[null,null,null,4413,120.55,531987.15]
[null,null,null,4414,120.55,532107.69999999995]
[null,null,null,4415,120.55,532228.25]
[null,null,null,4416,120.55,532348.79999999993]
[null,null,null,4417,120.55,532469.35]
[null,null,null,4418,120.55,532589.9]
[null,null,null,4419,120.55,532710.44999999995]
[null,null,null,4420,120.55,532831]
[null,null,null,4421,120.55,532951.54999999993]
[null,null,null,4422,120.55,533072.1]
[null,null,null,4423,120.55,533192.65]
[null,null,null,4424,120.55,533313.19999999995]
[null,null,null,4425,120.55,533433.75]
[null,null,null,4426,120.55,533554.29999999993]
[null,null,null,4427,120.55,533674.85]
[null,null,null,4428,120.55,533795.4]
[null,null,null,4429,120.55,533915.94999999995]
[null,null,null,4430,120.55,534036.5]
[null,null,null,4431,120.55,534157.04999999993]
[null,null,null,4432,120.55,534277.6]
[null,null,null,4433,{"$f":"$E$13","v":120.55},534398.15]
[null,null,null,4434,120.55,534518.69999999995]
[null,null,null,4435,120.55,534639.25]
[null,null,null,4436,120.55,534759.79999999993]
[null,null,null,4437,120.55,534880.35]
[null,null,null,4438,120.55,535000.9]
[null,null,null,4439,120.55,535121.44999999995]
[null,null,null,4440,120.55,535242]
[null,null,null,4441,120.55,535362.54999999993]
[null,null,null,4442,120.55,535483.1]
[null,null,null,4443,120.55,535603.65]
[null,null,null,4444,120.55,535724.19999999995]
[null,null,null,4445,120.55,535844.75]
[null,null,null,4446,120.55,535965.29999999993]
[null,null,null,4447,120.55,536085.85]
[null,null,null,4448,120.55,536206.4]
[null,null,null,4449,120.55,536326.94999999995]
[null,null,null,4450,120.55,536447.5]
[null,null,null,4451,120.55,536568.04999999993]
[null,null,null,4452,120.55,{"$f":"E4469*D4469","v":536688.6}]
[null,null,null,4453,120.55,536809.15]
[null,null,null,4454,120.55,536929.69999999995]
[null,null,null,4455,120.55,537050.25]
[null,null,null,4456,120.55,537170.79999999993]
[null,null,null,4457,120.55,537291.35]
[null,null,null,4458,120.55,537411.9]
[null,null,null,4459,120.55,537532.44999999995]
[null,null,null,4460,120.55,537653]
[null,null,null,4461,120.55,537773.54999999993]
[null,null,null,4462,120.55,537894.1]
[null,null,null,4463,120.55,538014.65]
[null,null,null,4464,120.55,538135.19999999995]
[null,null,null,4465,120.55,538255.75]
[null,null,null,4466,120.55,538376.29999999993]
[null,null,null,4467,120.55,538496.85]
[null,null,null,4468,120.55,538617.4]
[null,null,null,4469,120.55,538737.94999999995]
[null,null,null,4470,120.55,538858.5]
[null,null,null,4471,120.55,538979.04999999993]
[null,null,null,4472,120.55,539099.6]
[null,null,null,4473,120.55,539220.15]
[null,null,null,4474,120.55,539340.69999999995]
[null,null,null,4475,120.55,539461.25]
[null,null,null,4476,120.55,539581.79999999993]
[null,null,null,4477,120.55,539702.35]
[null,null,null,4478,120.55,539822.9]
[null,null,null,4479,120.55,539943.44999999995]
[null,null,null,4480,120.55,540064]
[null,null,null,4481,120.55,540184.54999999993]
[null,null,null,4482,120.55,540305.1]
[null,null,null,4483,120.55,540425.65]
[null,null,null,4484,120.55,540546.19999999995]
[null,null,null,4485,120.55,540666.75]
[null,null,null,4486,120.55,540787.29999999993]
[null,null,null,4487,120.55,540907.85]
[null,null,null,4488,120.55,541028.4]
[null,null,null,4489,120.55,541148.94999999995]
[null,null,null,4490,120.55,541269.5]
[null,null,null,4491,120.55,541390.04999999993]
[null,null,null,4492,120.55,541510.6]
[null,null,null,4493,120.55,541631.15]
[null,null,null,4494,120.55,541751.69999999995]
[null,null,null,4495,120.55,541872.25]
[null,null,null,4496,120.55,541992.79999999993]
[null,null,null,4497,{"$f":"$E$13","v":120.55},542113.35]
[null,null,null,4498,120.55,542233.9]
[null,null,null,4499,120.55,542354.44999999995]
[null,null,null,4500,120.55,542475]
[null,null,null,4501,120.55,542595.54999999993]
[null,null,null,4502,120.55,542716.1]
[null,null,null,4503,120.55,542836.65]
[null,null,null,4504,120.55,542957.19999999995]
[null,null,null,4505,120.55,543077.75]
[null,null,null,4506,120.55,543198.29999999993]
[null,null,null,4507,120.55,543318.85]
[null,null,null,4508,120.55,543439.4]
[null,null,null,4509,120.55,543559.94999999995]
[null,null,null,4510,120.55,543680.5]
[null,null,null,4511,120.55,543801.04999999993]
[null,null,null,4512,120.55,543921.6]
[null,null,null,4513,120.55,544042.15]
[null,null,null,4514,120.55,544162.69999999995]
[null,null,null,4515,120.55,544283.25]
[null,null,null,4516,120.55,{"$f":"E4533*D4533","v":544403.79999999993}]
[null,null,null,4517,120.55,544524.35]
[null,null,null,4518,120.55,544644.9]
[null,null,null,4519,120.55,544765.44999999995]
[null,null,null,4520,120.55,544886]
[null,null,null,4521,120.55,545006.54999999993]
[null,null,null,4522,120.55,545127.1]
[null,null,null,4523,120.55,545247.65]
[null,null,null,4524,120.55,545368.19999999995]
[null,null,null,4525,120.55,545488.75]
[null,null,null,4526,120.55,545609.29999999993]
[null,null,null,4527,120.55,545729.85]
[null,null,null,4528,120.55,545850.4]
[null,null,null,4529,120.55,545970.94999999995]
[null,null,null,4530,120.55,546091.5]
[null,null,null,4531,120.55,546212.04999999993]
[null,null,null,4532,120.55,546332.6]
[null,null,null,4533,120.55,546453.15]
[null,null,null,4534,120.55,546573.69999999995]
[null,null,null,4535,120.55,546694.25]
[null,null,null,4536,120.55,546814.79999999993]
[null,null,null,4537,120.55,546935.35]
[null,null,null,4538,120.55,547055.9]
[null,null,null,4539,120.55,547176.44999999995]
[null,null,null,4540,120.55,547297]
[null,null,null,4541,120.55,547417.54999999993]
[null,null,null,4542,120.55,547538.1]
[null,null,null,4543,120.55,547658.65]
[null,null,null,4544,120.55,547779.19999999995]
[null,null,null,4545,120.55,547899.75]
[null,null,null,4546,120.55,548020.29999999993]
[null,null,null,4547,120.55,548140.85]
[null,null,null,4548,120.55,548261.4]
[null,null,null,4549,120.55,548381.94999999995]
[null,null,null,4550,120.55,548502.5]
[null,null,null,4551,120.55,548623.04999999993]
[null,null,null,4552,120.55,548743.6]
[null,null,null,4553,120.55,548864.15]
[null,null,null,4554,120.55,548984.69999999995]
[null,null,null,4555,120.55,549105.25]
[null,null,null,4556,120.55,549225.79999999993]
[null,null,null,4557,120.55,549346.35]
[null,null,null,4558,120.55,549466.9]
[null,null,null,4559,120.55,549587.44999999995]
[null,null,null,4560,120.55,549708]
[null,null,null,4561,{"$f":"$E$13","v":120.55},549828.54999999993]
[null,null,null,4562,120.55,549949.1]
[null,null,null,4563,120.55,550069.65]
[null,null,null,4564,120.55,550190.19999999995]
[null,null,null,4565,120.55,550310.75]
[null,null,null,4566,120.55,550431.29999999993]
[null,null,null,4567,120.55,550551.85]
[null,null,null,4568,120.55,550672.4]
[null,null,null,4569,120.55,550792.94999999995]
[null,null,null,4570,120.55,550913.5]
[null,null,null,4571,120.55,551034.04999999993]
[null,null,null,4572,120.55,551154.6]
[null,null,null,4573,120.55,551275.15]
[null,null,null,4574,120.55,551395.69999999995]
[null,null,null,4575,120.55,551516.25]
[null,null,null,4576,120.55,551636.79999999993]
[null,null,null,4577,120.55,551757.35]
[null,null,null,4578,120.55,551877.9]
[null,null,null,4579,120.55,551998.44999999995]
[null,null,null,4580,120.55,{"$f":"E4597*D4597","v":552119}]
[null,null,null,4581,120.55,552239.54999999993]
[null,null,null,4582,120.55,552360.1]
[null,null,null,4583,120.55,552480.65]
[null,null,null,4584,120.55,552601.19999999995]
[null,null,null,4585,120.55,552721.75]
[null,null,null,4586,120.55,552842.29999999993]
[null,null,null,4587,120.55,552962.85]
[null,null,null,4588,120.55,553083.4]
[null,null,null,4589,120.55,553203.94999999995]
[null,null,null,4590,120.55,553324.5]
[null,null,null,4591,120.55,553445.04999999993]
[null,null,null,4592,120.55,553565.6]
[null,null,null,4593,120.55,553686.15]
[null,null,null,4594,120.55,553806.69999999995]
[null,null,null,4595,120.55,553927.25]
[null,null,null,4596,120.55,554047.79999999993]
[null,null,null,4597,120.55,554168.35]
[null,null,null,4598,120.55,554288.9]
[null,null,null,4599,120.55,554409.44999999995]
[null,null,null,4600,120.55,554530]
[null,null,null,4601,120.55,554650.54999999993]
[null,null,null,4602,120.55,554771.1]
[null,null,null,4603,120.55,554891.65]
[null,null,null,4604,120.55,555012.19999999995]
[null,null,null,4605,120.55,555132.75]
[null,null,null,4606,120.55,555253.29999999993]
[null,null,null,4607,120.55,555373.85]
[null,null,null,4608,120.55,555494.40000000002]
[null,null,null,4609,120.55,555614.94999999995]
[null,null,null,4610,120.55,555735.5]
[null,null,null,4611,120.55,555856.04999999993]
[null,null,null,4612,120.55,555976.6]
[null,null,null,4613,120.55,556097.15]
[null,null,null,4614,120.55,556217.69999999995]
[null,null,null,4615,120.55,556338.25]
[null,null,null,4616,120.55,556458.79999999993]
[null,null,null,4617,120.55,556579.35]
[null,null,null,4618,120.55,556699.9]
[null,null,null,4619,120.55,556820.44999999995]
[null,null,null,4620,120.55,556941]
[null,null,null,4621,120.55,557061.54999999993]
[null,null,null,4622,120.55,557182.1]
[null,null,null,4623,120.55,557302.65]
[null,null,null,4624,120.55,557423.19999999995]
[null,null,null,4625,{"$f":"$E$13","v":120.55},557543.75]
[null,null,null,4626,120.55,557664.29999999993]
[null,null,null,4627,120.55,557784.85]
[null,null,null,4628,120.55,557905.4]
[null,null,null,4629,120.55,558025.94999999995]
[null,null,null,4630,120.55,558146.5]
[null,null,null,4631,120.55,558267.04999999993]
[null,null,null,4632,120.55,558387.6]
[null,null,null,4633,120.55,558508.15]
[null,null,null,4634,120.55,558628.69999999995]
[null,null,null,4635,120.55,558749.25]
[null,null,null,4636,120.55,558869.79999999993]
[null,null,null,4637,120.55,558990.35]
[null,null,null,4638,120.55,559110.9]
[null,null,null,4639,120.55,559231.44999999995]
[null,null,null,4640,120.55,559352]
[null,null,null,4641,120.55,559472.54999999993]
[null,null,null,4642,120.55,559593.1]
[null,null,null,4643,120.55,559713.65]
[null,null,null,4644,120.55,{"$f":"E4661*D4661","v":559834.19999999995}]
[null,null,null,4645,120.55,559954.75]
[null,null,null,4646,120.55,560075.29999999993]
[null,null,null,4647,120.55,560195.85]
[null,null,null,4648,120.55,560316.4]
[null,null,null,4649,120.55,560436.94999999995]
[null,null,null,4650,120.55,560557.5]
[null,null,null,4651,120.55,560678.04999999993]
[null,null,null,4652,120.55,560798.6]
[null,null,null,4653,120.55,560919.15]
[null,null,null,4654,120.55,561039.69999999995]
[null,null,null,4655,120.55,561160.25]
[null,null,null,4656,120.55,561280.79999999993]
[null,null,null,4657,120.55,561401.35]
[null,null,null,4658,120.55,561521.9]
[null,null,null,4659,120.55,561642.44999999995]
[null,null,null,4660,120.55,561763]
[null,null,null,4661,120.55,561883.54999999993]
[null,null,null,4662,120.55,562004.1]
[null,null,null,4663,120.55,562124.65]
[null,null,null,4664,120.55,562245.19999999995]
[null,null,null,4665,120.55,562365.75]
[null,null,null,4666,120.55,562486.29999999993]
[null,null,null,4667,120.55,562606.85]
[null,null,null,4668,120.55,562727.4]
[null,null,null,4669,120.55,562847.94999999995]
[null,null,null,4670,120.55,562968.5]
[null,null,null,4671,120.55,563089.04999999993]
[null,null,null,4672,120.55,563209.6]
[null,null,null,4673,120.55,563330.15]
[null,null,null,4674,120.55,563450.69999999995]
[null,null,null,4675,120.55,563571.25]
[null,null,null,4676,120.55,563691.79999999993]
[null,null,null,4677,120.55,563812.35]
[null,null,null,4678,120.55,563932.9]
[null,null,null,4679,120.55,564053.44999999995]
[null,null,null,4680,120.55,564174]
[null,null,null,4681,120.55,564294.54999999993]
[null,null,null,4682,120.55,564415.1]
[null,null,null,4683,120.55,564535.65]
[null,null,null,4684,120.55,564656.19999999995]
[null,null,null,4685,120.55,564776.75]
[null,null,null,4686,120.55,564897.29999999993]
[null,null,null,4687,120.55,565017.85]
[null,null,null,4688,120.55,565138.4]
[null,null,null,4689,{"$f":"$E$13","v":120.55},565258.94999999995]
[null,null,null,4690,120.55,565379.5]
[null,null,null,4691,120.55,565500.04999999993]
[null,null,null,4692,120.55,565620.6]
[null,null,null,4693,120.55,565741.15]
[null,null,null,4694,120.55,565861.69999999995]
[null,null,null,4695,120.55,565982.25]
[null,null,null,4696,120.55,566102.79999999993]
[null,null,null,4697,120.55,566223.35]
[null,null,null,4698,120.55,566343.9]
[null,null,null,4699,120.55,566464.44999999995]
[null,null,null,4700,120.55,566585]
[null,null,null,4701,120.55,566705.54999999993]
[null,null,null,4702,120.55,566826.1]
[null,null,null,4703,120.55,566946.65]
[null,null,null,4704,120.55,567067.19999999995]
[null,null,null,4705,120.55,567187.75]
[null,null,null,4706,120.55,567308.29999999993]
[null,null,null,4707,120.55,567428.85]
[null,null,null,4708,120.55,{"$f":"E4725*D4725","v":567549.4}]
[null,null,null,4709,120.55,567669.94999999995]
[null,null,null,4710,120.55,567790.5]
[null,null,null,4711,120.55,567911.04999999993]
[null,null,null,4712,120.55,568031.6]
[null,null,null,4713,120.55,568152.15]
[null,null,null,4714,120.55,568272.69999999995]
[null,null,null,4715,120.55,568393.25]
[null,null,null,4716,120.55,568513.79999999993]
[null,null,null,4717,120.55,568634.35]
[null,null,null,4718,120.55,568754.9]
[null,null,null,4719,120.55,568875.44999999995]
[null,null,null,4720,120.55,568996]
[null,null,null,4721,120.55,569116.54999999993]
[null,null,null,4722,120.55,569237.1]
[null,null,null,4723,120.55,569357.65]
[null,null,null,4724,120.55,569478.19999999995]
[null,null,null,4725,120.55,569598.75]
[null,null,null,4726,120.55,569719.29999999993]
[null,null,null,4727,120.55,569839.85]
[null,null,null,4728,120.55,569960.4]
[null,null,null,4729,120.55,570080.94999999995]
[null,null,null,4730,120.55,570201.5]
[null,null,null,4731,120.55,570322.04999999993]
[null,null,null,4732,120.55,570442.6]
[null,null,null,4733,120.55,570563.15]
[null,null,null,4734,120.55,570683.69999999995]
[null,null,null,4735,120.55,570804.25]
[null,null,null,4736,120.55,570924.79999999993]
[null,null,null,4737,120.55,571045.35]
[null,null,null,4738,120.55,571165.9]
[null,null,null,4739,120.55,571286.44999999995]
[null,null,null,4740,120.55,571407]
[null,null,null,4741,120.55,571527.54999999993]
[null,null,null,4742,120.55,571648.1]
[null,null,null,4743,120.55,571768.65]
[null,null,null,4744,120.55,571889.19999999995]
[null,null,null,4745,120.55,572009.75]
[null,null,null,4746,120.55,572130.29999999993]
[null,null,null,4747,120.55,572250.85]
[null,null,null,4748,120.55,572371.4]
[null,null,null,4749,120.55,572491.94999999995]
[null,null,null,4750,120.55,572612.5]
[null,null,null,4751,120.55,572733.04999999993]
[null,null,null,4752,120.55,572853.6]
[null,null,null,4753,{"$f":"$E$13","v":120.55},572974.15]
[null,null,null,4754,120.55,573094.69999999995]
[null,null,null,4755,120.55,573215.25]
[null,null,null,4756,120.55,573335.79999999993]
[null,null,null,4757,120.55,573456.35]
[null,null,null,4758,120.55,573576.9]
[null,null,null,4759,120.55,573697.44999999995]
[null,null,null,4760,120.55,573818]
[null,null,null,4761,120.55,573938.54999999993]
[null,null,null,4762,120.55,574059.1]
[null,null,null,4763,120.55,574179.65]
[null,null,null,4764,120.55,574300.19999999995]
[null,null,null,4765,120.55,574420.75]
[null,null,null,4766,120.55,574541.29999999993]
[null,null,null,4767,120.55,574661.85]
[null,null,null,4768,120.55,574782.4]
[null,null,null,4769,120.55,574902.94999999995]
[null,null,null,4770,120.55,575023.5]
[null,null,null,4771,120.55,575144.04999999993]
[null,null,null,4772,120.55,{"$f":"E4789*D4789","v":575264.6}]
[null,null,null,4773,120.55,575385.15]
[null,null,null,4774,120.55,575505.69999999995]
[null,null,null,4775,120.55,575626.25]
[null,null,null,4776,120.55,575746.79999999993]
[null,null,null,4777,120.55,575867.35]
[null,null,null,4778,120.55,575987.9]
[null,null,null,4779,120.55,576108.44999999995]
[null,null,null,4780,120.55,576229]
[null,null,null,4781,120.55,576349.54999999993]
[null,null,null,4782,120.55,576470.1]
[null,null,null,4783,120.55,576590.65]
[null,null,null,4784,120.55,576711.19999999995]
[null,null,null,4785,120.55,576831.75]
[null,null,null,4786,120.55,576952.29999999993]
[null,null,null,4787,120.55,577072.85]
[null,null,null,4788,120.55,577193.4]
[null,null,null,4789,120.55,577313.94999999995]
[null,null,null,4790,120.55,577434.5]
[null,null,null,4791,120.55,577555.04999999993]
[null,null,null,4792,120.55,577675.6]
[null,null,null,4793,120.55,577796.15]
[null,null,null,4794,120.55,577916.69999999995]
[null,null,null,4795,120.55,578037.25]
[null,null,null,4796,120.55,578157.79999999993]
[null,null,null,4797,120.55,578278.35]
[null,null,null,4798,120.55,578398.9]
[null,null,null,4799,120.55,578519.44999999995]
[null,null,null,4800,120.55,578640]
[null,null,null,4801,120.55,578760.54999999993]
[null,null,null,4802,120.55,578881.1]
[null,null,null,4803,120.55,579001.65]
[null,null,null,4804,120.55,579122.19999999995]
[null,null,null,4805,120.55,579242.75]
[null,null,null,4806,120.55,579363.29999999993]
[null,null,null,4807,120.55,579483.85]
[null,null,null,4808,120.55,579604.4]
[null,null,null,4809,120.55,579724.94999999995]
[null,null,null,4810,120.55,579845.5]
[null,null,null,4811,120.55,579966.04999999993]
[null,null,null,4812,120.55,580086.6]
[null,null,null,4813,120.55,580207.15]
[null,null,null,4814,120.55,580327.69999999995]
[null,null,null,4815,120.55,580448.25]
[null,null,null,4816,120.55,580568.79999999993]
[null,null,null,4817,{"$f":"$E$13","v":120.55},580689.35]
[null,null,null,4818,120.55,580809.9]
[null,null,null,4819,120.55,580930.44999999995]
[null,null,null,4820,120.55,581051]
[null,null,null,4821,120.55,581171.54999999993]
[null,null,null,4822,120.55,581292.1]
[null,null,null,4823,120.55,581412.65]
[null,null,null,4824,120.55,581533.19999999995]
[null,null,null,4825,120.55,581653.75]
[null,null,null,4826,120.55,581774.29999999993]
[null,null,null,4827,120.55,581894.85]
[null,null,null,4828,120.55,582015.4]
[null,null,null,4829,120.55,582135.94999999995]
[null,null,null,4830,120.55,582256.5]
[null,null,null,4831,120.55,582377.04999999993]
[null,null,null,4832,120.55,582497.6]
[null,null,null,4833,120.55,582618.15]
[null,null,null,4834,120.55,582738.69999999995]
[null,null,null,4835,120.55,582859.25]
[null,null,null,4836,120.55,{"$f":"E4853*D4853","v":582979.79999999993}]
[null,null,null,4837,120.55,583100.35]
[null,null,null,4838,120.55,583220.9]
[null,null,null,4839,120.55,583341.44999999995]
[null,null,null,4840,120.55,583462]
[null,null,null,4841,120.55,583582.54999999993]
[null,null,null,4842,120.55,583703.1]
[null,null,null,4843,120.55,583823.65]
[null,null,null,4844,120.55,583944.19999999995]
[null,null,null,4845,120.55,584064.75]
[null,null,null,4846,120.55,584185.29999999993]
[null,null,null,4847,120.55,584305.85]
[null,null,null,4848,120.55,584426.4]
[null,null,null,4849,120.55,584546.94999999995]
[null,null,null,4850,120.55,584667.5]
[null,null,null,4851,120.55,584788.04999999993]
[null,null,null,4852,120.55,584908.6]
[null,null,null,4853,120.55,585029.15]
[null,null,null,4854,120.55,585149.69999999995]
[null,null,null,4855,120.55,585270.25]
[null,null,null,4856,120.55,585390.79999999993]
[null,null,null,4857,120.55,585511.35]
[null,null,null,4858,120.55,585631.9]
[null,null,null,4859,120.55,585752.44999999995]
[null,null,null,4860,120.55,585873]
[null,null,null,4861,120.55,585993.54999999993]
[null,null,null,4862,120.55,586114.1]
[null,null,null,4863,120.55,586234.65]
[null,null,null,4864,120.55,586355.19999999995]
[null,null,null,4865,120.55,586475.75]
[null,null,null,4866,120.55,586596.29999999993]
[null,null,null,4867,120.55,586716.85]
[null,null,null,4868,120.55,586837.4]
[null,null,null,4869,120.55,586957.94999999995]
[null,null,null,4870,120.55,587078.5]
[null,null,null,4871,120.55,587199.04999999993]
[null,null,null,4872,120.55,587319.6]
[null,null,null,4873,120.55,587440.15]
[null,null,null,4874,120.55,587560.69999999995]
[null,null,null,4875,120.55,587681.25]
[null,null,null,4876,120.55,587801.79999999993]
[null,null,null,4877,120.55,587922.35]
[null,null,null,4878,120.55,588042.9]
[null,null,null,4879,120.55,588163.44999999995]
[null,null,null,4880,120.55,588284]
[null,null,null,4881,{"$f":"$E$13","v":120.55},588404.54999999993]
[null,null,null,4882,120.55,588525.1]
[null,null,null,4883,120.55,588645.65]
[null,null,null,4884,120.55,588766.19999999995]
[null,null,null,4885,120.55,588886.75]
[null,null,null,4886,120.55,589007.29999999993]
[null,null,null,4887,120.55,589127.85]
[null,null,null,4888,120.55,589248.4]
[null,null,null,4889,120.55,589368.94999999995]
[null,null,null,4890,120.55,589489.5]
[null,null,null,4891,120.55,589610.04999999993]
[null,null,null,4892,120.55,589730.6]
[null,null,null,4893,120.55,589851.15]
[null,null,null,4894,120.55,589971.69999999995]
[null,null,null,4895,120.55,590092.25]
[null,null,null,4896,120.55,590212.79999999993]
[null,null,null,4897,120.55,590333.35]
[null,null,null,4898,120.55,590453.9]
[null,null,null,4899,120.55,590574.44999999995]
[null,null,null,4900,120.55,{"$f":"E4917*D4917","v":590695}]
[null,null,null,4901,120.55,590815.54999999993]
[null,null,null,4902,120.55,590936.1]
[null,null,null,4903,120.55,591056.65]
[null,null,null,4904,120.55,591177.19999999995]
[null,null,null,4905,120.55,591297.75]
[null,null,null,4906,120.55,591418.29999999993]
[null,null,null,4907,120.55,591538.85]
[null,null,null,4908,120.55,591659.4]
[null,null,null,4909,120.55,591779.94999999995]
[null,null,null,4910,120.55,591900.5]
[null,null,null,4911,120.55,592021.04999999993]
[null,null,null,4912,120.55,592141.6]
[null,null,null,4913,120.55,592262.15]
[null,null,null,4914,120.55,592382.69999999995]
[null,null,null,4915,120.55,592503.25]
[null,null,null,4916,120.55,592623.79999999993]
[null,null,null,4917,120.55,592744.35]
[null,null,null,4918,120.55,592864.9]
[null,null,null,4919,120.55,592985.44999999995]
[null,null,null,4920,120.55,593106]
[null,null,null,4921,120.55,593226.54999999993]
[null,null,null,4922,120.55,593347.1]
[null,null,null,4923,120.55,593467.65]
[null,null,null,4924,120.55,593588.19999999995]
[null,null,null,4925,120.55,593708.75]
[null,null,null,4926,120.55,593829.29999999993]
[null,null,null,4927,120.55,593949.85]
[null,null,null,4928,120.55,594070.4]
[null,null,null,4929,120.55,594190.94999999995]
[null,null,null,4930,120.55,594311.5]
[null,null,null,4931,120.55,594432.04999999993]
[null,null,null,4932,120.55,594552.6]
[null,null,null,4933,120.55,594673.15]
[null,null,null,4934,120.55,594793.69999999995]
[null,null,null,4935,120.55,594914.25]
[null,null,null,4936,120.55,595034.79999999993]
[null,null,null,4937,120.55,595155.35]
[null,null,null,4938,120.55,595275.9]
[null,null,null,4939,120.55,595396.44999999995]
[null,null,null,4940,120.55,595517]
[null,null,null,4941,120.55,595637.54999999993]
[null,null,null,4942,120.55,595758.1]
[null,null,null,4943,120.55,595878.65]
[null,null,null,4944,120.55,595999.19999999995]
[null,null,null,4945,{"$f":"$E$13","v":120.55},596119.75]
[null,null,null,4946,120.55,596240.29999999993]
[null,null,null,4947,120.55,596360.85]
[null,null,null,4948,120.55,596481.4]
[null,null,null,4949,120.55,596601.94999999995]
[null,null,null,4950,120.55,596722.5]
[null,null,null,4951,120.55,596843.04999999993]
[null,null,null,4952,120.55,596963.6]
[null,null,null,4953,120.55,597084.15]
[null,null,null,4954,120.55,597204.69999999995]
[null,null,null,4955,120.55,597325.25]
[null,null,null,4956,120.55,597445.79999999993]
[null,null,null,4957,120.55,597566.35]
[null,null,null,4958,120.55,597686.9]
[null,null,null,4959,120.55,597807.44999999995]
[null,null,null,4960,120.55,597928]
[null,null,null,4961,120.55,598048.54999999993]
[null,null,null,4962,120.55,598169.1]
[null,null,null,4963,120.55,598289.65]
[null,null,null,4964,120.55,{"$f":"E4981*D4981","v":598410.19999999995}]
[null,null,null,4965,120.55,598530.75]
[null,null,null,4966,120.55,598651.29999999993]
[null,null,null,4967,120.55,598771.85]
[null,null,null,4968,120.55,598892.4]
[null,null,null,4969,120.55,599012.94999999995]
[null,null,null,4970,120.55,599133.5]
[null,null,null,4971,120.55,599254.04999999993]
[null,null,null,4972,120.55,599374.6]
[null,null,null,4973,120.55,599495.15]
[null,null,null,4974,120.55,599615.69999999995]
[null,null,null,4975,120.55,599736.25]
[null,null,null,4976,120.55,599856.79999999993]
[null,null,null,4977,120.55,599977.35]
[null,null,null,4978,120.55,600097.9]
[null,null,null,4979,120.55,600218.44999999995]
[null,null,null,4980,120.55,600339]
[null,null,null,4981,120.55,600459.54999999993]
[null,null,null,4982,120.55,600580.1]
[null,null,null,4983,120.55,600700.65]
[null,null,null,4984,120.55,600821.19999999995]
[null,null,null,4985,120.55,600941.75]
[null,null,null,4986,120.55,601062.29999999993]
[null,null,null,4987,120.55,601182.85]
[null,null,null,4988,120.55,601303.4]
[null,null,null,4989,120.55,601423.94999999995]
[null,null,null,4990,120.55,601544.5]
[null,null,null,4991,120.55,601665.04999999993]
[null,null,null,4992,120.55,601785.59999999998]
[null,null,null,4993,120.55,601906.15]
[null,null,null,4994,120.55,602026.69999999995]
[null,null,null,4995,120.55,602147.25]
[null,null,null,4996,120.55,602267.79999999993]
[null,null,null,4997,120.55,602388.35]
[null,null,null,4998,120.55,602508.9]
[null,null,null,4999,120.55,602629.44999999995]
[null,null,null,5000,120.55,602750]
[]
[null,null,null,null,{"$f":"AVERAGE(E117:E5017)","v":131.01278922669078}]

{"sheet":"Print Sheets","index":23,"n_rows":10,"n_cols":7,"rows_kept":10,"cut":false,"hidden":false,"merged":[[9,6,12,12]]}
["Print Multiple Worksheets"]
[]
[]
[]
[]
[]
[]
[]
[]
[null,null,null,null,null,null,"Step 2 -Select the worksheets needing to be printed from the \n             ListBox on the left. You can select multiple worksheets \n             by holding down the CTRL key and left clicking on \n             the required worksheets."]

{"sheet":"Actions to correct","index":24,"n_rows":0,"n_cols":0,"rows_kept":0,"cut":false,"hidden":true,"merged":[]}