{"text_format":"1","workbook":"xlsx","n_sheets":22,"sheets":["Part 1","Part 1 Cont'd","Part 2","Part2A Deductible","Part 3","Part 5","Personnel Sheet","Soil-Water Disposal","Data","Equipment Rent - Purchase","Hotel & Food","Travel","Transportation&Shipping","Drilling-P&A","Analysis","Miscellaneous 1","Miscellaneous 2","Miscellaneous 3","Miscellaneous 4","Part 6","Part 7","Part 8"],"not_rendered":{"charts":0,"images":272,"macros":1,"external_links":0,"defined_names":22,"comments":11,"pivot_tables":0},"unopened":[],"bounds":{"document_bytes":16777216,"sheet_cells":100000,"rows_first":2000,"rows_last":500,"rows_between":2000,"halvings":0,"cell_chars":16384,"cell_head_chars":4096},"cells_cut":0,"cells_raw":0,"read":"whole","date_system":"1900"}

{"sheet":"Part 1","index":0,"n_rows":47,"n_cols":11,"rows_kept":47,"cut":false,"hidden":false,"merged":[[23,6,24,7],[22,0,22,3],[23,0,24,3],[30,2,30,3],[23,4,24,5],[31,5,32,7],[46,0,46,7],[36,0,36,7],[37,0,37,7],[38,0,38,7],[39,0,39,7],[40,0,40,7],[42,0,42,6],[43,6,45,7],[34,2,34,3],[0,0,0,7],[1,0,1,7],[2,0,2,7],[3,0,3,7],[4,0,4,3],[4,4,6,7],[18,4,18,7],[20,4,20,7],[19,4,19,7],[21,4,21,7],[22,4,22,5],[22,6,22,7],[21,0,21,3],[27,0,27,1],[20,0,20,3],[25,0,25,2],[19,0,19,3],[31,10,32,10],[11,0,11,7],[6,1,6,3],[7,0,7,7],[8,0,8,7],[9,0,9,7],[10,0,10,7],[12,0,12,7],[13,0,13,7],[14,0,14,7],[15,0,15,7],[18,0,18,3],[16,3,17,7],[32,2,32,3],[28,2,28,3],[26,0,26,7]]}
["LOUISIANA MOTOR FUELS UNDERGROUND STORAGE TANK"]
["TRUST FUND REIMBURSEMENT APPLICATION"]
["PART 1"]
["SITE IDENTIFICATION"]
["FOR DEQ OFFICE USE ONLY         ",null,null,null,"DATE RECEIVED/DATE TO BE ENTERED ON EDMS"]
["TF No.",null,"Reviewer’s\nDue Date"]
["Reviewer Name"]
["APPLICATIONS WILL BE RETURNED/REJECTED FOR ANY OF THE FOLLOWING REASONS:"]
["1.  Proof of payment of the appropriate deductible is not provided."]
["2.  The application addresses invoices for a prior period of time (Ex.:  On 7/15/2011 an applicant submits an application "]
["     for 7/1/2009 - 9/30/2009 invoices, when an application for 10/1/2010 - 12/31/2010 invoices was previously submitted"]
["     on 1/15/2011). Note exception identified in B.1 below."]
["3.  Application is submitted with incorrect and/or insufficient documentation."]
["4.  Charges in the application exceed the cumulative Corrective Action Plan budget as approved by the Department."]
["     Applications shall be returned to the party receiving reimbursement for the reasons outlined in the MFTF"]
["     Guidance Document in section I.C.12.d.  "]
[null,null,null,{"$f":"IF(OR(A20=\"\",E20=\"\",A22=\"\",E22=\"\",A24=\"\",G24=\"\"),\"MISSING INFORMATION\",\"\")","v":"MISSING INFORMATION"}]
["A. SITE/OWNER INFORMATION"]
["Site Name – Current Name",null,null,null,"Name of Responsible Party as Identified in Part 2 - Affidavit"]
[]
["DEQ Issued \nAgency Interest No.",null,null,null,"DEQ Issued Owner Identification Number of Responsible Party"]
[]
["Site Street Address – Physical Address, Not P.O. Box",null,null,null,"City",null,"Parish"]
[]
[]
["B.  APPLICATION INFORMATION"]
["1.   This application includes ALL INVOICES to the owner (responsible party) dated from: [Check appropriate quarter(s)"]
["      and indicate year(s)]:",null,null,null,null,null,null,null,null,"Quarters","Fiscal Years"]
[null,null,null,null,null,null,null,null,null,false]
[]
[null,null,null,null,null,null,null,null,null,false]
[null,null,null,null,null,{"$f":"IF(OR(AND(E29=\"\",E31=\"\",E33=\"\",E35=\"\"),OR(AND(E29>0,J29=FALSE),AND(E29=\"\",J29=TRUE),AND(E31>0,J31=FALSE),AND(E31=\"\",J31=TRUE),AND(E33>0,J33=FALSE),AND(E33=\"\",J33=TRUE),AND(E35>0,J35=FALSE),AND(E35=\"\",J35=TRUE))),\"MISSING INFORMATION\",IF(OR(AND(AND(E29>0,E31>0),E31-E29<>0),AND(AND(E29>0,E33>0),E33-E29<>1),AND(AND(E31>0,E33>0),E33-E31<>1),AND(AND(E29>0,E35>0),E35-E29<>1),AND(AND(E31>0,E35>0),E35-E31<>1),AND(AND(E33>0,E35>0),E35-E33<>0)),\"APP CROSSES FISCAL YEARS\",\"\"))","v":"MISSING INFORMATION"},null,null,null,null,{"$f":"IF(F32=\"APP CROSSES FISCAL YEARS\", TRUE,FALSE)","v":false}]
[null,null,null,null,null,null,null,null,null,false]
[]
[null,null,null,null,null,null,null,null,null,false]
[]
["Application requests must include all invoices dated during at least one calendar quarter:  July through September, October through December, January through March, or"]
["April through June.  A single application may include invoices which cover more than one calendar quarter, provided the application includes all invoice for the entire"]
["calendar quarter or quarters.  However, all multiple calendar quarter invoices must be dated within a single state fiscal year, July 1 - June 30. Once an application is submitted"]
["to DEQ, invoices for the period submitted or any prior periods WILL NOT be accepted.  Overlapping \"Work Performed\" dates in subsequent applications is not permitted."]
["When the RAC for a site changes during a quarter, two separate applications addressing each RAC's work should be submitted."]
[]
["2.     Application Grand Total (Reflecting the eligible pre-approved costs shown on Part 5 of this application) :",null,null,null,null,null,null,{"$f":"'Part 5'!A3","v":0}]
["3.     If applicable, indicate the following:",null,null,null,null,null,{"$f":"IF(J45<>'Part 3'!O17,\"FIRST APPLICATION INIDICATION BOXES ON PART 1 AND PART 3 DO NOT MATCH\",\"\")","v":""},null,null,"First App?"]
[null,null,null,null,null,null,null,null,null,false]
[null,null,null,null,null,null,null,null,null,false]
["(Any application submitted to the Trust Fund Management Section for work performed on or after July 1, 2017 must be submitted on this form.)"]

{"sheet":"Part 1 Cont'd","index":1,"n_rows":40,"n_cols":7,"rows_kept":40,"cut":false,"hidden":false,"merged":[[0,0,0,7],[2,0,2,1],[4,0,4,1],[36,5,36,7],[4,2,4,5],[5,0,5,1],[8,0,8,1],[9,0,9,1],[10,0,10,1],[5,2,5,5],[8,2,8,5],[9,2,9,5],[34,0,34,2],[23,0,23,1],[26,0,26,7],[25,0,25,1],[23,6,23,7],[28,0,28,7],[18,2,18,5],[19,2,19,5],[20,2,20,5],[21,2,21,5],[22,2,22,5],[23,2,23,5],[18,0,18,1],[19,0,19,1],[20,0,20,1],[21,0,21,1],[22,0,22,1],[27,0,27,7],[20,6,20,7],[21,6,21,7],[32,0,32,7],[29,0,29,7],[30,0,30,7],[31,0,31,7],[39,1,39,2],[35,0,35,2],[36,1,36,2],[37,1,37,2],[38,3,39,7],[36,3,36,4],[33,0,33,7],[34,5,35,7],[34,3,35,4],[38,1,38,2],[2,2,2,7],[4,6,4,7],[5,6,5,7],[8,6,8,7],[9,6,9,7],[3,0,3,7],[6,0,6,1],[6,2,6,5],[6,6,6,7],[10,2,10,5],[14,0,14,7],[10,6,10,7],[15,2,15,3],[7,0,7,1],[7,2,7,5],[7,6,7,7],[15,4,15,5],[22,6,22,7],[13,0,13,7],[17,2,17,5],[17,0,17,1],[18,6,18,7],[19,6,19,7],[17,6,17,7]]}
["PART 1 (cont’d)"]
[]
["C. RELEASE INFORMATION",null,{"$f":"IF(AND(A6=\"\",A7=\"\",A8=\"\",A9=\"\",A10=\"\",A11=\"\"),\"MISSING INFORMATION\",\"\")","v":"MISSING INFORMATION"}]
[]
["Incident No(s).",null,"Date Released",null,null,null,"Substance(s) Released"]
[]
[]
[]
[]
[]
[]
[]
[]
["D. CORRECTIVE ACTION PLAN AND ADDENDUMS"]
[]
["CAP Submittal Date    ",null,"DEQ Approval Date ",null,null,null,"Approved Cost"]
[]
["Addendum Submittal Date",null,"DEQ Approval Date",null,null,null,"Approved Cost"]
[]
[]
[]
[]
[]
[]
[]
["I certify the following:"]
[" • I have reviewed the time sheets and the personnel charges and verify that they are in line with the duties indicated "]
["    in the UST Trust Fund Cost Control Guidance Document in effect at the time the work was performed;"]
[" • the rates identified in this application are in accordance with the response action contractor equipment rate sheet;"]
[" • the travel charges contained in this application are based on the mileage logs which indicate the person traveling, "]
["    distance traveled and beginning/ending odometer readings;"]
[" • I personally examined and am familiar with the information submitted with this application, and that I "]
["    believe that the submitted information is true, accurate and complete.   "]
[]
["Preparer’s Certification (Original Signature Required)                 ",null,null,"Date Signed"]
[{"$f":"IF(OR(AND(A6=\"\",A7=\"\",A8=\"\",A9=\"\",A10=\"\",A11=\"\"),OR(B37=\"\",F37=\"\",B38=\"\",B40=\"\",D39=\"\")),\"MISSING INFORMATION\",\"\")","v":"MISSING INFORMATION"}]
["Preparer’s Name",null,null,"Firm Name"]
["Telephone Number",null,null,"Mailing Address"]
["Telefax Number"]
["Email Address"]

{"sheet":"Part 2","index":2,"n_rows":50,"n_cols":14,"rows_kept":50,"cut":false,"hidden":false,"merged":[[43,10,43,11],[27,0,27,1],[31,0,31,11],[27,5,27,7],[36,8,36,11],[29,8,29,11],[29,0,29,7],[35,4,35,7],[35,0,35,3],[32,0,32,11],[33,0,33,11],[30,0,30,7],[30,8,30,11],[34,0,34,11],[28,4,28,11],[27,8,27,11],[49,1,49,6],[49,9,49,11],[35,8,35,10],[47,8,47,11],[39,0,39,11],[38,0,38,11],[43,0,43,5],[44,0,44,7],[46,0,46,5],[47,0,47,7],[46,8,46,11],[41,10,41,11],[41,5,41,6],[36,0,36,7],[37,0,37,7],[37,8,37,10],[15,0,15,11],[14,0,14,11],[13,0,13,11],[16,0,16,11],[23,9,23,11],[17,0,17,11],[19,0,19,11],[20,8,20,11],[21,8,21,11],[20,0,20,7],[18,0,18,11],[22,0,22,7],[21,0,21,7],[22,8,22,11],[23,0,23,7],[11,0,11,11],[10,0,10,11],[9,0,9,11],[8,0,8,11],[7,0,7,11],[0,0,0,11],[1,0,1,11],[5,0,5,11],[4,0,4,11],[3,0,3,11],[26,8,26,11],[27,2,27,3],[24,0,24,2],[24,3,24,5],[25,3,25,5],[25,0,25,2],[25,8,25,10],[24,8,24,10],[41,0,41,4],[28,0,28,3],[24,6,24,7],[25,6,25,7],[26,0,26,7]]}
["PART 2"]
["OWNER, OPERATOR, OR RESPONSIBLE PARTY CERTIFICATION AFFIDAVIT"]
[]
["         I certify that I have researched and determined that I have no assistance from private sources, such as"]
["insurance or other means of financial assurance, to pay for investigation or remediation costs at this site. I also"]
["certify that all oustanding financial obligations integral to this site investigation/remediation have been met."]
[]
["         I certify that this program task has been completed in accordance with La. R.S. 30:2194 et seq and"]
["La R.S. 30:2195 et seq. I have reviewed and certify that all data and documentation represented on invoices listed in"]
["section D are a true and correct representation of costs actually incurred as an integral part of site rehabilitation from"]
["motor fuel contamination and that reimbursement from the Motor Fuels Underground Storage Tank Trust Fund has"]
["not been received on any of the charges identified in this application."]
[]
["        The site owner, operator, or responsible party warrants that he has not received any fee, commission,"]
["percentage, gift, or other  consideration as a result of his employment of a person, company, corporation,"]
["individual, or firm for purposes of conducting the site assessment or rehabilitation."]
["If charges within this application are being applied toward the deductible(s), the following statement must be certified by checking the box below: "]
["       I also certify that I have paid the appropriate deductible integral to this site rehabilitation program and that proof of payment of the"]
["deductible [canceled checks and a list of corresponding invoices or Proof of Payment of Deductible Affidavit (Part 2A)] is attached."]
[]
["A. Site Owner, Operator, Responsible Party",null,null,null,null,null,null,null,"  I. Site Name"]
[{"$f":"IF('Part 1'!E20=\"\",\"\",'Part 1'!E20)","v":""},null,null,null,null,null,null,null,{"$f":"IF('Part 1'!A20>0,'Part 1'!A20,\"\")","v":""}]
["B. Mailing Address                                                                           ",null,null,null,null,null,null,null,"  J. Site Address"]
[null,null,null,null,null,null,null,null,"Physical Address:",{"$f":"IF('Part 1'!A24>0,'Part 1'!A24,\"\")","v":""}]
["City",null,null,"State",null,null,"Zip",null,"City",null,null,"Parish"]
[null,null,null,null,null,null,null,null,{"$f":"IF('Part 1'!E24>0,'Part 1'!E24,\"\")","v":""},null,null,{"$f":"IF('Part 1'!G24>0,'Part 1'!G24,\"\")","v":""}]
["C. Telephone/Telefax Numbers  ",null,null,null,null,null,null,null,"K. Agency Interest Number"]
["Telephone: ",null,null,null,"Telefax:",null,null,null,{"$f":"IF('Part 1'!A22>0,'Part 1'!A22,\"\")","v":""}]
["D.   RAC/Owner Invoice Nos.",null,null,null,{"$f":"CONCATENATE('Part 6'!R11,'Part 6'!R12,'Part 6'!R13,'Part 6'!R14,'Part 6'!R15,'Part 6'!R16,'Part 6'!R17,'Part 6'!R18,'Part 6'!R19,'Part 6'!R20,'Part 6'!R21,'Part 6'!R22,'Part 6'!R23,'Part 6'!R24,'Part 6'!R25,'Part 6'!R26,'Part 6'!R27,'Part 6'!R28,'Part 6'!R29,'Part 6'!R30,)","v":""}]
["E. Signature of person designated to sign for the owner, operator, or responsible party",null,null,null,null,null,null,null," L. Federal Tax ID# if applicable\n      (SSN not applicable)"]
[]
["F. Check the appropriate box below.  The contract for work addressed in this application was signed:"]
["        Before August 1, 1995, the owner/operator/responsible party receives reimbursement.",null,null,null,null,null,null,null,null,null,null,null,null,false]
["       On or after August 1, 1995, and as required by Act 336 of the 1995 Regular Session, the RAC receives reimbursement",null,null,null,null,null,null,null,null,null,null,null,null,false]
["G. Invoices to the owner (responsible party) addressed in this application are dated for the following quarters:  [Check appropriate quarter(s) and indicate year(s)] "]
["      July 1,          -Sept 30,          .",null,null,null,"       Oct. 1,           -Dec. 31,            .",null,null,null,"      Jan 1,           - Mar 31,           .",null,null,"      Apr 1,          - June 30,            ."]
["H. Program Grand Task Total Addressed in Part 1, Part 3 and Part 5:",null,null,null,null,null,null,null,{"$f":"'Part 5'!A3","v":0}]
["       Before me, the undersigned notary public, came and appeared ",null,null,null,null,null,null,null,null,null,null,"(please print or type the name"]
["shown in E above), who, being known to me, did execute the foregoing certification affidavit in my presence, who, being duly sworn,"]
["did state under oath or affirmation that he/she executed said document for the purpose expressed therein."]
[]
["WITNESS my hand and official seal, this",null,null,null,null,null,null,"day of,",null,","]
[]
[null,null,null,null,null,null,null,null,"My commission expires"]
["Notary Public (Signature)"]
[]
[]
["Notary Public Name (Printed, typed, or stamped)",null,null,null,null,null,null,null,"Notary # or Bar Roll #( if a Louisiana notary)"]
[]
["State of",null,null,null,null,null,null,null,"County or Parish of "]

{"sheet":"Part2A Deductible","index":3,"n_rows":42,"n_cols":14,"rows_kept":42,"cut":false,"hidden":false,"merged":[[24,0,24,1],[28,4,28,8],[24,2,24,4],[29,0,29,10],[30,0,30,10],[25,9,25,10],[28,9,28,10],[15,0,15,1],[14,0,14,1],[16,0,16,1],[17,0,17,1],[32,0,32,2],[25,0,25,8],[26,0,27,10],[18,0,18,1],[20,2,20,4],[18,2,18,4],[19,0,19,1],[20,0,20,1],[21,0,21,1],[22,0,22,1],[32,6,32,8],[32,3,32,4],[16,9,16,10],[17,9,17,10],[14,2,15,4],[17,2,17,4],[16,2,16,4],[16,5,16,8],[17,5,17,8],[23,5,23,8],[23,2,23,4],[18,9,18,10],[19,9,19,10],[18,5,18,8],[20,9,20,10],[19,5,19,8],[10,0,10,10],[12,9,12,10],[39,8,39,10],[39,1,39,3],[34,6,34,9],[39,6,39,7],[36,6,36,10],[37,6,37,10],[35,0,35,10],[34,0,34,4],[36,0,36,4],[37,0,37,4],[23,9,23,10],[24,9,24,10],[23,0,23,1],[24,5,24,8],[0,0,0,10],[1,0,1,10],[2,0,2,10],[4,0,4,10],[9,0,9,10],[5,6,5,10],[5,2,5,5],[6,0,6,10],[8,0,8,10],[11,0,11,10],[12,0,12,4],[22,5,22,8],[21,5,21,8],[21,9,21,10],[22,9,22,10],[22,2,22,4],[21,2,21,4],[19,2,19,4],[20,5,20,8],[12,5,12,8],[13,5,13,8],[14,5,15,8],[13,0,13,4],[13,9,13,10],[14,9,15,10]]}
["PART 2.A"]
["PROOF OF PAYMENT OF DEDUCTIBLE AFFIDAVIT"]
["(To be completed by Response Action Contractor)"]
[]
["I,                                            (signature of principal or his designee for the response action contractor) certify"]
["that payments were made to",null,null,null,null,null," (name of response action contractor) in the"]
["amounts specified below, which were integral to the investigation/remediation of the below specified site."]
[]
["A. Name of Site"]
[{"$f":"IF('Part 1'!A20>0,'Part 1'!A20,\"\")","v":""}]
["B. Site Address (Physical address, city)"]
[{"$f":"IF('Part 1'!A24>0,'Part 1'!A24&\"  \"&'Part 1'!E24,\"\")","v":""}]
["C. Parish",null,null,null,null,"D.  Site AI No.",null,null,null,"E. Incident #"]
[{"$f":"IF('Part 1'!G24>0,'Part 1'!G24,\"\")","v":""},null,null,null,null,{"$f":"IF('Part 1'!A22>0,'Part 1'!A22,\"\")","v":""}]
["Invoice No",null,"Date of Payment Received",null,null,"Check No.",null,null,null,"Amount"]
["(As contained in application)",null,null,null,null,null,null,null,null,null,null,null,null,{"$f":"IF(J26>0,1,0)","v":0}]
[]
[]
[]
[]
[]
[]
[]
[]
[]
["Total Deductible Amount Addressed in Affidavit",null,null,null,null,null,null,null,null,{"$f":"SUM(J17:K25)","v":0}]
[{"$f":"IF(OR(C6=\"\",J14=\"\",AND(OR(A17=\"\",C17=\"\",F17=\"\",J17=\"\"),OR(A18=\"\",C18=\"\",F18=\"\",J18=\"\"),OR(A19=\"\",C19=\"\",F19=\"\",J19=\"\"),OR(A20=\"\",C20=\"\",F20=\"\",J20=\"\"),OR(A21=\"\",C21=\"\",F21=\"\",J21=\"\"),OR(A22=\"\",C22=\"\",F22=\"\",J22=\"\"),OR(A23=\"\",C23=\"\",F23=\"\",J23=\"\"),OR(A24=\"\",C24=\"\",F24=\"\",J24=\"\"),OR(A25=\"\",C25=\"\",F25=\"\",J25=\"\"))),\"MISSING INFORMATION\",\"\")","v":"MISSING INFORMATION"}]
[]
["Before me, the undersigned notary public, came and appeared",null,null,null,null,null,null,null,null,"(please print or type the name"]
["shown in first Paragraph), who, being known to me, did execute the foregoing certification affidavit in my presence, and who, being"]
["duly sworn, did state under oath or affirmation that he/she executed said document for the purpose expressed therein."]
[]
["WITNESS my hand and official seal, this",null,null,null,null,"day of,",null,null,null,","]
[]
[null,null,null,null,null,null,"My commission expires"]
["Notary Public (Signature)"]
[]
["Notary Public Name (Printed, typed, or stamped)",null,null,null,null,null,"Notary # or Bar Roll #( if a Louisiana notary)"]
[]
["State of",null,null,null,null,null,"County or Parish of"]
[]
[null,null,null,null,null,null,null," "]

{"sheet":"Part 3","index":4,"n_rows":49,"n_cols":20,"rows_kept":49,"cut":false,"hidden":false,"merged":[[19,0,19,5],[26,0,26,5],[34,0,34,2],[23,2,23,4],[25,0,25,5],[29,0,29,5],[30,0,30,12],[31,0,31,12],[32,0,32,12],[33,0,33,12],[34,6,34,10],[29,6,29,12],[20,0,20,5],[20,6,20,12],[21,0,21,5],[21,6,21,12],[22,0,22,5],[27,6,28,12],[25,6,25,12],[26,6,26,12],[23,0,23,1],[22,8,22,12],[22,6,22,7],[15,0,15,12],[16,0,16,12],[17,0,17,12],[18,0,18,5],[18,6,18,12],[48,1,48,4],[48,6,48,8],[48,9,48,12],[7,0,7,12],[0,0,0,12],[1,0,1,12],[3,0,3,12],[4,0,4,12],[5,0,5,12],[6,0,6,12],[8,0,8,12],[10,0,10,12],[11,0,11,12],[12,0,12,12],[13,0,13,12],[14,0,14,12],[45,6,45,12],[46,6,46,12],[46,0,46,5],[45,0,45,4],[35,6,35,12],[35,0,35,5],[43,0,43,5],[37,0,37,12],[38,0,38,12],[42,0,42,4],[36,0,36,5],[36,6,36,10],[42,6,42,9],[42,10,42,12],[34,11,34,12],[40,4,40,5],[40,7,40,10],[36,11,36,12],[24,0,24,1],[34,3,34,5],[24,2,24,4],[40,0,40,3],[27,0,28,5],[23,6,24,7],[23,8,24,12]]}
["PART 3"]
["RESPONSE ACTION CONTRACTOR CERTIFICATION AFFIDAVIT"]
[]
["        I certify that this program task has been completed in accordance with La. R.S. 30:2194 et seq and La. R.S. 30:2195 et seq."]
[" I have reviewed and certify that all data and documentation submitted as part of this reimbursement application are a true and"]
["correct representation of costs actually incurred as an integral part of site rehabilitation from motor fuel contamination. I also"]
["certify that  reimbursement from the Motor Fuels Underground Storage Tank Trust Fund has not been received on any of the "]
["charges identified in this application.  I agree to reimburse the owner, operator, or the responsible party of the referenced site"]
[" any monies due to him upon reimbursement from the Motor Fuels Underground Storage Tank Trust Fund."]
[]
["      The person responsible for conducting site rehabilitation warrants that he/she has not received any fee, commission,"]
[" percentage, gift, or other consideration as a result of his employment of a person, company, corporation, individual, firm, or "]
["other legal entity for purposes of conducting the site assessment or rehabilitation.  Copies of mileage logs, detailed timesheets"]
[" and RAC equipment rental rates sheets will be maintained for a period of four years following reimbursement for auditing"]
[" purposes and will be readily available upon request by the DEQ or a DEQ contractor."]
["If charges within this application are being applied toward the deductible(s), the following statement must be certified by checking the box below: "]
["       I certify that I have received payment for the appropriate deductible integral to the assessment/remediation of this site.",null,null,null,null,null,null,null,null,null,null,null,null,null,false]
[{"$f":"IF(O17<>'Part 1'!J45,\"FIRST APPLICATION INIDICATION BOXES ON PART 1 AND PART 3 DO NOT MATCH\",\"\")","v":""}]
["A.    Name principal/president of the company responsible for",null,null,null,null,null," H. Company Name"]
["       conducting the site assessment/rehabilitation"]
[]
["B. Mailing Address                                                                           ",null,null,null,null,null," I.  Response Action Contractor Telephone/Telefax Numbers"]
[null,null,null,null,null,null,"Telephone:"]
["City: ",null,"State:",null,null,"Zip: ","Telefax:"]
[]
["C.  Facility Name",null,null,null,null,null,"J.  Agency Interest Number",null,null,null,null,null,null,null,null,null,null,null,null,"  "]
[{"$f":"IF('Part 1'!A20>0,'Part 1'!A20,\"\")","v":""},null,null,null,null,null,{"$f":"IF('Part 1'!A22>0,'Part 1'!A22,\"\")","v":""}]
["D. Signature of the principal/president of the company or his  designee responsible for conducting site assessment/rehabilitation",null,null,null,null,null,"  K.  Federal Tax ID# if applicable"]
[]
[{"$f":"IF(OR(A18<>\"\",A21=\"\",G21=\"\",A23=\"\",I23=\"\",A25=\"\",A27=\"\",G27=\"\",C25=\"\",F25=\"\",AND(O32=FALSE,O33=FALSE),AND(O35=FALSE,P35=FALSE,Q35=FALSE,R35=FALSE),G36=0),\"MISSING INFORMATION\",\"\")","v":"MISSING INFORMATION"}]
["E. Check appropriate box below.  The contract for work addressed in this application was signed:"]
["        Before August 1, 1995, the owner/operator/responsible party receives reimbursement.",null,null,null,null,null,null,null,null,null,null,null,null,null,false]
["       On or after August 1, 1995, and as required by Act 336 of the 1995 Regular Session, the RAC receives reimbursement",null,null,null,null,null,null,null,null,null,null,null,null,null,false]
["F. Invoices to the owner (responsible party) addressed in this application are dated for the following quarters:  [Check appropriate quarter(s) and indicate year(s)]"]
["      July 1,          - Sept 30,            .",null,null,"      Oct. 1,          - Dec. 31,           .",null,null,"     Jan 1,            - Mar 31,             .",null,null,null,null,"     Apr 1,         - June 30,         .",null,null,{"$f":"'Part 1'!J29","v":false},{"$f":"'Part 1'!J31","v":false},{"$f":"'Part 1'!J33","v":false},{"$f":"'Part 1'!J35","v":false}]
["G. Program Grand Task Total Addressed in Part 1, Part 2 and Part 5:",null,null,null,null,null,{"$f":"'Part 5'!A3","v":0}]
["      Before me, the undersigned notary public, came and appeared",null,null,null,null,null,null,null,null,null,null,"(please print or type the name"]
["shown in D above), who, being known to me, did execute the foregoing certification affidavit in my presence, who, being duly sworn,"]
["did state under oath or affirmation that he/she executed said document for the purpose expressed therein."]
[]
["WITNESS my hand and official seal, this",null,null,null,null,null,"day of,",null,null,null,null,","]
[]
[null,null,null,null,null,null,"My commission expires "]
["Notary Public (Signature)"]
[]
[]
["Notary Public Name (Printed, Typed, or Stamped)",null,null,null,null,null,"                Notary # or Bar Roll #( if a Louisiana notary)"]
[]
["State of",null,null,null,null,null,"County or Parish of"]

{"sheet":"Part 5","index":5,"n_rows":29,"n_cols":20,"rows_kept":29,"cut":false,"hidden":false,"merged":[[16,0,16,3],[16,4,16,8],[27,10,28,11],[27,4,28,5],[27,0,28,1],[27,2,28,3],[27,6,28,9],[27,15,28,16],[11,0,11,1],[12,0,12,1],[13,0,13,1],[13,7,13,9],[25,1,25,5],[14,0,15,3],[13,3,13,4],[14,4,14,5],[14,6,14,8],[15,6,15,8],[15,4,15,5],[22,4,22,5],[23,4,23,5],[24,4,24,5],[20,9,20,10],[21,9,21,10],[5,2,6,2],[2,5,2,9],[4,3,4,4],[4,5,4,6],[11,7,11,9],[10,7,10,9],[9,7,9,9],[8,7,8,9],[12,7,12,9],[5,5,6,6],[12,3,12,4],[11,3,11,4],[10,3,10,4],[9,3,9,4],[8,3,8,4],[7,5,7,6],[8,5,8,6],[12,5,12,6],[7,7,7,9],[3,3,3,4],[3,5,3,6],[7,3,7,4],[3,14,3,15],[3,12,3,13],[7,12,7,13],[8,12,8,13],[9,12,9,13],[10,12,10,13],[11,12,11,13],[12,12,12,13],[7,14,7,15],[8,14,8,15],[9,14,9,15],[10,14,10,15],[11,14,11,15],[12,14,12,15],[0,0,0,19],[1,8,1,11],[2,10,2,11],[2,16,2,19],[5,0,5,1],[5,11,6,11],[5,10,6,10],[2,2,2,4],[6,0,6,1],[4,7,4,9],[1,0,1,1],[1,3,1,7],[3,18,3,19],[3,16,3,17],[4,16,4,17],[5,16,6,17],[2,12,2,15],[1,12,1,19],[5,14,6,15],[5,12,6,13],[5,7,6,9],[5,3,6,4],[4,12,4,13],[4,14,4,15],[8,0,8,1],[7,0,7,1],[4,0,4,1],[3,7,3,9],[17,0,17,19],[18,0,18,5],[19,4,19,5],[9,0,9,1],[10,0,10,1],[13,16,13,17],[13,18,13,19],[13,12,13,13],[9,5,9,6],[10,5,10,6],[11,5,11,6],[18,6,19,11],[13,5,13,6],[14,9,14,19],[2,0,3,1],[12,16,12,17],[11,16,11,17],[10,16,10,17],[9,16,9,17],[8,16,8,17],[13,14,13,15],[20,6,23,8],[28,17,28,18],[18,12,19,14],[20,12,20,14],[24,12,24,14],[23,12,23,14],[22,12,22,14],[21,12,21,14],[27,12,28,14],[15,12,15,13],[15,9,15,11],[16,12,16,13],[16,9,16,11],[15,18,15,19],[15,14,15,17],[16,18,16,19],[16,14,16,17],[25,6,26,11],[25,12,26,14],[18,15,26,19],[26,1,26,5],[27,17,27,18],[20,4,20,5],[21,4,21,5],[19,2,19,3],[19,0,19,1],[20,0,20,1],[21,0,21,1],[22,0,22,1],[23,0,23,1],[24,0,24,1],[20,2,20,3],[21,2,21,3],[22,2,22,3],[23,2,23,3],[24,2,24,3],[22,9,22,10],[23,9,23,10],[24,6,24,11],[7,16,7,17],[4,18,4,19],[7,18,7,19],[8,18,8,19],[9,18,9,19],[10,18,10,19],[11,18,11,19],[12,18,12,19],[5,18,6,19]]}
["PART 5 – EVENT SUMMARY SHEET"]
["APPLICATION GRAND TOTAL  ",null,"AIN:",{"$f":"IF('Part 1'!A22>0,'Part 1'!A22,\"\")","v":""},null,null,null,null,"RAC Name:",null,null,null,{"$f":"IF('Part 3'!G21>0,'Part 3'!G21,\" \")","v":" "}]
[{"$f":"SUM(C14,F14,K14,M14,Q14,)","v":0},null,"1. Emergency/Intital Work",null,null,"2. Investigation Work\n(Field Work)",null,null,null,null,"3.  Interim Monitoring Work",null,"4.  Corrective \nAction Plan Work",null,null,null,"5.  Report \nPreparation Work"]
[null,null,"Charges","DEQ Adjusted Charges",null,"Charges",null,"DEQ Adjusted Charges",null,null,"Charges","DEQ Adjusted Charges","Charges",null,"DEQ Adjusted Charges",null,"Charges",null,"DEQ Adjusted Charges"]
["A.  Personnel",null,{"$f":"'Personnel Sheet'!M11","v":0},null,null,{"$f":"'Personnel Sheet'!M12","v":0},null,null,null,null,{"$f":"'Personnel Sheet'!M13","v":0},null,{"$f":"'Personnel Sheet'!M14","v":0},null,null,null,{"$f":"'Personnel Sheet'!M15","v":0}]
["B.  Soil/Water",null,{"$f":"'Soil-Water Disposal'!N17","v":0},null,null,{"$f":"'Soil-Water Disposal'!N18","v":0},null,null,null,null,{"$f":"'Soil-Water Disposal'!N19","v":0},null,{"$f":"'Soil-Water Disposal'!N20","v":0}]
["     Disposal"]
["C.  Equipment",null,{"$f":"'Equipment Rent - Purchase'!O16","v":0},null,null,{"$f":"'Equipment Rent - Purchase'!O17","v":0},null,null,null,null,{"$f":"'Equipment Rent - Purchase'!O18","v":0},null,{"$f":"'Equipment Rent - Purchase'!O19","v":0}]
["D.  Travel",null,{"$f":"Travel!N3","v":0},null,null,{"$f":"Travel!N4","v":0},null,null,null,null,{"$f":"Travel!N5","v":0},null,{"$f":"Travel!N6","v":0},null,null,null,{"$f":"Travel!N7","v":0}]
["E. Transportation",null,{"$f":"'Transportation&Shipping'!J13","v":0},null,null,{"$f":"'Transportation&Shipping'!J14","v":0},null,null,null,null,{"$f":"'Transportation&Shipping'!J15","v":0},null,{"$f":"'Transportation&Shipping'!J16","v":0}]
["F.  Drilling & \n     P & A",null,{"$f":"'Drilling-P&A'!O19","v":0},null,null,{"$f":"'Drilling-P&A'!O20","v":0},null,null,null,null,{"$f":"'Drilling-P&A'!O21","v":0},null,{"$f":"'Drilling-P&A'!O22","v":0}]
["G.  Analysis",null,{"$f":"Analysis!M14","v":0},null,null,{"$f":"Analysis!M15","v":0},null,null,null,null,{"$f":"Analysis!M16","v":0},null,{"$f":"Analysis!M17","v":0}]
["H.  Miscellaneous ",null,{"$f":"'Miscellaneous 3'!K2","v":0},null,null,{"$f":"'Miscellaneous 3'!K3","v":0},null,null,null,null,{"$f":"'Miscellaneous 3'!K4","v":0},null,{"$f":"'Miscellaneous 3'!K5","v":0},null,null,null,{"$f":"'Miscellaneous 4'!L7","v":0}]
["Subtotals",null,{"$f":"SUM(C5:C13)","v":0},null,null,{"$f":"SUM(F5:G13)","v":0},null,null,null,null,{"$f":"SUM(K5:K13)","v":0},null,{"$f":"SUM(M5:N13)","v":0},null,null,null,{"$f":"SUM(Q5:R13)","v":0}]
[{"$f":"IF(OR(E16=\"\",G16=\"\"),\"6. Dates work performed in application: MISSING INFORMATION\",\"6. Dates work performed in application:\")","v":"6. Dates work performed in application: MISSING INFORMATION"},null,null,null,"Beginning",null,"Ending",null,null,"7. Application addresses invoices to the owner dated:   (Select quarter by entering year)"]
[null,null,null,null,null,null,null,null,null,"July 1 – September 30",null,null,{"$f":"IF('Part 1'!E29>0,'Part 1'!E29,\"\")","v":""},null,"January 1 – March 31",null,null,null,{"$f":"IF('Part 1'!E33>0,'Part 1'!E33,\"\")","v":""}]
["8.        DEQ Fiscal Year (July - June)",null,null,null,{"$f":"IF((IF(AND(M16>0,M17>0,S16>0,S17>0),(MAX(IF(M16=\"\",0,M16+1),IF(M17=\"\",,M17+1),S16,S17)),\"\"))=0,\"\",(IF(AND(M16>0,M17>0,S16>0,S17>0),(MAX(IF(M16=\"\",0,M16+1),IF(M17=\"\",,M17+1),S16,S17)),\"\")))","v":""},null,null,null,null,"October 1 – December 31",null,null,{"$f":"IF('Part 1'!E31>0,'Part 1'!E31,\"\")","v":""},null,"April 1 - June 30",null,null,null,{"$f":"IF('Part 1'!E35>0,'Part 1'!E35,\"\")","v":""}]
["The area below is for DEQ Trust Fund use only:"]
["Incident Information:",null,null,null,null,null,"Total Adjusted Charges $",null,null,null,null,null,null,null,null,"DEQ Comments, Notations for\nDeductibles , Treatment Units, & Last Applications"]
["Incident No.",null,"Release Date",null,"Substance"]
[null,null,null,null,null,null,"LDEQ Adjustments",null,null,"Trust Fund No.",null,"CAP  Amount"]
[]
[]
[]
[null,null,null,null,null,null,"Deductible Amount ($)"]
["Reviewer Name",null,null,null,null,null,"LDEQ  Reimbursement $",null,null,null,null,null,{"$f":"IF('Part 1'!J24=TRUE,\"X\",\"\")","v":""}]
["Trust Fund Number"]
["ICAP Charges $",null,null,null,"ICAP Balance $",null,null,null,null,null,"(ROG Aprvd.) CAP Balance $",null,null,null,null,"Payment To:",null,"RAC",null,{"$f":"IF('Part 2'!N34=TRUE,\"X\",\"\")","v":""}]
[null,null,null,null,null,null,null,null,null,null,null,null,null,null,null,null,null,"Owner",null,{"$f":"IF('Part 2'!N33=TRUE,\"X\",\"\")","v":""}]

{"sheet":"Personnel Sheet","index":6,"n_rows":184,"n_cols":15,"rows_kept":184,"cut":false,"hidden":false,"merged":[[144,0,144,6],[145,0,145,6],[107,0,107,6],[108,0,108,6],[70,0,70,6],[71,0,71,6],[33,0,33,6],[34,0,34,6],[179,0,179,4],[179,5,179,6],[148,0,148,6],[149,0,149,6],[150,0,150,6],[151,0,151,6],[152,0,152,6],[142,0,142,4],[142,5,142,6],[143,0,143,4],[143,5,143,6],[146,0,146,3],[116,0,116,4],[117,0,117,6],[118,0,118,6],[119,1,120,1],[183,0,183,3],[153,0,153,4],[154,0,154,6],[155,0,155,6],[156,1,157,1],[156,2,157,2],[156,3,157,3],[156,4,157,4],[156,5,157,5],[156,6,157,6],[181,0,181,6],[182,0,182,6],[180,0,180,4],[180,5,180,6],[119,2,120,2],[119,3,120,3],[119,4,120,4],[119,5,120,5],[119,6,120,6],[111,0,111,6],[112,0,112,6],[113,0,113,6],[114,0,114,6],[115,0,115,6],[105,0,105,4],[105,5,105,6],[106,0,106,4],[106,5,106,6],[109,0,109,3],[79,0,79,4],[80,0,80,6],[81,0,81,6],[82,1,83,1],[82,2,83,2],[82,3,83,3],[82,4,83,4],[82,5,83,5],[82,6,83,6],[74,0,74,6],[75,0,75,6],[76,0,76,6],[77,0,77,6],[78,0,78,6],[68,0,68,4],[68,5,68,6],[69,0,69,4],[69,5,69,6],[72,0,72,3],[44,0,44,6],[45,1,46,1],[45,2,46,2],[45,3,46,3],[45,4,46,4],[45,5,46,5],[45,6,46,6],[39,0,39,6],[40,0,40,6],[41,0,41,6],[42,0,42,4],[43,0,43,6],[8,5,9,5],[8,6,9,6],[6,0,6,6],[37,0,37,6],[38,0,38,6],[35,0,35,3],[5,0,5,4],[7,0,7,6],[0,0,0,6],[1,0,1,6],[32,0,32,4],[31,5,31,6],[32,5,32,6],[2,0,2,6],[4,0,4,6],[31,0,31,4],[8,1,9,1],[8,2,9,2],[8,3,9,3],[8,4,9,4],[3,0,3,6]]}
["PART 5.A"]
["PERSONNEL SUPPLEMENTARY SHEET"]
["Check Event:"]
[]
["1.        Rates shown on this form cannot be adjusted higher."]
["2.        (Rate) X (No. Hrs.) = Total"]
["3.        Personnel charges for work activities included in unit pricing should not be addressed on this form"]
["4.        For work performed prior to 7/1/2017, use the appropriate Trust Fund Guidance Document Rates."]
["PERSONNEL","EMPLOYEE NAME","RATE","WORK PERFORMED\nDATE,  LOCATION (field or office) and DESCRIPTION","INVOICE       NO.","No.     HRS","TOTAL"]
["DUTIES",null,null,null,null,null,null,null,null,null,"Total",null,"Sheet Total"]
["**PRINCIPAL",null,130,null,null,null,{"$f":"ROUND((C11*F11),2)","v":0},null,"Emergency/Initial Work   ",false,{"$f":"IF(J11=TRUE,$F$32,\"\")","v":""},"Emergency/Initial Work   ",{"$f":"SUM(K11,K48,K85,K122,K160)","v":0}]
["*SENIOR   TOXICOLOGIST",null,104,null,null,null,{"$f":"ROUND((C12*F12),2)","v":0},null,"Investigation Work      ",true,{"$f":"IF(J12=TRUE,$F$32,\"\")","v":0},"Investigation Work      ",{"$f":"SUM(K12,K49,K86,K123,K161)","v":0}]
["*SENIOR ENGINEER",null,104,null,null,null,0,null,"Monitoring/Interim Work        ",false,"","Monitoring/Interim Work        ",{"$f":"SUM(K13,K50,K87,K124,K162)","v":0}]
["*SENIOR GEOLOGIST",null,104,null,null,null,0,null,"Corrective Action Plan Work",false,"","Corrective Action Plan Work",{"$f":"SUM(K14,K51,K88,K125,K163)","v":0}]
["*PROJECT MANAGER",null,104,null,null,null,0,null,"Report Preparation ",false,"","Report Preparation ",{"$f":"SUM(K15,K52,K89,K126,K164)","v":0}]
["*PROJECT MANAGER",null,104,null,null,null,0]
["*PROJECT MANAGER",null,104,null,null,null,0,null,"Emergency/Initial Work   ",{"$f":"IF(J11=TRUE,1,\"\")","v":""}]
["*PROJECT COORDINATOR",null,75,null,null,null,0,null,"Investigation Work      ",{"$f":"IF(J12=TRUE,2,\"\")","v":2}]
["*PROJECT COORDINATOR",null,75,null,null,null,0,null,"Monitoring/Interim Work        ",{"$f":"IF(J13=TRUE,3,\"\")","v":""}]
["GEOLOGIST",null,75,null,null,null,0,null,"Corrective Action Plan Work",{"$f":"IF(J14=TRUE,4,\"\")","v":""},null,null,null,null,"GEOLOGIST"]
["ENGINEER",null,75,null,null,null,0,null,"Report Preparation ",{"$f":"IF(J15=TRUE,5,\"\")","v":""},null,null,null,null,"ENGINEER"]
["TOXICOLOGIST",null,75,null,null,null,0,null,null,null,null,null,null,null,"TOXICOLOGIST"]
["ENVIRONMENTAL SPECIALIST",null,68,null,null,null,0]
["ENVIRONMENTAL SPECIALIST",null,68,null,null,null,0,null,null,null,null,null,null,null,"LABORER"]
["ENVIRONMENTAL SPECIALIST",null,68,null,null,null,0,null,null,null,null,null,null,null,"CLERICAL"]
["FOREMAN",null,68,null,null,null,0]
["DRAFTSMAN",null,68,null,null,null,0]
["OPERATOR",null,47,null,null,null,0]
["OPERATOR",null,47,null,null,null,0]
["LABORER",null,36.5,null,null,null,0]
["LABORER",null,36.5,null,null,null,0,null,{"$f":"IF(J11=TRUE,$M$11,IF(J12=TRUE,$M$12,IF(J13=TRUE,$M$13,IF(J14=TRUE,$M$14,IF(J15=TRUE,$M$15,0)))))","v":0}]
["SUBTOTAL OF THIS PAGE",null,null,null,null,{"$f":"SUM(G11:G31)","v":0}]
["TOTAL PERSONNEL COSTS",null,null,null,null,{"$f":"SUM(I31)","v":0},null,null,{"$f":"IF(F33>0,1,0)","v":0}]
["*There can be only one person in this designated job title performing these duties shown at any given period of time.  "]
["**Only a limited number of hours should be shown for this position. "]
["Page          of              (Personnel Supplementary Sheet)"]
[]
["PART 5.A"]
["PERSONNEL SUPPLEMENTARY SHEET"]
["Check Event:"]
[]
["1.        Rates shown on this form cannot be adjusted higher."]
["2.        (Rate) X (No. Hrs.) = Total"]
["3.        Personnel charges for work activities included in unit pricing should not be addressed on this form"]
["4.        For work performed prior to 7/1/2017, use the appropriate Trust Fund Guidance Document Rates."]
["PERSONNEL","EMPLOYEE NAME","RATE","WORK PERFORMED\nDATE,  LOCATION (field or office) and DESCRIPTION","INVOICE       NO.","No.     HRS","TOTAL"]
["DUTIES",null,null,null,null,null,null,null,null,null,"Total"]
["**PRINCIPAL",null,130,null,null,null,{"$f":"ROUND((C48*F48),2)","v":0},null,"Emergency/Initial Work   ",false,{"$f":"IF(J48=TRUE,$F$69,\"\")","v":""}]
["*SENIOR   TOXICOLOGIST",null,104,null,null,null,0,null,"Investigation Work      ",false,{"$f":"IF(J49=TRUE,$F$69,\"\")","v":""}]
["*SENIOR ENGINEER",null,104,null,null,null,0,null,"Monitoring/Interim Work        ",true,0]
["*SENIOR GEOLOGIST",null,104,null,null,null,0,null,"Corrective Action Plan Work",false,""]
["*PROJECT MANAGER",null,104,null,null,null,0,null,"Report Preparation ",false,""]
["*PROJECT MANAGER",null,104,null,null,null,0]
["*PROJECT MANAGER",null,104,null,null,null,0,null,"Emergency/Initial Work   ",{"$f":"IF(J48=TRUE,1,\"\")","v":""}]
["*PROJECT COORDINATOR",null,75,null,null,null,0,null,"Investigation Work      ",{"$f":"IF(J49=TRUE,2,\"\")","v":""}]
["*PROJECT COORDINATOR",null,75,null,null,null,0,null,"Monitoring/Interim Work        ",{"$f":"IF(J50=TRUE,3,\"\")","v":3}]
["GEOLOGIST",null,75,null,null,null,0,null,"Corrective Action Plan Work",{"$f":"IF(J51=TRUE,4,\"\")","v":""}]
["ENGINEER",null,75,null,null,null,0,null,"Report Preparation ",{"$f":"IF(J52=TRUE,5,\"\")","v":""}]
["TOXICOLOGIST",null,75,null,null,null,0]
["ENVIRONMENTAL SPECIALIST",null,68,null,null,null,0]
["ENVIRONMENTAL SPECIALIST",null,68,null,null,null,0]
["ENVIRONMENTAL SPECIALIST",null,68,null,null,null,0]
["FOREMAN",null,68,null,null,null,0]
["DRAFTSMAN",null,68,null,null,null,0]
["OPERATOR",null,47,null,null,null,0]
["OPERATOR",null,47,null,null,null,0]
["LABORER",null,36.5,null,null,null,0,null,{"$f":"IF(J48=TRUE,$M$11,IF(J49=TRUE,$M$12,IF(J50=TRUE,$M$13,IF(J51=TRUE,$M$14,IF(J52=TRUE,$M$15,0)))))","v":0}]
["LABORER",null,36.5,null,null,null,0]
["SUBTOTAL OF THIS PAGE",null,null,null,null,{"$f":"SUM(G48:G68)","v":0}]
["TOTAL PERSONNEL COSTS",null,null,null,null,{"$f":"SUM(I67)","v":0},null,null,{"$f":"IF(F70>0,1,0)","v":0}]
["*There can be only one person in this designated job title performing these duties shown at any given period of time.  "]
["**Only a limited number of hours should be shown for this position. "]
["Page_____of______ (Personnel Supplementary Sheet)"]
[]
["PART 5.A"]
["PERSONNEL SUPPLEMENTARY SHEET"]
["Check Event:"]
[]
["1.        Rates shown on this form cannot be adjusted higher."]
["2.        (Rate) X (No. Hrs.) = Total"]
["3.        Personnel charges for work activities included in unit pricing should not be addressed on this form"]
["4.        For work performed prior to 7/1/2017, use the appropriate Trust Fund Guidance Document Rates."]
["PERSONNEL","EMPLOYEE NAME","RATE","WORK PERFORMED\nDATE,  LOCATION (field or office) and DESCRIPTION","INVOICE       NO.","No.     HRS","TOTAL"]
["DUTIES",null,null,null,null,null,null,null,null,null,"Total"]
["**PRINCIPAL",null,130,null,null,null,{"$f":"ROUND((C85*F85),2)","v":0},null,"Emergency/Initial Work   ",false,{"$f":"IF(J85=TRUE,$F$106,\"\")","v":""}]
["*SENIOR   TOXICOLOGIST",null,104,null,null,null,0,null,"Investigation Work      ",false,{"$f":"IF(J86=TRUE,$F$106,\"\")","v":""}]
["*SENIOR ENGINEER",null,104,null,null,null,0,null,"Monitoring/Interim Work        ",false,""]
["*SENIOR GEOLOGIST",null,104,null,null,null,0,null,"Corrective Action Plan Work",false,""]
["*PROJECT MANAGER",null,104,null,null,null,0,null,"Report Preparation ",false,""]
["*PROJECT MANAGER",null,104,null,null,null,0]
["*PROJECT MANAGER",null,104,null,null,null,0,null,"Emergency/Initial Work   ",{"$f":"IF(J85=TRUE,1,\"\")","v":""}]
["*PROJECT COORDINATOR",null,75,null,null,null,0,null,"Investigation Work      ",{"$f":"IF(J86=TRUE,2,\"\")","v":""}]
["*PROJECT COORDINATOR",null,75,null,null,null,0,null,"Monitoring/Interim Work        ",{"$f":"IF(J87=TRUE,3,\"\")","v":""}]
["GEOLOGIST",null,75,null,null,null,0,null,"Corrective Action Plan Work",{"$f":"IF(J88=TRUE,4,\"\")","v":""}]
["ENGINEER",null,75,null,null,null,0,null,"Report Preparation ",{"$f":"IF(J89=TRUE,5,\"\")","v":""}]
["TOXICOLOGIST",null,75,null,null,null,0]
["ENVIRONMENTAL SPECIALIST",null,68,null,null,null,0]
["ENVIRONMENTAL SPECIALIST",null,68,null,null,null,0]
["ENVIRONMENTAL SPECIALIST",null,68,null,null,null,0]
["FOREMAN",null,68,null,null,null,0]
["DRAFTSMAN",null,68,null,null,null,0]
["OPERATOR",null,47,null,null,null,0]
["OPERATOR",null,47,null,null,null,0]
["LABORER",null,36.5,null,null,null,0]
["LABORER",null,36.5,null,null,null,0,null,{"$f":"IF(J85=TRUE,$M$11,IF(J86=TRUE,$M$12,IF(J87=TRUE,$M$13,IF(J88=TRUE,$M$14,IF(J89=TRUE,$M$15,0)))))","v":0}]
["SUBTOTAL OF THIS PAGE",null,null,null,null,{"$f":"SUM(G85:G105)","v":0}]
["TOTAL PERSONNEL COSTS",null,null,null,null,{"$f":"SUM(I105)","v":0},null,null,{"$f":"IF(F107>0,1,0)","v":0}]
["*There can be only one person in this designated job title performing these duties shown at any given period of time.  "]
["**Only a limited number of hours should be shown for this position. "]
["Page          of              (Personnel Supplementary Sheet)"]
[]
["PART 5.A"]
["PERSONNEL SUPPLEMENTARY SHEET"]
["Check Event:"]
[]
["1.        Rates shown on this form cannot be adjusted higher."]
["2.        (Rate) X (No. Hrs.) = Total"]
["3.        Personnel charges for work activities included in unit pricing should not be addressed on this form"]
["4.        For work performed prior to 7/1/2017, use the appropriate Trust Fund Guidance Document Rates."]
["PERSONNEL","EMPLOYEE NAME","RATE","WORK PERFORMED\nDATE,  LOCATION (field or office) and DESCRIPTION","INVOICE       NO.","No.     HRS","TOTAL"]
["DUTIES",null,null,null,null,null,null,null,null,null,"Total"]
["**PRINCIPAL",null,130,null,null,null,{"$f":"ROUND((C122*F122),2)","v":0},null,"Emergency/Initial Work   ",false,{"$f":"IF(J122=TRUE,$F$143,\"\")","v":""}]
["*SENIOR   TOXICOLOGIST",null,104,null,null,null,0,null,"Investigation Work      ",false,{"$f":"IF(J123=TRUE,$F$143,\"\")","v":""}]
["*SENIOR ENGINEER",null,104,null,null,null,0,null,"Monitoring/Interim Work        ",false,""]
["*SENIOR GEOLOGIST",null,104,null,null,null,0,null,"Corrective Action Plan Work",false,""]
["*PROJECT MANAGER",null,104,null,null,null,0,null,"Report Preparation ",false,""]
["*PROJECT MANAGER",null,104,null,null,null,0]
["*PROJECT MANAGER",null,104,null,null,null,0,null,"Emergency/Initial Work   ",{"$f":"IF(J122=TRUE,1,\"\")","v":""}]
["*PROJECT COORDINATOR",null,75,null,null,null,0,null,"Investigation Work      ",{"$f":"IF(J123=TRUE,2,\"\")","v":""}]
["*PROJECT COORDINATOR",null,75,null,null,null,0,null,"Monitoring/Interim Work        ",{"$f":"IF(J124=TRUE,3,\"\")","v":""}]
["GEOLOGIST",null,75,null,null,null,0,null,"Corrective Action Plan Work",{"$f":"IF(J125=TRUE,4,\"\")","v":""}]
["ENGINEER",null,75,null,null,null,0,null,"Report Preparation ",{"$f":"IF(J126=TRUE,5,\"\")","v":""}]
["TOXICOLOGIST",null,75,null,null,null,0]
["ENVIRONMENTAL SPECIALIST",null,68,null,null,null,0]
["ENVIRONMENTAL SPECIALIST",null,68,null,null,null,0]
["ENVIRONMENTAL SPECIALIST",null,68,null,null,null,0]
["FOREMAN",null,68,null,null,null,0]
["DRAFTSMAN",null,68,null,null,null,0]
["OPERATOR",null,47,null,null,null,0]
["OPERATOR",null,47,null,null,null,0]
["LABORER",null,36.5,null,null,null,0]
["LABORER",null,36.5,null,null,null,0,null,{"$f":"IF(J122=TRUE,$M$11,IF(J123=TRUE,$M$12,IF(J124=TRUE,$M$13,IF(J125=TRUE,$M$14,IF(J126=TRUE,$M$15,0)))))","v":0}]
["SUBTOTAL OF THIS PAGE",null,null,null,null,{"$f":"SUM(G122:G142)","v":0}]
["TOTAL PERSONNEL COSTS",null,null,null,null,{"$f":"SUM(I142)","v":0},null,null,{"$f":"IF(F144>0,1,0)","v":0}]
["*There can be only one person in this designated job title performing these duties shown at any given period of time.  "]
["**Only a limited number of hours should be shown for this position. "]
["Page          of              (Personnel Supplementary Sheet)"]
[]
["PART 5.A"]
["PERSONNEL SUPPLEMENTARY SHEET"]
["Check Event:"]
[]
["1.        Rates shown on this form cannot be adjusted higher."]
["2.        (Rate) X (No. Hrs.) = Total"]
["3.        Personnel charges for work activities included in unit pricing should not be addressed on this form"]
["4.        For work performed prior to 7/1/2017, use the appropriate Trust Fund Guidance Document Rates."]
["PERSONNEL","EMPLOYEE NAME","RATE","WORK PERFORMED\nDATE,  LOCATION (field or office) and DESCRIPTION","INVOICE       NO.","No.     HRS","TOTAL"]
["DUTIES"]
["**PRINCIPAL",null,130,null,null,null,{"$f":"ROUND((C159*F159),2)","v":0},null,null,null,"Total"]
["*SENIOR   TOXICOLOGIST",null,104,null,null,null,0,null,"Emergency/Initial Work   ",false,{"$f":"IF(J160=TRUE,$F$180,\"\")","v":""}]
["*SENIOR ENGINEER",null,104,null,null,null,0,null,"Investigation Work      ",false,{"$f":"IF(J161=TRUE,$F$180,\"\")","v":""}]
["*SENIOR GEOLOGIST",null,104,null,null,null,0,null,"Monitoring/Interim Work        ",false,""]
["*PROJECT MANAGER",null,104,null,null,null,0,null,"Corrective Action Plan Work",false,""]
["*PROJECT MANAGER",null,104,null,null,null,0,null,"Report Preparation ",false,""]
["*PROJECT MANAGER",null,104,null,null,null,0]
["*PROJECT COORDINATOR",null,75,null,null,null,0,null,"Emergency/Initial Work   ",{"$f":"IF(J160=TRUE,1,\"\")","v":""}]
["*PROJECT COORDINATOR",null,75,null,null,null,0,null,"Investigation Work      ",{"$f":"IF(J161=TRUE,2,\"\")","v":""}]
["GEOLOGIST",null,75,null,null,null,0,null,"Monitoring/Interim Work        ",{"$f":"IF(J162=TRUE,3,\"\")","v":""}]
["ENGINEER",null,75,null,null,null,0,null,"Corrective Action Plan Work",{"$f":"IF(J163=TRUE,4,\"\")","v":""}]
["TOXICOLOGIST",null,75,null,null,null,0,null,"Report Preparation ",{"$f":"IF(J164=TRUE,5,\"\")","v":""}]
["ENVIRONMENTAL SPECIALIST",null,68,null,null,null,0]
["ENVIRONMENTAL SPECIALIST",null,68,null,null,null,0]
["ENVIRONMENTAL SPECIALIST",null,68,null,null,null,0]
["FOREMAN",null,68,null,null,null,0]
["DRAFTSMAN",null,68,null,null,null,0]
["OPERATOR",null,47,null,null,null,0]
["OPERATOR",null,47,null,null,null,0]
["LABORER",null,36.5,null,null,null,0]
["LABORER",null,36.5,null,null,null,0,null,{"$f":"IF(J160=TRUE,$M$11,IF(J161=TRUE,$M$12,IF(J162=TRUE,$M$13,IF(J163=TRUE,$M$14,IF(J164=TRUE,$M$15,0)))))","v":0}]
["SUBTOTAL OF THIS PAGE",null,null,null,null,{"$f":"SUM(G159:G179)","v":0}]
["TOTAL PERSONNEL COSTS",null,null,null,null,{"$f":"SUM(I180)","v":0},null,null,{"$f":"IF(F181>0,1,0)","v":0}]
["*There can be only one person in this designated job title performing these duties shown at any given period of time.  "]
["**Only a limited number of hours should be shown for this position. "]
["Page          of              (Personnel Supplementary Sheet)"]

{"sheet":"Soil-Water Disposal","index":7,"n_rows":172,"n_cols":14,"rows_kept":172,"cut":false,"hidden":false,"merged":[[133,0,133,7],[134,0,134,7],[135,0,135,7],[136,0,136,7],[137,0,137,7],[143,0,143,7],[171,0,171,5],[138,0,138,7],[139,0,139,7],[140,0,140,7],[141,0,141,7],[142,0,142,7],[169,0,169,6],[170,0,170,6],[129,0,129,7],[130,0,130,7],[131,0,131,7],[98,0,98,7],[99,0,99,7],[100,0,100,7],[126,0,126,6],[127,0,127,6],[128,0,128,5],[93,0,93,7],[94,0,94,7],[95,0,95,7],[96,0,96,7],[97,0,97,7],[13,0,13,7],[43,0,43,7],[44,0,44,7],[45,0,45,7],[47,0,47,7],[42,0,42,5],[40,0,40,6],[41,0,41,6],[14,0,14,7],[46,0,46,7],[9,0,9,7],[10,0,10,7],[11,0,11,7],[12,0,12,7],[5,0,5,7],[7,0,7,7],[8,0,8,7],[0,0,0,7],[1,0,1,7],[2,0,2,7],[6,0,6,7],[3,0,3,7],[4,0,4,7],[48,0,48,7],[49,0,49,7],[50,0,50,7],[51,0,51,7],[52,0,52,7],[132,0,132,7],[53,0,53,7],[54,0,54,7],[55,0,55,7],[56,0,56,7],[57,0,57,7],[88,0,88,7],[90,0,90,7],[91,0,91,7],[92,0,92,7],[85,0,85,5],[86,0,86,7],[87,0,87,7],[83,0,83,6],[84,0,84,6],[89,0,89,7]]}
["PART 5.B"]
["SOIL/WATER DISPOSAL SUPPLEMENTARY SHEET"]
["Check Event:"]
["1.    The unit rate for purge water disposal related to Groundwater Sampling events is $4.20/gal."]
["2.    All other water disposal is under the unit rate of $0.57 /gal."]
["3.    Do not address the RAC markups on this page.  Indicate markups on the Miscellaneous Supplementary Sheet."]
["4.    Pre-approval is required from the Team Leader or ROG for all work."]
["5.    For disposal invoices: addresses, copies of manifests, bills of lading, etc. must be provided."]
["6.    (Tons [Soil]) X (Cost Per Unit) = Total",null,null,null,null,null,null,null,null," "]
["7.    (Gallons [Water]) X (Cost Per Unit) = Total"]
["8.    Soil drum disposal (not associated with excavation): $520.00 minimum, $208.00 for the first drum, $156.00 each additional "]
["       drum."]
["9.    For excavation/transportation/disposal unit rates, please refer to the MS Excel spreadsheet located at  ",null,null,null,null,null,null,null,null,"Soil Cuttings",null,"TONS","DRUMS"]
["      http://www.deq.louisiana.gov/trustfund",null,null,null,null,null,null,null,null,"Water",null,"GALLONS"]
["10.   For non-impacted soil and onsite, treated soil cost reductions, enter the tonnage value in the bottom two rows.",null,null,null,null,null,null,null,null,"Excavation",null,"TONS"]
["TYPE OF DISPOSAL \n(Soil or Water)","DISPOSAL DATE","RAC\nINVOICE\nNO.","OUTSIDE\nINVOICE\nNO.","TONS, DRUMS OR\nGALLONS","QUANTITY","COST \nPER\nUNIT","TOTAL",null,null,null,"Total",null,"Sheet total"]
[null,null,null,null,null,null,null,{"$f":"ROUND(IF(AND(A17=\"Excavation\",E17=\"TONS\"),VLOOKUP(F17,Data!$D$18:$F$5017,3),IF(AND(A17=\"Soil Cuttings\",E17=\"DRUMS\"),IF(F17<=3,520,(F17-1)*156+208),F17*G17)),2)","v":0},null,"Emergency/Initial Work   ",false,{"$f":"IF(K17=TRUE,$H$41,\"\")","v":""},"Emergency/Initial Work   ",{"$f":"SUM(L17,L60,L103,L146)","v":0}]
[null,null,null,null,null,null,null,{"$f":"ROUND(IF(AND(A18=\"Excavation\",E18=\"TONS\"),VLOOKUP(F18,Data!$D$18:$F$5017,3),IF(AND(A18=\"Soil Cuttings\",E18=\"DRUMS\"),IF(F18<=3,520,(F18-1)*156+208),F18*G18)),2)","v":0},null,"Investigation Work      ",false,{"$f":"IF(K18=TRUE,$H$41,\"\")","v":""},"Investigation Work      ",{"$f":"SUM(L18,L61,L104,L147)","v":0}]
[null,null,null,null,null,null,null,{"$f":"ROUND(IF(AND(A19=\"Excavation\",E19=\"TONS\"),VLOOKUP(F19,Data!$D$18:$F$5017,3),IF(AND(A19=\"Soil Cuttings\",E19=\"DRUMS\"),IF(F19<=3,520,(F19-1)*156+208),F19*G19)),2)","v":0},null,"Monitoring/Interim Work    ",false,"","Monitoring/Interim Work    ",{"$f":"SUM(L19,L62,L105,L148)","v":0}]
[null,null,null,null,null,null,null,{"$f":"ROUND(IF(AND(A20=\"Excavation\",E20=\"TONS\"),VLOOKUP(F20,Data!$D$18:$F$5017,3),IF(AND(A20=\"Soil Cuttings\",E20=\"DRUMS\"),IF(F20<=3,520,(F20-1)*156+208),F20*G20)),2)","v":0},null,"Corrective Action Plan Work",false,"","Corrective Action Plan Work",{"$f":"SUM(L20,L63,L106,L149)","v":0}]
[null,null,null,null,null,null,null,{"$f":"ROUND(IF(AND(A21=\"Excavation\",E21=\"TONS\"),VLOOKUP(F21,Data!$D$18:$F$5017,3),IF(AND(A21=\"Soil Cuttings\",E21=\"DRUMS\"),IF(F21<=3,520,(F21-1)*156+208),F21*G21)),2)","v":0}]
[null,null,null,null,null,null,null,{"$f":"ROUND(IF(AND(A22=\"Excavation\",E22=\"TONS\"),VLOOKUP(F22,Data!$D$18:$F$5017,3),IF(AND(A22=\"Soil Cuttings\",E22=\"DRUMS\"),IF(F22<=3,520,(F22-1)*156+208),F22*G22)),2)","v":0},null,"Emergency/Initial Work   ",{"$f":"IF(K17=TRUE,1,\"\")","v":""}]
[null,null,null,null,null,null,null,{"$f":"ROUND(IF(AND(A23=\"Excavation\",E23=\"TONS\"),VLOOKUP(F23,Data!$D$18:$F$5017,3),IF(AND(A23=\"Soil Cuttings\",E23=\"DRUMS\"),IF(F23<=3,520,(F23-1)*156+208),F23*G23)),2)","v":0},null,"Investigation Work      ",{"$f":"IF(K18=TRUE,2,\"\")","v":""}]
[null,null,null,null,null,null,null,{"$f":"ROUND(IF(AND(A24=\"Excavation\",E24=\"TONS\"),VLOOKUP(F24,Data!$D$18:$F$5017,3),IF(AND(A24=\"Soil Cuttings\",E24=\"DRUMS\"),IF(F24<=3,520,(F24-1)*156+208),F24*G24)),2)","v":0},null,"Monitoring/Interim Work    ",{"$f":"IF(K19=TRUE,3,\"\")","v":""}]
[null,null,null,null,null,null,null,{"$f":"ROUND(IF(AND(A25=\"Excavation\",E25=\"TONS\"),VLOOKUP(F25,Data!$D$18:$F$5017,3),IF(AND(A25=\"Soil Cuttings\",E25=\"DRUMS\"),IF(F25<=3,520,(F25-1)*156+208),F25*G25)),2)","v":0},null,"Corrective Action Plan Work",{"$f":"IF(K20=TRUE,4,\"\")","v":""}]
[null,null,null,null,null,null,null,{"$f":"ROUND(IF(AND(A26=\"Excavation\",E26=\"TONS\"),VLOOKUP(F26,Data!$D$18:$F$5017,3),IF(AND(A26=\"Soil Cuttings\",E26=\"DRUMS\"),IF(F26<=3,520,(F26-1)*156+208),F26*G26)),2)","v":0}]
[null,null,null,null,null,null,null,{"$f":"ROUND(IF(AND(A27=\"Excavation\",E27=\"TONS\"),VLOOKUP(F27,Data!$D$18:$F$5017,3),IF(AND(A27=\"Soil Cuttings\",E27=\"DRUMS\"),IF(F27<=3,520,(F27-1)*156+208),F27*G27)),2)","v":0}]
[null,null,null,null,null,null,null,{"$f":"ROUND(IF(AND(A28=\"Excavation\",E28=\"TONS\"),VLOOKUP(F28,Data!$D$18:$F$5017,3),IF(AND(A28=\"Soil Cuttings\",E28=\"DRUMS\"),IF(F28<=3,520,(F28-1)*156+208),F28*G28)),2)","v":0}]
[null,null,null,null,null,null,null,{"$f":"ROUND(IF(AND(A29=\"Excavation\",E29=\"TONS\"),VLOOKUP(F29,Data!$D$18:$F$5017,3),IF(AND(A29=\"Soil Cuttings\",E29=\"DRUMS\"),IF(F29<=3,520,(F29-1)*156+208),F29*G29)),2)","v":0}]
[null,null,null,null,null,null,null,{"$f":"ROUND(IF(AND(A30=\"Excavation\",E30=\"TONS\"),VLOOKUP(F30,Data!$D$18:$F$5017,3),IF(AND(A30=\"Soil Cuttings\",E30=\"DRUMS\"),IF(F30<=3,520,(F30-1)*156+208),F30*G30)),2)","v":0}]
[null,null,null,null,null,null,null,{"$f":"ROUND(IF(AND(A31=\"Excavation\",E31=\"TONS\"),VLOOKUP(F31,Data!$D$18:$F$5017,3),IF(AND(A31=\"Soil Cuttings\",E31=\"DRUMS\"),IF(F31<=3,520,(F31-1)*156+208),F31*G31)),2)","v":0}]
[null,null,null,null,null,null,null,{"$f":"ROUND(IF(AND(A32=\"Excavation\",E32=\"TONS\"),VLOOKUP(F32,Data!$D$18:$F$5017,3),IF(AND(A32=\"Soil Cuttings\",E32=\"DRUMS\"),IF(F32<=3,520,(F32-1)*156+208),F32*G32)),2)","v":0}]
[null,null,null,null,null,null,null,{"$f":"ROUND(IF(AND(A33=\"Excavation\",E33=\"TONS\"),VLOOKUP(F33,Data!$D$18:$F$5017,3),IF(AND(A33=\"Soil Cuttings\",E33=\"DRUMS\"),IF(F33<=3,520,(F33-1)*156+208),F33*G33)),2)","v":0}]
[null,null,null,null,null,null,null,{"$f":"ROUND(IF(AND(A34=\"Excavation\",E34=\"TONS\"),VLOOKUP(F34,Data!$D$18:$F$5017,3),IF(AND(A34=\"Soil Cuttings\",E34=\"DRUMS\"),IF(F34<=3,520,(F34-1)*156+208),F34*G34)),2)","v":0}]
[null,null,null,null,null,null,null,{"$f":"ROUND(IF(AND(A35=\"Excavation\",E35=\"TONS\"),VLOOKUP(F35,Data!$D$18:$F$5017,3),IF(AND(A35=\"Soil Cuttings\",E35=\"DRUMS\"),IF(F35<=3,520,(F35-1)*156+208),F35*G35)),2)","v":0}]
[null,null,null,null,null,null,null,{"$f":"ROUND(IF(AND(A36=\"Excavation\",E36=\"TONS\"),VLOOKUP(F36,Data!$D$18:$F$5017,3),IF(AND(A36=\"Soil Cuttings\",E36=\"DRUMS\"),IF(F36<=3,520,(F36-1)*156+208),F36*G36)),2)","v":0}]
[null,null,null,null,null,null,null,{"$f":"ROUND(IF(AND(A37=\"Excavation\",E37=\"TONS\"),VLOOKUP(F37,Data!$D$18:$F$5017,3),IF(AND(A37=\"Soil Cuttings\",E37=\"DRUMS\"),IF(F37<=3,520,(F37-1)*156+208),F37*G37)),2)","v":0}]
[null,null,null,null,null,null,null,{"$f":"ROUND(IF(AND(A38=\"Excavation\",E38=\"TONS\"),VLOOKUP(F38,Data!$D$18:$F$5017,3),IF(AND(A38=\"Soil Cuttings\",E38=\"DRUMS\"),IF(F38<=3,520,(F38-1)*156+208),F38*G38)),2)","v":0}]
["Non-Impacted Soil",null,null,null,"TONS",null,-45,{"$f":"ROUND(IF(AND(A39=\"Excavation\",E39=\"TONS\"),VLOOKUP(F39,Data!$D$18:$F$5017,3),IF(AND(A39=\"Soil Cuttings\",E39=\"DRUMS\"),IF(F39<=3,500,(F39-1)*150+200),F39*G39)),2)","v":0}]
["Treated Soil",null,null,null,"TONS",null,-30,{"$f":"ROUND(IF(AND(A40=\"Excavation\",E40=\"TONS\"),VLOOKUP(F40,Data!$D$18:$F$5017,3),IF(AND(A40=\"Soil Cuttings\",E40=\"DRUMS\"),IF(F40<=3,500,(F40-1)*150+200),F40*G40)),2)","v":0},null,{"$f":"IF(K17=TRUE,$N$17,IF(K18=TRUE,$N$18,IF(K19=TRUE,$N$19,IF(K20=TRUE,$N$20,0))))","v":0}]
["SUBTOTAL OF THIS PAGE",null,null,null,null,null,null,{"$f":"SUM(H17:H40)","v":0}]
["TOTAL DISPOSAL COSTS",null,null,null,null,null,null,{"$f":"SUM(J40)","v":0},null,{"$f":"IF(H42>0,1,0)","v":0}]
["Page               of               (Soil/Water Disposal Supplementary Sheet)"]
["PART 5.B"]
["SOIL/WATER DISPOSAL SUPPLEMENTARY SHEET"]
["Check Event:"]
["1.    The unit rate for purge water disposal related to Groundwater Sampling events is $4.20/gal."]
["2.    All other water disposal is under the unit rate of $0.57 /gal."]
["3.    Do not address the RAC markups on this page.  Indicate markups on the Miscellaneous Supplementary Sheet."]
["4.    Pre-approval is required from the Team Leader or ROG for all work."]
["5.    For disposal invoices: addresses, copies of manifests, bills of lading, etc. must be provided."]
["6.    (Tons [Soil]) X (Cost Per Unit) = Total",null,null,null,null,null,null,null,null," "]
["7.    (Gallons [Water]) X (Cost Per Unit) = Total"]
["8.    Soil drum disposal (not associated with excavation): $520.00 minimum, $208.00 for the first drum, $156.00 each additional "]
["       drum."]
["9.    For excavation/transportation/disposal unit rates, please refer to the MS Excel spreadsheet located at  "]
["      http://www.deq.louisiana.gov/trustfund"]
["10.   For non-impacted soil and onsite, treated soil cost reductions, enter the tonnage value in the bottom two rows."]
["TYPE OF DISPOSAL \n(Soil or Water)","DISPOSAL DATE","RAC\nINVOICE\nNO.","OUTSIDE\nINVOICE\nNO.","TONS, DRUMS OR\nGALLONS","QUANTITY","COST \nPER\nUNIT","TOTAL",null,null,null,"Total"]
[null,null,null,null,null,null,null,{"$f":"ROUND(IF(AND(A60=\"Excavation\",E60=\"TONS\"),VLOOKUP(F60,Data!$D$18:$F$5017,3),IF(AND(A60=\"Soil Cuttings\",E60=\"DRUMS\"),IF(F60<=3,520,(F60-1)*156+208),F60*G60)),2)","v":0},null,"Emergency/Initial Work   ",false,{"$f":"IF(K60=TRUE,$H$84,\"\")","v":""}]
[null,null,null,null,null,null,null,{"$f":"ROUND(IF(AND(A61=\"Excavation\",E61=\"TONS\"),VLOOKUP(F61,Data!$D$18:$F$5017,3),IF(AND(A61=\"Soil Cuttings\",E61=\"DRUMS\"),IF(F61<=3,520,(F61-1)*156+208),F61*G61)),2)","v":0},null,"Investigation Work      ",false,{"$f":"IF(K61=TRUE,$H$84,\"\")","v":""}]
[null,null,null,null,null,null,null,{"$f":"ROUND(IF(AND(A62=\"Excavation\",E62=\"TONS\"),VLOOKUP(F62,Data!$D$18:$F$5017,3),IF(AND(A62=\"Soil Cuttings\",E62=\"DRUMS\"),IF(F62<=3,520,(F62-1)*156+208),F62*G62)),2)","v":0},null,"Monitoring/Interim Work    ",false,""]
[null,null,null,null,null,null,null,{"$f":"ROUND(IF(AND(A63=\"Excavation\",E63=\"TONS\"),VLOOKUP(F63,Data!$D$18:$F$5017,3),IF(AND(A63=\"Soil Cuttings\",E63=\"DRUMS\"),IF(F63<=3,520,(F63-1)*156+208),F63*G63)),2)","v":0},null,"Corrective Action Plan Work",false,{"$f":"IF(K63=TRUE,$H$84,\"\")","v":""}]
[null,null,null,null,null,null,null,{"$f":"ROUND(IF(AND(A64=\"Excavation\",E64=\"TONS\"),VLOOKUP(F64,Data!$D$18:$F$5017,3),IF(AND(A64=\"Soil Cuttings\",E64=\"DRUMS\"),IF(F64<=3,520,(F64-1)*156+208),F64*G64)),2)","v":0}]
[null,null,null,null,null,null,null,{"$f":"ROUND(IF(AND(A65=\"Excavation\",E65=\"TONS\"),VLOOKUP(F65,Data!$D$18:$F$5017,3),IF(AND(A65=\"Soil Cuttings\",E65=\"DRUMS\"),IF(F65<=3,520,(F65-1)*156+208),F65*G65)),2)","v":0},null,"Emergency/Initial Work   ",{"$f":"IF(K60=TRUE,1,\"\")","v":""}]
[null,null,null,null,null,null,null,{"$f":"ROUND(IF(AND(A66=\"Excavation\",E66=\"TONS\"),VLOOKUP(F66,Data!$D$18:$F$5017,3),IF(AND(A66=\"Soil Cuttings\",E66=\"DRUMS\"),IF(F66<=3,520,(F66-1)*156+208),F66*G66)),2)","v":0},null,"Investigation Work      ",{"$f":"IF(K61=TRUE,2,\"\")","v":""}]
[null,null,null,null,null,null,null,{"$f":"ROUND(IF(AND(A67=\"Excavation\",E67=\"TONS\"),VLOOKUP(F67,Data!$D$18:$F$5017,3),IF(AND(A67=\"Soil Cuttings\",E67=\"DRUMS\"),IF(F67<=3,520,(F67-1)*156+208),F67*G67)),2)","v":0},null,"Monitoring/Interim Work    ",{"$f":"IF(K62=TRUE,3,\"\")","v":""}]
[null,null,null,null,null,null,null,{"$f":"ROUND(IF(AND(A68=\"Excavation\",E68=\"TONS\"),VLOOKUP(F68,Data!$D$18:$F$5017,3),IF(AND(A68=\"Soil Cuttings\",E68=\"DRUMS\"),IF(F68<=3,520,(F68-1)*156+208),F68*G68)),2)","v":0},null,"Corrective Action Plan Work",{"$f":"IF(K63=TRUE,4,\"\")","v":""}]
[null,null,null,null,null,null,null,{"$f":"ROUND(IF(AND(A69=\"Excavation\",E69=\"TONS\"),VLOOKUP(F69,Data!$D$18:$F$5017,3),IF(AND(A69=\"Soil Cuttings\",E69=\"DRUMS\"),IF(F69<=3,520,(F69-1)*156+208),F69*G69)),2)","v":0}]
[null,null,null,null,null,null,null,{"$f":"ROUND(IF(AND(A70=\"Excavation\",E70=\"TONS\"),VLOOKUP(F70,Data!$D$18:$F$5017,3),IF(AND(A70=\"Soil Cuttings\",E70=\"DRUMS\"),IF(F70<=3,520,(F70-1)*156+208),F70*G70)),2)","v":0}]
[null,null,null,null,null,null,null,{"$f":"ROUND(IF(AND(A71=\"Excavation\",E71=\"TONS\"),VLOOKUP(F71,Data!$D$18:$F$5017,3),IF(AND(A71=\"Soil Cuttings\",E71=\"DRUMS\"),IF(F71<=3,520,(F71-1)*156+208),F71*G71)),2)","v":0}]
[null,null,null,null,null,null,null,{"$f":"ROUND(IF(AND(A72=\"Excavation\",E72=\"TONS\"),VLOOKUP(F72,Data!$D$18:$F$5017,3),IF(AND(A72=\"Soil Cuttings\",E72=\"DRUMS\"),IF(F72<=3,520,(F72-1)*156+208),F72*G72)),2)","v":0}]
[null,null,null,null,null,null,null,{"$f":"ROUND(IF(AND(A73=\"Excavation\",E73=\"TONS\"),VLOOKUP(F73,Data!$D$18:$F$5017,3),IF(AND(A73=\"Soil Cuttings\",E73=\"DRUMS\"),IF(F73<=3,520,(F73-1)*156+208),F73*G73)),2)","v":0}]
[null,null,null,null,null,null,null,{"$f":"ROUND(IF(AND(A74=\"Excavation\",E74=\"TONS\"),VLOOKUP(F74,Data!$D$18:$F$5017,3),IF(AND(A74=\"Soil Cuttings\",E74=\"DRUMS\"),IF(F74<=3,520,(F74-1)*156+208),F74*G74)),2)","v":0}]
[null,null,null,null,null,null,null,{"$f":"ROUND(IF(AND(A75=\"Excavation\",E75=\"TONS\"),VLOOKUP(F75,Data!$D$18:$F$5017,3),IF(AND(A75=\"Soil Cuttings\",E75=\"DRUMS\"),IF(F75<=3,520,(F75-1)*156+208),F75*G75)),2)","v":0}]
[null,null,null,null,null,null,null,{"$f":"ROUND(IF(AND(A76=\"Excavation\",E76=\"TONS\"),VLOOKUP(F76,Data!$D$18:$F$5017,3),IF(AND(A76=\"Soil Cuttings\",E76=\"DRUMS\"),IF(F76<=3,520,(F76-1)*156+208),F76*G76)),2)","v":0}]
[null,null,null,null,null,null,null,{"$f":"ROUND(IF(AND(A77=\"Excavation\",E77=\"TONS\"),VLOOKUP(F77,Data!$D$18:$F$5017,3),IF(AND(A77=\"Soil Cuttings\",E77=\"DRUMS\"),IF(F77<=3,520,(F77-1)*156+208),F77*G77)),2)","v":0}]
[null,null,null,null,null,null,null,{"$f":"ROUND(IF(AND(A78=\"Excavation\",E78=\"TONS\"),VLOOKUP(F78,Data!$D$18:$F$5017,3),IF(AND(A78=\"Soil Cuttings\",E78=\"DRUMS\"),IF(F78<=3,520,(F78-1)*156+208),F78*G78)),2)","v":0}]
[null,null,null,null,null,null,null,{"$f":"ROUND(IF(AND(A79=\"Excavation\",E79=\"TONS\"),VLOOKUP(F79,Data!$D$18:$F$5017,3),IF(AND(A79=\"Soil Cuttings\",E79=\"DRUMS\"),IF(F79<=3,520,(F79-1)*156+208),F79*G79)),2)","v":0}]
[null,null,null,null,null,null,null,{"$f":"ROUND(IF(AND(A80=\"Excavation\",E80=\"TONS\"),VLOOKUP(F80,Data!$D$18:$F$5017,3),IF(AND(A80=\"Soil Cuttings\",E80=\"DRUMS\"),IF(F80<=3,520,(F80-1)*156+208),F80*G80)),2)","v":0}]
[null,null,null,null,null,null,null,{"$f":"ROUND(IF(AND(A81=\"Excavation\",E81=\"TONS\"),VLOOKUP(F81,Data!$D$18:$F$5017,3),IF(AND(A81=\"Soil Cuttings\",E81=\"DRUMS\"),IF(F81<=3,520,(F81-1)*156+208),F81*G81)),2)","v":0}]
["Non-Impacted Soil",null,null,null,"TONS",null,-45,{"$f":"ROUND(IF(AND(A82=\"Excavation\",E82=\"TONS\"),VLOOKUP(F82,Data!$D$18:$F$5017,3),IF(AND(A82=\"Soil Cuttings\",E82=\"DRUMS\"),IF(F82<=3,500,(F82-1)*150+200),F82*G82)),2)","v":0}]
["Treated Soil",null,null,null,"TONS",null,-30,{"$f":"ROUND(IF(AND(A83=\"Excavation\",E83=\"TONS\"),VLOOKUP(F83,Data!$D$18:$F$5017,3),IF(AND(A83=\"Soil Cuttings\",E83=\"DRUMS\"),IF(F83<=3,500,(F83-1)*150+200),F83*G83)),2)","v":0},null,{"$f":"IF(K60=TRUE,$N$17,IF(K61=TRUE,$N$18,IF(K62=TRUE,$N$19,IF(K63=TRUE,$N$20,0))))","v":0}]
["SUBTOTAL OF THIS PAGE",null,null,null,null,null,null,{"$f":"SUM(H60:H83)","v":0}]
["TOTAL DISPOSAL COSTS",null,null,null,null,null,null,{"$f":"SUM(J83)","v":0},null,{"$f":"IF(H85>0,1,0)","v":0}]
["Page               of               (Soil/Water Disposal Supplementary Sheet)"]
["PART 5.B"]
["SOIL/WATER DISPOSAL SUPPLEMENTARY SHEET"]
["Check Event:"]
["1.    The unit rate for purge water disposal related to Groundwater Sampling events is $4.20/gal."]
["2.    All other water disposal is under the unit rate of $0.57 /gal."]
["3.    Do not address the RAC markups on this page.  Indicate markups on the Miscellaneous Supplementary Sheet."]
["4.    Pre-approval is required from the Team Leader or ROG for all work."]
["5.    For disposal invoices: addresses, copies of manifests, bills of lading, etc. must be provided."]
["6.    (Tons [Soil]) X (Cost Per Unit) = Total",null,null,null,null,null,null,null,null," "]
["7.    (Gallons [Water]) X (Cost Per Unit) = Total"]
["8.    Soil drum disposal (not associated with excavation): $520.00 minimum, $208.00 for the first drum, $156.00 each additional "]
["       drum."]
["9.    For excavation/transportation/disposal unit rates, please refer to the MS Excel spreadsheet located at  "]
["      http://www.deq.louisiana.gov/trustfund"]
["10.   For non-impacted soil and onsite, treated soil cost reductions, enter the tonnage value in the bottom two rows."]
["TYPE OF DISPOSAL \n(Soil or Water)","DISPOSAL DATE","RAC\nINVOICE\nNO.","OUTSIDE\nINVOICE\nNO.","TONS, DRUMS OR\nGALLONS","QUANTITY","COST \nPER\nUNIT","TOTAL",null,null,null,"Total"]
[null,null,null,null,null,null,null,{"$f":"ROUND(IF(AND(A103=\"Excavation\",E103=\"TONS\"),VLOOKUP(F103,Data!$D$18:$F$5017,3),IF(AND(A103=\"Soil Cuttings\",E103=\"DRUMS\"),IF(F103<=3,520,(F103-1)*156+208),F103*G103)),2)","v":0},null,"Emergency/Initial Work   ",false,{"$f":"IF(K103=TRUE,$H$127,\"\")","v":""}]
[null,null,null,null,null,null,null,{"$f":"ROUND(IF(AND(A104=\"Excavation\",E104=\"TONS\"),VLOOKUP(F104,Data!$D$18:$F$5017,3),IF(AND(A104=\"Soil Cuttings\",E104=\"DRUMS\"),IF(F104<=3,520,(F104-1)*156+208),F104*G104)),2)","v":0},null,"Investigation Work      ",false,{"$f":"IF(K104=TRUE,$H$127,\"\")","v":""}]
[null,null,null,null,null,null,null,{"$f":"ROUND(IF(AND(A105=\"Excavation\",E105=\"TONS\"),VLOOKUP(F105,Data!$D$18:$F$5017,3),IF(AND(A105=\"Soil Cuttings\",E105=\"DRUMS\"),IF(F105<=3,520,(F105-1)*156+208),F105*G105)),2)","v":0},null,"Monitoring/Interim Work    ",false,""]
[null,null,null,null,null,null,null,{"$f":"ROUND(IF(AND(A106=\"Excavation\",E106=\"TONS\"),VLOOKUP(F106,Data!$D$18:$F$5017,3),IF(AND(A106=\"Soil Cuttings\",E106=\"DRUMS\"),IF(F106<=3,520,(F106-1)*156+208),F106*G106)),2)","v":0},null,"Corrective Action Plan Work",false,""]
[null,null,null,null,null,null,null,{"$f":"ROUND(IF(AND(A107=\"Excavation\",E107=\"TONS\"),VLOOKUP(F107,Data!$D$18:$F$5017,3),IF(AND(A107=\"Soil Cuttings\",E107=\"DRUMS\"),IF(F107<=3,520,(F107-1)*156+208),F107*G107)),2)","v":0}]
[null,null,null,null,null,null,null,{"$f":"ROUND(IF(AND(A108=\"Excavation\",E108=\"TONS\"),VLOOKUP(F108,Data!$D$18:$F$5017,3),IF(AND(A108=\"Soil Cuttings\",E108=\"DRUMS\"),IF(F108<=3,520,(F108-1)*156+208),F108*G108)),2)","v":0},null,"Emergency/Initial Work   ",{"$f":"IF(K103=TRUE,1,\"\")","v":""}]
[null,null,null,null,null,null,null,{"$f":"ROUND(IF(AND(A109=\"Excavation\",E109=\"TONS\"),VLOOKUP(F109,Data!$D$18:$F$5017,3),IF(AND(A109=\"Soil Cuttings\",E109=\"DRUMS\"),IF(F109<=3,520,(F109-1)*156+208),F109*G109)),2)","v":0},null,"Investigation Work      ",{"$f":"IF(K104=TRUE,2,\"\")","v":""}]
[null,null,null,null,null,null,null,{"$f":"ROUND(IF(AND(A110=\"Excavation\",E110=\"TONS\"),VLOOKUP(F110,Data!$D$18:$F$5017,3),IF(AND(A110=\"Soil Cuttings\",E110=\"DRUMS\"),IF(F110<=3,520,(F110-1)*156+208),F110*G110)),2)","v":0},null,"Monitoring/Interim Work    ",{"$f":"IF(K105=TRUE,3,\"\")","v":""}]
[null,null,null,null,null,null,null,{"$f":"ROUND(IF(AND(A111=\"Excavation\",E111=\"TONS\"),VLOOKUP(F111,Data!$D$18:$F$5017,3),IF(AND(A111=\"Soil Cuttings\",E111=\"DRUMS\"),IF(F111<=3,520,(F111-1)*156+208),F111*G111)),2)","v":0},null,"Corrective Action Plan Work",{"$f":"IF(K106=TRUE,4,\"\")","v":""}]
[null,null,null,null,null,null,null,{"$f":"ROUND(IF(AND(A112=\"Excavation\",E112=\"TONS\"),VLOOKUP(F112,Data!$D$18:$F$5017,3),IF(AND(A112=\"Soil Cuttings\",E112=\"DRUMS\"),IF(F112<=3,520,(F112-1)*156+208),F112*G112)),2)","v":0}]
[null,null,null,null,null,null,null,{"$f":"ROUND(IF(AND(A113=\"Excavation\",E113=\"TONS\"),VLOOKUP(F113,Data!$D$18:$F$5017,3),IF(AND(A113=\"Soil Cuttings\",E113=\"DRUMS\"),IF(F113<=3,520,(F113-1)*156+208),F113*G113)),2)","v":0}]
[null,null,null,null,null,null,null,{"$f":"ROUND(IF(AND(A114=\"Excavation\",E114=\"TONS\"),VLOOKUP(F114,Data!$D$18:$F$5017,3),IF(AND(A114=\"Soil Cuttings\",E114=\"DRUMS\"),IF(F114<=3,520,(F114-1)*156+208),F114*G114)),2)","v":0}]
[null,null,null,null,null,null,null,{"$f":"ROUND(IF(AND(A115=\"Excavation\",E115=\"TONS\"),VLOOKUP(F115,Data!$D$18:$F$5017,3),IF(AND(A115=\"Soil Cuttings\",E115=\"DRUMS\"),IF(F115<=3,520,(F115-1)*156+208),F115*G115)),2)","v":0}]
[null,null,null,null,null,null,null,{"$f":"ROUND(IF(AND(A116=\"Excavation\",E116=\"TONS\"),VLOOKUP(F116,Data!$D$18:$F$5017,3),IF(AND(A116=\"Soil Cuttings\",E116=\"DRUMS\"),IF(F116<=3,520,(F116-1)*156+208),F116*G116)),2)","v":0}]
[null,null,null,null,null,null,null,{"$f":"ROUND(IF(AND(A117=\"Excavation\",E117=\"TONS\"),VLOOKUP(F117,Data!$D$18:$F$5017,3),IF(AND(A117=\"Soil Cuttings\",E117=\"DRUMS\"),IF(F117<=3,520,(F117-1)*156+208),F117*G117)),2)","v":0}]
[null,null,null,null,null,null,null,{"$f":"ROUND(IF(AND(A118=\"Excavation\",E118=\"TONS\"),VLOOKUP(F118,Data!$D$18:$F$5017,3),IF(AND(A118=\"Soil Cuttings\",E118=\"DRUMS\"),IF(F118<=3,520,(F118-1)*156+208),F118*G118)),2)","v":0}]
[null,null,null,null,null,null,null,{"$f":"ROUND(IF(AND(A119=\"Excavation\",E119=\"TONS\"),VLOOKUP(F119,Data!$D$18:$F$5017,3),IF(AND(A119=\"Soil Cuttings\",E119=\"DRUMS\"),IF(F119<=3,520,(F119-1)*156+208),F119*G119)),2)","v":0}]
[null,null,null,null,null,null,null,{"$f":"ROUND(IF(AND(A120=\"Excavation\",E120=\"TONS\"),VLOOKUP(F120,Data!$D$18:$F$5017,3),IF(AND(A120=\"Soil Cuttings\",E120=\"DRUMS\"),IF(F120<=3,520,(F120-1)*156+208),F120*G120)),2)","v":0}]
[null,null,null,null,null,null,null,{"$f":"ROUND(IF(AND(A121=\"Excavation\",E121=\"TONS\"),VLOOKUP(F121,Data!$D$18:$F$5017,3),IF(AND(A121=\"Soil Cuttings\",E121=\"DRUMS\"),IF(F121<=3,520,(F121-1)*156+208),F121*G121)),2)","v":0}]
[null,null,null,null,null,null,null,{"$f":"ROUND(IF(AND(A122=\"Excavation\",E122=\"TONS\"),VLOOKUP(F122,Data!$D$18:$F$5017,3),IF(AND(A122=\"Soil Cuttings\",E122=\"DRUMS\"),IF(F122<=3,520,(F122-1)*156+208),F122*G122)),2)","v":0}]
[null,null,null,null,null,null,null,{"$f":"ROUND(IF(AND(A123=\"Excavation\",E123=\"TONS\"),VLOOKUP(F123,Data!$D$18:$F$5017,3),IF(AND(A123=\"Soil Cuttings\",E123=\"DRUMS\"),IF(F123<=3,520,(F123-1)*156+208),F123*G123)),2)","v":0}]
[null,null,null,null,null,null,null,{"$f":"ROUND(IF(AND(A124=\"Excavation\",E124=\"TONS\"),VLOOKUP(F124,Data!$D$18:$F$5017,3),IF(AND(A124=\"Soil Cuttings\",E124=\"DRUMS\"),IF(F124<=3,520,(F124-1)*156+208),F124*G124)),2)","v":0}]
["Non-Impacted Soil",null,null,null,"TONS",null,-45,{"$f":"ROUND(IF(AND(A125=\"Excavation\",E125=\"TONS\"),VLOOKUP(F125,Data!$D$18:$F$5017,3),IF(AND(A125=\"Soil Cuttings\",E125=\"DRUMS\"),IF(F125<=3,500,(F125-1)*150+200),F125*G125)),2)","v":0}]
["Treated Soil",null,null,null,"TONS",null,-30,{"$f":"ROUND(IF(AND(A126=\"Excavation\",E126=\"TONS\"),VLOOKUP(F126,Data!$D$18:$F$5017,3),IF(AND(A126=\"Soil Cuttings\",E126=\"DRUMS\"),IF(F126<=3,500,(F126-1)*150+200),F126*G126)),2)","v":0},null,{"$f":"IF(K103=TRUE,$N$17,IF(K104=TRUE,$N$18,IF(K105=TRUE,$N$19,IF(K106=TRUE,$N$20,0))))","v":0}]
["SUBTOTAL OF THIS PAGE",null,null,null,null,null,null,{"$f":"SUM(H103:H126)","v":0}]
["TOTAL DISPOSAL COSTS",null,null,null,null,null,null,{"$f":"SUM(J126)","v":0},null,{"$f":"IF(H128>0,1,0)","v":0}]
["Page               of               (Soil/Water Disposal Supplementary Sheet)"]
["PART 5.B"]
["SOIL/WATER DISPOSAL SUPPLEMENTARY SHEET"]
["Check Event:"]
["1.    The unit rate for purge water disposal related to Groundwater Sampling events is $4.20/gal."]
["2.    All other water disposal is under the unit rate of $0.57 /gal."]
["3.    Do not address the RAC markups on this page.  Indicate markups on the Miscellaneous Supplementary Sheet."]
["4.    Pre-approval is required from the Team Leader or ROG for all work."]
["5.    For disposal invoices: addresses, copies of manifests, bills of lading, etc. must be provided."]
["6.    (Tons [Soil]) X (Cost Per Unit) = Total",null,null,null,null,null,null,null,null," "]
["7.    (Gallons [Water]) X (Cost Per Unit) = Total"]
["8.    Soil drum disposal (not associated with excavation): $520.00 minimum, $208.00 for the first drum, $156.00 each additional "]
["       drum."]
["9.    For excavation/transportation/disposal unit rates, please refer to the MS Excel spreadsheet located at  "]
["      http://www.deq.louisiana.gov/trustfund"]
["10.   For non-impacted soil and onsite, treated soil cost reductions, enter the tonnage value in the bottom two rows."]
["TYPE OF DISPOSAL \n(Soil or Water)","DISPOSAL DATE","RAC\nINVOICE\nNO.","OUTSIDE\nINVOICE\nNO.","TONS, DRUMS OR\nGALLONS","QUANTITY","COST \nPER\nUNIT","TOTAL",null,null,null,"Total"]
[null,null,null,null,null,null,null,{"$f":"ROUND(IF(AND(A146=\"Excavation\",E146=\"TONS\"),VLOOKUP(F146,Data!$D$18:$F$5017,3),IF(AND(A146=\"Soil Cuttings\",E146=\"DRUMS\"),IF(F146<=3,520,(F146-1)*156+208),F146*G146)),2)","v":0},null,"Emergency/Initial Work   ",false,{"$f":"IF(K146=TRUE,$H$170,\"\")","v":""}]
[null,null,null,null,null,null,null,{"$f":"ROUND(IF(AND(A147=\"Excavation\",E147=\"TONS\"),VLOOKUP(F147,Data!$D$18:$F$5017,3),IF(AND(A147=\"Soil Cuttings\",E147=\"DRUMS\"),IF(F147<=3,520,(F147-1)*156+208),F147*G147)),2)","v":0},null,"Investigation Work      ",false,{"$f":"IF(K147=TRUE,$H$170,\"\")","v":""}]
[null,null,null,null,null,null,null,{"$f":"ROUND(IF(AND(A148=\"Excavation\",E148=\"TONS\"),VLOOKUP(F148,Data!$D$18:$F$5017,3),IF(AND(A148=\"Soil Cuttings\",E148=\"DRUMS\"),IF(F148<=3,520,(F148-1)*156+208),F148*G148)),2)","v":0},null,"Monitoring/Interim Work    ",false,""]
[null,null,null,null,null,null,null,{"$f":"ROUND(IF(AND(A149=\"Excavation\",E149=\"TONS\"),VLOOKUP(F149,Data!$D$18:$F$5017,3),IF(AND(A149=\"Soil Cuttings\",E149=\"DRUMS\"),IF(F149<=3,520,(F149-1)*156+208),F149*G149)),2)","v":0},null,"Corrective Action Plan Work",false,""]
[null,null,null,null,null,null,null,{"$f":"ROUND(IF(AND(A150=\"Excavation\",E150=\"TONS\"),VLOOKUP(F150,Data!$D$18:$F$5017,3),IF(AND(A150=\"Soil Cuttings\",E150=\"DRUMS\"),IF(F150<=3,520,(F150-1)*156+208),F150*G150)),2)","v":0}]
[null,null,null,null,null,null,null,{"$f":"ROUND(IF(AND(A151=\"Excavation\",E151=\"TONS\"),VLOOKUP(F151,Data!$D$18:$F$5017,3),IF(AND(A151=\"Soil Cuttings\",E151=\"DRUMS\"),IF(F151<=3,520,(F151-1)*156+208),F151*G151)),2)","v":0},null,"Emergency/Initial Work   ",{"$f":"IF(K146=TRUE,1,\"\")","v":""}]
[null,null,null,null,null,null,null,{"$f":"ROUND(IF(AND(A152=\"Excavation\",E152=\"TONS\"),VLOOKUP(F152,Data!$D$18:$F$5017,3),IF(AND(A152=\"Soil Cuttings\",E152=\"DRUMS\"),IF(F152<=3,520,(F152-1)*156+208),F152*G152)),2)","v":0},null,"Investigation Work      ",{"$f":"IF(K147=TRUE,2,\"\")","v":""}]
[null,null,null,null,null,null,null,{"$f":"ROUND(IF(AND(A153=\"Excavation\",E153=\"TONS\"),VLOOKUP(F153,Data!$D$18:$F$5017,3),IF(AND(A153=\"Soil Cuttings\",E153=\"DRUMS\"),IF(F153<=3,520,(F153-1)*156+208),F153*G153)),2)","v":0},null,"Monitoring/Interim Work    ",{"$f":"IF(K148=TRUE,3,\"\")","v":""}]
[null,null,null,null,null,null,null,{"$f":"ROUND(IF(AND(A154=\"Excavation\",E154=\"TONS\"),VLOOKUP(F154,Data!$D$18:$F$5017,3),IF(AND(A154=\"Soil Cuttings\",E154=\"DRUMS\"),IF(F154<=3,520,(F154-1)*156+208),F154*G154)),2)","v":0},null,"Corrective Action Plan Work",{"$f":"IF(K149=TRUE,4,\"\")","v":""}]
[null,null,null,null,null,null,null,{"$f":"ROUND(IF(AND(A155=\"Excavation\",E155=\"TONS\"),VLOOKUP(F155,Data!$D$18:$F$5017,3),IF(AND(A155=\"Soil Cuttings\",E155=\"DRUMS\"),IF(F155<=3,520,(F155-1)*156+208),F155*G155)),2)","v":0}]
[null,null,null,null,null,null,null,{"$f":"ROUND(IF(AND(A156=\"Excavation\",E156=\"TONS\"),VLOOKUP(F156,Data!$D$18:$F$5017,3),IF(AND(A156=\"Soil Cuttings\",E156=\"DRUMS\"),IF(F156<=3,520,(F156-1)*156+208),F156*G156)),2)","v":0}]
[null,null,null,null,null,null,null,{"$f":"ROUND(IF(AND(A157=\"Excavation\",E157=\"TONS\"),VLOOKUP(F157,Data!$D$18:$F$5017,3),IF(AND(A157=\"Soil Cuttings\",E157=\"DRUMS\"),IF(F157<=3,520,(F157-1)*156+208),F157*G157)),2)","v":0}]
[null,null,null,null,null,null,null,{"$f":"ROUND(IF(AND(A158=\"Excavation\",E158=\"TONS\"),VLOOKUP(F158,Data!$D$18:$F$5017,3),IF(AND(A158=\"Soil Cuttings\",E158=\"DRUMS\"),IF(F158<=3,520,(F158-1)*156+208),F158*G158)),2)","v":0}]
[null,null,null,null,null,null,null,{"$f":"ROUND(IF(AND(A159=\"Excavation\",E159=\"TONS\"),VLOOKUP(F159,Data!$D$18:$F$5017,3),IF(AND(A159=\"Soil Cuttings\",E159=\"DRUMS\"),IF(F159<=3,520,(F159-1)*156+208),F159*G159)),2)","v":0}]
[null,null,null,null,null,null,null,{"$f":"ROUND(IF(AND(A160=\"Excavation\",E160=\"TONS\"),VLOOKUP(F160,Data!$D$18:$F$5017,3),IF(AND(A160=\"Soil Cuttings\",E160=\"DRUMS\"),IF(F160<=3,520,(F160-1)*156+208),F160*G160)),2)","v":0}]
[null,null,null,null,null,null,null,{"$f":"ROUND(IF(AND(A161=\"Excavation\",E161=\"TONS\"),VLOOKUP(F161,Data!$D$18:$F$5017,3),IF(AND(A161=\"Soil Cuttings\",E161=\"DRUMS\"),IF(F161<=3,520,(F161-1)*156+208),F161*G161)),2)","v":0}]
[null,null,null,null,null,null,null,{"$f":"ROUND(IF(AND(A162=\"Excavation\",E162=\"TONS\"),VLOOKUP(F162,Data!$D$18:$F$5017,3),IF(AND(A162=\"Soil Cuttings\",E162=\"DRUMS\"),IF(F162<=3,520,(F162-1)*156+208),F162*G162)),2)","v":0}]
[null,null,null,null,null,null,null,{"$f":"ROUND(IF(AND(A163=\"Excavation\",E163=\"TONS\"),VLOOKUP(F163,Data!$D$18:$F$5017,3),IF(AND(A163=\"Soil Cuttings\",E163=\"DRUMS\"),IF(F163<=3,520,(F163-1)*156+208),F163*G163)),2)","v":0}]
[null,null,null,null,null,null,null,{"$f":"ROUND(IF(AND(A164=\"Excavation\",E164=\"TONS\"),VLOOKUP(F164,Data!$D$18:$F$5017,3),IF(AND(A164=\"Soil Cuttings\",E164=\"DRUMS\"),IF(F164<=3,520,(F164-1)*156+208),F164*G164)),2)","v":0}]
[null,null,null,null,null,null,null,{"$f":"ROUND(IF(AND(A165=\"Excavation\",E165=\"TONS\"),VLOOKUP(F165,Data!$D$18:$F$5017,3),IF(AND(A165=\"Soil Cuttings\",E165=\"DRUMS\"),IF(F165<=3,520,(F165-1)*156+208),F165*G165)),2)","v":0}]
[null,null,null,null,null,null,null,{"$f":"ROUND(IF(AND(A166=\"Excavation\",E166=\"TONS\"),VLOOKUP(F166,Data!$D$18:$F$5017,3),IF(AND(A166=\"Soil Cuttings\",E166=\"DRUMS\"),IF(F166<=3,520,(F166-1)*156+208),F166*G166)),2)","v":0}]
[null,null,null,null,null,null,null,{"$f":"ROUND(IF(AND(A167=\"Excavation\",E167=\"TONS\"),VLOOKUP(F167,Data!$D$18:$F$5017,3),IF(AND(A167=\"Soil Cuttings\",E167=\"DRUMS\"),IF(F167<=3,520,(F167-1)*156+208),F167*G167)),2)","v":0}]
["Non-Impacted Soil",null,null,null,"TONS",null,-45,{"$f":"ROUND(IF(AND(A168=\"Excavation\",E168=\"TONS\"),VLOOKUP(F168,Data!$D$18:$F$5017,3),IF(AND(A168=\"Soil Cuttings\",E168=\"DRUMS\"),IF(F168<=3,500,(F168-1)*150+200),F168*G168)),2)","v":0}]
["Treated Soil",null,null,null,"TONS",null,-30,{"$f":"ROUND(IF(AND(A169=\"Excavation\",E169=\"TONS\"),VLOOKUP(F169,Data!$D$18:$F$5017,3),IF(AND(A169=\"Soil Cuttings\",E169=\"DRUMS\"),IF(F169<=3,500,(F169-1)*150+200),F169*G169)),2)","v":0},null,{"$f":"IF(K146=TRUE,$N$17,IF(K147=TRUE,$N$18,IF(K148=TRUE,$N$19,IF(K149=TRUE,$N$20,0))))","v":0}]
["SUBTOTAL OF THIS PAGE",null,null,null,null,null,null,{"$f":"SUM(H146:H169)","v":0}]
["TOTAL DISPOSAL COSTS",null,null,null,null,null,null,{"$f":"SUM(J169)","v":0},null,{"$f":"IF(H171>0,1,0)","v":0}]
["Page               of               (Soil/Water Disposal Supplementary Sheet)"]

{"sheet":"Data","index":8,"n_rows":5019,"n_cols":6,"rows_kept":5019,"cut":false,"hidden":true,"merged":[[1,0,1,5],[7,0,7,2]]}
[]
["TONNAGE 1 - 99"]
[]
["Minimum Price",null,null,null,null,8840]
["Price / Ton (1 - 99 tons)",null,null,null,null,104]
[]
[null,null,null,null,"VARIABLE"]
["Tonnage Ranges",null,null,"Range Amounts","Price / Ton","Increments"]
[100,"-",250,{"$f":"C9-A9","v":150},192.4,{"$f":"(E9-E10)/D9","v":0.25653333333333328}]
[251,"-",500,{"$f":"C10-C9","v":250},153.92000000000002,{"$f":"(E10-E11)/D10","v":0.10816000000000002}]
[501,"-",1000,{"$f":"C11-C10","v":500},126.88000000000001,{"$f":"(E11-E12)/D11","v":4.5760000000000016E-2}]
[1001,"-",2000,{"$f":"C12-C11","v":1000},104,{"$f":"(E12-E13)/D12","v":1.0399999999999991E-2}]
[2001,"<",null,null,93.600000000000009]
[]
[]
[]
[null,null,null,"TONS","PRICE / TON","TOTAL"]
[null,null,null,1,{"$f":"F18/D18","v":8944},{"$f":"+$F$4+($F$5*D18)","v":8944}]
[null,null,null,2,{"$f":"F19/D19","v":4524},9048]
[null,null,null,3,3050.6666666666665,9152]
[null,null,null,4,2314,9256]
[null,null,null,5,1872,9360]
[null,null,null,6,1577.3333333333333,9464]
[null,null,null,7,1366.8571428571429,9568]
[null,null,null,8,1209,9672]
[null,null,null,9,1086.2222222222222,9776]
[null,null,null,10,988,9880]
[null,null,null,11,907.63636363636363,9984]
[null,null,null,12,840.66666666666663,10088]
[null,null,null,13,784,10192]
[null,null,null,14,735.42857142857144,10296]
[null,null,null,15,693.33333333333337,10400]
[null,null,null,16,656.5,10504]
[null,null,null,17,624,10608]
[null,null,null,18,595.11111111111109,10712]
[null,null,null,19,569.26315789473688,10816]
[null,null,null,20,546,10920]
[null,null,null,21,524.95238095238096,11024]
[null,null,null,22,505.81818181818181,11128]
[null,null,null,23,488.3478260869565,11232]
[null,null,null,24,472.33333333333331,11336]
[null,null,null,25,457.6,11440]
[null,null,null,26,444,11544]
[null,null,null,27,431.40740740740739,11648]
[null,null,null,28,419.71428571428572,11752]
[null,null,null,29,408.82758620689657,11856]
[null,null,null,30,398.66666666666669,11960]
[null,null,null,31,389.16129032258067,12064]
[null,null,null,32,380.25,12168]
[null,null,null,33,371.87878787878788,12272]
[null,null,null,34,364,12376]
[null,null,null,35,356.57142857142856,12480]
[null,null,null,36,349.55555555555554,12584]
[null,null,null,37,342.91891891891891,12688]
[null,null,null,38,336.63157894736844,12792]
[null,null,null,39,330.66666666666669,12896]
[null,null,null,40,325,13000]
[null,null,null,41,319.60975609756099,13104]
[null,null,null,42,314.47619047619048,13208]
[null,null,null,43,309.58139534883719,13312]
[null,null,null,44,304.90909090909093,13416]
[null,null,null,45,300.44444444444446,13520]
[null,null,null,46,296.17391304347825,13624]
[null,null,null,47,292.08510638297872,13728]
[null,null,null,48,288.16666666666669,13832]
[null,null,null,49,284.40816326530614,13936]
[null,null,null,50,280.8,14040]
[null,null,null,51,277.33333333333331,14144]
[null,null,null,52,274,14248]
[null,null,null,53,270.79245283018867,14352]
[null,null,null,54,267.7037037037037,14456]
[null,null,null,55,264.72727272727275,14560]
[null,null,null,56,261.85714285714283,14664]
[null,null,null,57,259.08771929824559,14768]
[null,null,null,58,256.41379310344826,14872]
[null,null,null,59,253.83050847457628,14976]
[null,null,null,60,251.33333333333334,15080]
[null,null,null,61,248.91803278688525,15184]
[null,null,null,62,246.58064516129033,15288]
[null,null,null,63,244.31746031746033,15392]
[null,null,null,64,242.125,15496]
[null,null,null,65,240,{"$f":"+$F$4+($F$5*D82)","v":15600}]
[null,null,null,66,{"$f":"F83/D83","v":237.93939393939394},15704]
[null,null,null,67,235.9402985074627,15808]
[null,null,null,68,234,15912]
[null,null,null,69,232.1159420289855,16016]
[null,null,null,70,230.28571428571428,16120]
[null,null,null,71,228.50704225352112,16224]
[null,null,null,72,226.77777777777777,16328]
[null,null,null,73,225.0958904109589,16432]
[null,null,null,74,223.45945945945945,16536]
[null,null,null,75,221.86666666666667,16640]
[null,null,null,76,220.31578947368422,16744]
[null,null,null,77,218.80519480519482,16848]
[null,null,null,78,217.33333333333334,16952]
[null,null,null,79,215.8987341772152,17056]
[null,null,null,80,214.5,17160]
[null,null,null,81,213.1358024691358,17264]
[null,null,null,82,211.80487804878049,17368]
[null,null,null,83,210.50602409638554,17472]
[null,null,null,84,209.23809523809524,17576]
[null,null,null,85,208,17680]
[null,null,null,86,206.7906976744186,17784]
[null,null,null,87,205.60919540229884,17888]
[null,null,null,88,204.45454545454547,17992]
[null,null,null,89,203.32584269662922,18096]
[null,null,null,90,202.22222222222223,18200]
[null,null,null,91,201.14285714285714,18304]
[null,null,null,92,200.08695652173913,18408]
[null,null,null,93,199.05376344086022,18512]
[null,null,null,94,198.04255319148936,18616]
[null,null,null,95,197.05263157894737,18720]
[null,null,null,96,196.08333333333334,18824]
[null,null,null,97,195.13402061855669,18928]
[null,null,null,98,194.20408163265307,19032]
[null,null,null,99,193.2929292929293,19136]
[null,null,null,100,{"$f":"E9","v":192.4},{"$f":"E117*D117","v":19240}]
[null,null,null,101,{"$f":"E117-$F$9","v":192.14346666666668},{"$f":"E118*D118","v":19406.490133333336}]
[null,null,null,102,191.88693333333336,19572.467200000003]
[null,null,null,103,191.63040000000004,19737.931200000003]
[null,null,null,104,191.37386666666671,19902.88213333334]
[null,null,null,105,191.11733333333339,20067.320000000007]
[null,null,null,106,190.86080000000007,20231.244800000008]
[null,null,null,107,190.60426666666675,20394.656533333342]
[null,null,null,108,190.34773333333342,20557.55520000001]
[null,null,null,109,190.0912000000001,20719.940800000011]
[null,null,null,110,189.83466666666678,20881.813333333346]
[null,null,null,111,189.57813333333345,21043.172800000015]
[null,null,null,112,189.32160000000013,21204.019200000013]
[null,null,null,113,189.06506666666681,21364.352533333349]
[null,null,null,114,188.80853333333349,21524.172800000018]
[null,null,null,115,188.55200000000016,21683.480000000018]
[null,null,null,116,188.29546666666684,21842.274133333354]
[null,null,null,117,188.03893333333352,22000.555200000021]
[null,null,null,118,187.78240000000019,22158.323200000024]
[null,null,null,119,187.52586666666687,22315.578133333358]
[null,null,null,120,187.26933333333355,22472.320000000025]
[null,null,null,121,187.01280000000023,22628.548800000026]
[null,null,null,122,186.7562666666669,22784.264533333364]
[null,null,null,123,186.49973333333358,22939.467200000032]
[null,null,null,124,186.24320000000026,23094.156800000033]
[null,null,null,125,185.98666666666693,23248.333333333369]
[null,null,null,126,185.73013333333361,23401.996800000034]
[null,null,null,127,185.47360000000029,23555.147200000036]
[null,null,null,128,185.21706666666697,23707.784533333372]
[null,null,null,129,184.96053333333364,23859.908800000041]
[null,null,null,130,184.70400000000032,24011.52000000004]
[null,null,null,131,184.447466666667,24162.618133333377]
[null,null,null,132,184.19093333333367,24313.203200000044]
[null,null,null,133,183.93440000000035,24463.275200000047]
[null,null,null,134,183.67786666666703,24612.834133333381]
[null,null,null,135,183.42133333333371,24761.880000000052]
[null,null,null,136,183.16480000000038,24910.412800000053]
[null,null,null,137,182.90826666666706,25058.432533333387]
[null,null,null,138,182.65173333333374,25205.939200000055]
[null,null,null,139,182.39520000000041,25352.932800000057]
[null,null,null,140,182.13866666666709,25499.413333333392]
[null,null,null,141,181.88213333333377,25645.380800000061]
[null,null,null,142,181.62560000000045,25790.835200000063]
[null,null,null,143,181.36906666666712,25935.776533333399]
[null,null,null,144,181.1125333333338,26080.204800000069]
[null,null,null,145,180.85600000000048,26224.120000000068]
[null,null,null,146,180.59946666666715,26367.522133333405]
[null,null,null,147,180.34293333333383,26510.411200000075]
[null,null,null,148,180.08640000000051,26652.787200000075]
[null,null,null,149,179.82986666666719,26794.650133333409]
[null,null,null,150,179.57333333333386,26936.00000000008]
[null,null,null,151,179.31680000000054,27076.836800000081]
[null,null,null,152,179.06026666666722,27217.160533333416]
[null,null,null,153,178.80373333333389,27356.971200000087]
[null,null,null,154,178.54720000000057,27496.268800000089]
[null,null,null,155,178.29066666666725,27635.053333333424]
[null,null,null,156,178.03413333333393,27773.324800000093]
[null,null,null,157,177.7776000000006,27911.083200000096]
[null,null,null,158,177.52106666666728,28048.328533333432]
[null,null,null,159,177.26453333333396,28185.060800000098]
[null,null,null,160,177.00800000000064,28321.280000000101]
[null,null,null,161,176.75146666666731,28456.986133333437]
[null,null,null,162,176.49493333333399,28592.179200000108]
[null,null,null,163,176.23840000000067,28726.859200000108]
[null,null,null,164,175.98186666666734,28861.026133333446]
[null,null,null,165,{"$f":"E181-$F$9","v":175.72533333333402},{"$f":"E182*D182","v":28994.680000000113}]
[null,null,null,166,175.4688000000007,29127.820800000114]
[null,null,null,167,175.21226666666738,29260.448533333452]
[null,null,null,168,174.95573333333405,29392.563200000121]
[null,null,null,169,174.69920000000073,29524.164800000122]
[null,null,null,170,174.44266666666741,29655.253333333458]
[null,null,null,171,174.18613333333408,29785.828800000127]
[null,null,null,172,173.92960000000076,29915.891200000129]
[null,null,null,173,173.67306666666744,30045.440533333465]
[null,null,null,174,173.41653333333412,30174.476800000135]
[null,null,null,175,173.16000000000079,30303.000000000138]
[null,null,null,176,172.90346666666747,30431.010133333475]
[null,null,null,177,172.64693333333415,30558.507200000146]
[null,null,null,178,172.39040000000082,30685.491200000146]
[null,null,null,179,172.1338666666675,30811.962133333484]
[null,null,null,180,171.87733333333418,30937.920000000151]
[null,null,null,181,171.62080000000086,31063.364800000156]
[null,null,null,182,171.36426666666753,31188.296533333491]
[null,null,null,183,171.10773333333421,31312.715200000159]
[null,null,null,184,170.85120000000089,31436.620800000164]
[null,null,null,185,170.59466666666756,31560.0133333335]
[null,null,null,186,170.33813333333424,31682.892800000169]
[null,null,null,187,170.08160000000092,31805.259200000171]
[null,null,null,188,169.8250666666676,31927.112533333508]
[null,null,null,189,169.56853333333427,32048.452800000177]
[null,null,null,190,169.31200000000095,32169.280000000181]
[null,null,null,191,169.05546666666763,32289.594133333518]
[null,null,null,192,168.7989333333343,32409.395200000188]
[null,null,null,193,168.54240000000098,32528.683200000189]
[null,null,null,194,168.28586666666766,32647.458133333526]
[null,null,null,195,168.02933333333434,32765.720000000194]
[null,null,null,196,167.77280000000101,32883.468800000199]
[null,null,null,197,167.51626666666769,33000.704533333534]
[null,null,null,198,167.25973333333437,33117.427200000202]
[null,null,null,199,167.00320000000104,33233.636800000211]
[null,null,null,200,166.74666666666772,33349.333333333547]
[null,null,null,201,166.4901333333344,33464.516800000216]
[null,null,null,202,166.23360000000108,33579.187200000219]
[null,null,null,203,165.97706666666775,33693.344533333555]
[null,null,null,204,165.72053333333443,33806.988800000225]
[null,null,null,205,165.46400000000111,33920.120000000228]
[null,null,null,206,165.20746666666778,34032.738133333565]
[null,null,null,207,164.95093333333446,34144.843200000236]
[null,null,null,208,164.69440000000114,34256.43520000024]
[null,null,null,209,164.43786666666782,34367.51413333357]
[null,null,null,210,164.18133333333449,34478.080000000242]
[null,null,null,211,163.92480000000117,34588.132800000247]
[null,null,null,212,163.66826666666785,34697.672533333585]
[null,null,null,213,163.41173333333452,34806.69920000025]
[null,null,null,214,163.1552000000012,34915.212800000256]
[null,null,null,215,162.89866666666788,35023.213333333595]
[null,null,null,216,162.64213333333456,35130.700800000261]
[null,null,null,217,162.38560000000123,35237.675200000267]
[null,null,null,218,162.12906666666791,35344.136533333607]
[null,null,null,219,161.87253333333459,35450.084800000273]
[null,null,null,220,161.61600000000126,35555.520000000281]
[null,null,null,221,161.35946666666794,35660.442133333614]
[null,null,null,222,161.10293333333462,35764.851200000288]
[null,null,null,223,160.8464000000013,35868.747200000289]
[null,null,null,224,160.58986666666797,35972.130133333623]
[null,null,null,225,160.33333333333465,36075.000000000298]
[null,null,null,226,160.07680000000133,36177.3568000003]
[null,null,null,227,159.820266666668,36279.200533333635]
[null,null,null,228,159.56373333333468,36380.53120000031]
[null,null,null,229,{"$f":"E245-$F$9","v":159.30720000000136},{"$f":"E246*D246","v":36481.348800000313}]
[null,null,null,230,159.05066666666804,36581.653333333648]
[null,null,null,231,158.79413333333471,36681.444800000318]
[null,null,null,232,158.53760000000139,36780.723200000321]
[null,null,null,233,158.28106666666807,36879.488533333657]
[null,null,null,234,158.02453333333474,36977.740800000327]
[null,null,null,235,157.76800000000142,37075.480000000331]
[null,null,null,236,157.5114666666681,37172.706133333668]
[null,null,null,237,157.25493333333478,37269.419200000339]
[null,null,null,238,156.99840000000145,37365.619200000343]
[null,null,null,239,156.74186666666813,37461.306133333681]
[null,null,null,240,156.48533333333481,37556.480000000352]
[null,null,null,241,156.22880000000148,37651.140800000358]
[null,null,null,242,155.97226666666816,37745.288533333696]
[null,null,null,243,155.71573333333484,37838.923200000369]
[null,null,null,244,155.45920000000152,37932.044800000367]
[null,null,null,245,155.20266666666819,38024.653333333707]
[null,null,null,246,154.94613333333487,38116.74880000038]
[null,null,null,247,154.68960000000155,38208.331200000379]
[null,null,null,248,154.43306666666822,38299.400533333719]
[null,null,null,249,154.1765333333349,38389.956800000393]
[null,null,null,250,153.92000000000158,38480.000000000393]
[null,null,null,251,{"$f":"E267-$F$10","v":153.81184000000158},38606.771840000394]
[null,null,null,252,153.70368000000158,38733.327360000396]
[null,null,null,253,153.59552000000159,38859.666560000398]
[null,null,null,254,153.48736000000159,38985.789440000401]
[null,null,null,255,153.37920000000159,39111.696000000404]
[null,null,null,256,153.27104000000159,39237.386240000407]
[null,null,null,257,153.16288000000159,39362.860160000411]
[null,null,null,258,153.05472000000159,39488.117760000408]
[null,null,null,259,152.9465600000016,39613.159040000413]
[null,null,null,260,152.8384000000016,39737.984000000419]
[null,null,null,261,152.7302400000016,39862.592640000417]
[null,null,null,262,152.6220800000016,39986.984960000416]
[null,null,null,263,152.5139200000016,40111.160960000423]
[null,null,null,264,152.40576000000161,40235.120640000423]
[null,null,null,265,152.29760000000161,40358.864000000423]
[null,null,null,266,152.18944000000161,40482.391040000432]
[null,null,null,267,152.08128000000161,40605.701760000433]
[null,null,null,268,151.97312000000161,40728.796160000435]
[null,null,null,269,151.86496000000162,40851.674240000437]
[null,null,null,270,151.75680000000162,40974.33600000044]
[null,null,null,271,151.64864000000162,41096.781440000443]
[null,null,null,272,151.54048000000162,41219.010560000439]
[null,null,null,273,151.43232000000162,41341.023360000443]
[null,null,null,274,151.32416000000163,41462.819840000448]
[null,null,null,275,151.21600000000163,41584.400000000445]
[null,null,null,276,151.10784000000163,41705.763840000451]
[null,null,null,277,150.99968000000163,41826.911360000449]
[null,null,null,278,150.89152000000163,41947.842560000456]
[null,null,null,279,150.78336000000164,42068.557440000455]
[null,null,null,280,150.67520000000164,42189.056000000455]
[null,null,null,281,150.56704000000164,42309.338240000463]
[null,null,null,282,150.45888000000164,42429.404160000464]
[null,null,null,283,150.35072000000164,42549.253760000465]
[null,null,null,284,150.24256000000165,42668.887040000467]
[null,null,null,285,150.13440000000165,42788.304000000469]
[null,null,null,286,150.02624000000165,42907.504640000472]
[null,null,null,287,149.91808000000165,43026.488960000475]
[null,null,null,288,149.80992000000165,43145.256960000479]
[null,null,null,289,149.70176000000166,43263.808640000476]
[null,null,null,290,149.59360000000166,43382.14400000048]
[null,null,null,291,149.48544000000166,43500.263040000485]
[null,null,null,292,149.37728000000166,43618.165760000484]
[null,null,null,293,149.26912000000166,{"$f":"E310*D310","v":43735.85216000049}]
[null,null,null,294,149.16096000000167,43853.322240000489]
[null,null,null,295,149.05280000000167,43970.576000000488]
[null,null,null,296,148.94464000000167,44087.613440000496]
[null,null,null,297,148.83648000000167,44204.434560000496]
[null,null,null,298,148.72832000000167,44321.039360000497]
[null,null,null,299,148.62016000000168,44437.427840000499]
[null,null,null,300,148.51200000000168,44553.600000000501]
[null,null,null,301,148.40384000000168,44669.555840000503]
[null,null,null,302,148.29568000000168,44785.295360000506]
[null,null,null,303,148.18752000000168,44900.818560000509]
[null,null,null,304,148.07936000000169,45016.125440000513]
[null,null,null,305,147.97120000000169,45131.216000000517]
[null,null,null,306,147.86304000000169,45246.090240000514]
[null,null,null,307,147.75488000000169,45360.748160000519]
[null,null,null,308,147.64672000000169,45475.189760000525]
[null,null,null,309,147.5385600000017,45589.415040000524]
[null,null,null,310,147.4304000000017,45703.424000000523]
[null,null,null,311,147.3222400000017,45817.21664000053]
[null,null,null,312,147.2140800000017,45930.79296000053]
[null,null,null,313,147.1059200000017,46044.152960000531]
[null,null,null,314,146.9977600000017,46157.296640000539]
[null,null,null,315,{"$f":"E331-$F$10","v":146.88960000000171},46270.22400000054]
[null,null,null,316,146.78144000000171,46382.935040000542]
[null,null,null,317,146.67328000000171,46495.429760000545]
[null,null,null,318,146.56512000000171,46607.708160000548]
[null,null,null,319,146.45696000000171,46719.770240000544]
[null,null,null,320,146.34880000000172,46831.616000000548]
[null,null,null,321,146.24064000000172,46943.245440000552]
[null,null,null,322,146.13248000000172,47054.658560000556]
[null,null,null,323,146.02432000000172,47165.855360000554]
[null,null,null,324,145.91616000000172,47276.83584000056]
[null,null,null,325,145.80800000000173,47387.600000000559]
[null,null,null,326,145.69984000000173,47498.147840000565]
[null,null,null,327,145.59168000000173,47608.479360000565]
[null,null,null,328,145.48352000000173,47718.594560000565]
[null,null,null,329,145.37536000000173,47828.493440000573]
[null,null,null,330,145.26720000000174,47938.176000000574]
[null,null,null,331,145.15904000000174,48047.642240000576]
[null,null,null,332,145.05088000000174,48156.892160000578]
[null,null,null,333,144.94272000000174,48265.92576000058]
[null,null,null,334,144.83456000000174,48374.743040000583]
[null,null,null,335,144.72640000000175,48483.344000000587]
[null,null,null,336,144.61824000000175,48591.728640000591]
[null,null,null,337,144.51008000000175,48699.896960000588]
[null,null,null,338,144.40192000000175,48807.848960000592]
[null,null,null,339,144.29376000000175,48915.584640000598]
[null,null,null,340,144.18560000000176,49023.104000000596]
[null,null,null,341,144.07744000000176,49130.407040000602]
[null,null,null,342,143.96928000000176,49237.493760000601]
[null,null,null,343,143.86112000000176,49344.364160000601]
[null,null,null,344,143.75296000000176,49451.018240000609]
[null,null,null,345,143.64480000000177,49557.456000000609]
[null,null,null,346,143.53664000000177,49663.677440000611]
[null,null,null,347,143.42848000000177,49769.682560000612]
[null,null,null,348,143.32032000000177,49875.471360000614]
[null,null,null,349,143.21216000000177,49981.043840000617]
[null,null,null,350,143.10400000000178,50086.40000000062]
[null,null,null,351,142.99584000000178,50191.539840000623]
[null,null,null,352,142.88768000000178,50296.463360000627]
[null,null,null,353,142.77952000000178,50401.170560000632]
[null,null,null,354,142.67136000000178,50505.661440000629]
[null,null,null,355,142.56320000000179,50609.936000000635]
[null,null,null,356,142.45504000000179,50713.994240000633]
[null,null,null,357,142.34688000000179,{"$f":"E374*D374","v":50817.836160000639}]
[null,null,null,358,142.23872000000179,50921.461760000639]
[null,null,null,359,142.13056000000179,51024.871040000646]
[null,null,null,360,142.0224000000018,51128.064000000646]
[null,null,null,361,141.9142400000018,51231.040640000647]
[null,null,null,362,141.8060800000018,51333.800960000648]
[null,null,null,363,141.6979200000018,51436.344960000657]
[null,null,null,364,141.5897600000018,51538.672640000659]
[null,null,null,365,141.48160000000181,51640.784000000662]
[null,null,null,366,141.37344000000181,51742.679040000665]
[null,null,null,367,141.26528000000181,51844.357760000661]
[null,null,null,368,141.15712000000181,51945.820160000665]
[null,null,null,369,141.04896000000181,52047.066240000669]
[null,null,null,370,140.94080000000181,52148.096000000674]
[null,null,null,371,140.83264000000182,52248.909440000672]
[null,null,null,372,140.72448000000182,52349.506560000678]
[null,null,null,373,140.61632000000182,52449.887360000677]
[null,null,null,374,140.50816000000182,52550.051840000684]
[null,null,null,375,140.40000000000182,52650.000000000684]
[null,null,null,376,140.29184000000183,52749.731840000684]
[null,null,null,377,140.18368000000183,52849.247360000692]
[null,null,null,378,140.07552000000183,52948.546560000694]
[null,null,null,379,{"$f":"E395-$F$10","v":139.96736000000183},53047.629440000695]
[null,null,null,380,139.85920000000183,53146.496000000698]
[null,null,null,381,139.75104000000184,53245.1462400007]
[null,null,null,382,139.64288000000184,53343.580160000703]
[null,null,null,383,139.53472000000184,53441.797760000707]
[null,null,null,384,139.42656000000184,53539.799040000711]
[null,null,null,385,139.31840000000184,53637.584000000708]
[null,null,null,386,139.21024000000185,53735.152640000713]
[null,null,null,387,139.10208000000185,53832.504960000719]
[null,null,null,388,138.99392000000185,53929.640960000717]
[null,null,null,389,138.88576000000185,54026.560640000724]
[null,null,null,390,138.77760000000185,54123.264000000723]
[null,null,null,391,138.66944000000186,54219.751040000723]
[null,null,null,392,138.56128000000186,54316.021760000731]
[null,null,null,393,138.45312000000186,54412.076160000732]
[null,null,null,394,138.34496000000186,54507.914240000733]
[null,null,null,395,138.23680000000186,54603.536000000735]
[null,null,null,396,138.12864000000187,54698.941440000737]
[null,null,null,397,138.02048000000187,54794.13056000074]
[null,null,null,398,137.91232000000187,54889.103360000743]
[null,null,null,399,137.80416000000187,54983.859840000747]
[null,null,null,400,137.69600000000187,55078.400000000751]
[null,null,null,401,137.58784000000188,55172.723840000755]
[null,null,null,402,137.47968000000188,55266.831360000753]
[null,null,null,403,137.37152000000188,55360.722560000759]
[null,null,null,404,137.26336000000188,55454.397440000757]
[null,null,null,405,137.15520000000188,55547.856000000764]
[null,null,null,406,137.04704000000189,55641.098240000763]
[null,null,null,407,136.93888000000189,55734.124160000771]
[null,null,null,408,136.83072000000189,55826.933760000771]
[null,null,null,409,136.72256000000189,55919.527040000772]
[null,null,null,410,136.61440000000189,56011.904000000774]
[null,null,null,411,136.5062400000019,56104.064640000775]
[null,null,null,412,136.3980800000019,56196.008960000785]
[null,null,null,413,136.2899200000019,56287.736960000788]
[null,null,null,414,136.1817600000019,56379.248640000784]
[null,null,null,415,136.0736000000019,56470.544000000787]
[null,null,null,416,135.96544000000191,56561.623040000792]
[null,null,null,417,135.85728000000191,56652.485760000796]
[null,null,null,418,135.74912000000191,56743.132160000801]
[null,null,null,419,135.64096000000191,56833.5622400008]
[null,null,null,420,135.53280000000191,56923.776000000806]
[null,null,null,421,135.42464000000192,{"$f":"E438*D438","v":57013.773440000805}]
[null,null,null,422,135.31648000000192,57103.554560000812]
[null,null,null,423,135.20832000000192,57193.119360000812]
[null,null,null,424,135.10016000000192,57282.467840000812]
[null,null,null,425,134.99200000000192,57371.600000000821]
[null,null,null,426,134.88384000000192,57460.515840000822]
[null,null,null,427,134.77568000000193,57549.215360000824]
[null,null,null,428,134.66752000000193,57637.698560000827]
[null,null,null,429,134.55936000000193,57725.965440000829]
[null,null,null,430,134.45120000000193,57814.016000000833]
[null,null,null,431,134.34304000000193,57901.850240000836]
[null,null,null,432,134.23488000000194,57989.468160000833]
[null,null,null,433,134.12672000000194,58076.869760000838]
[null,null,null,434,134.01856000000194,58164.055040000843]
[null,null,null,435,133.91040000000194,58251.024000000842]
[null,null,null,436,133.80224000000194,58337.776640000848]
[null,null,null,437,133.69408000000195,58424.312960000854]
[null,null,null,438,133.58592000000195,58510.632960000854]
[null,null,null,439,133.47776000000195,58596.736640000854]
[null,null,null,440,133.36960000000195,58682.624000000862]
[null,null,null,441,133.26144000000195,58768.295040000863]
[null,null,null,442,133.15328000000196,58853.749760000865]
[null,null,null,443,{"$f":"E459-$F$10","v":133.04512000000196},58938.988160000867]
[null,null,null,444,132.93696000000196,59024.010240000869]
[null,null,null,445,132.82880000000196,59108.816000000872]
[null,null,null,446,132.72064000000196,59193.405440000875]
[null,null,null,447,132.61248000000197,59277.778560000879]
[null,null,null,448,132.50432000000197,59361.935360000884]
[null,null,null,449,132.39616000000197,59445.875840000881]
[null,null,null,450,132.28800000000197,59529.600000000886]
[null,null,null,451,132.17984000000197,59613.107840000892]
[null,null,null,452,132.07168000000198,59696.399360000891]
[null,null,null,453,131.96352000000198,59779.474560000897]
[null,null,null,454,131.85536000000198,59862.333440000897]
[null,null,null,455,131.74720000000198,59944.976000000905]
[null,null,null,456,131.63904000000198,60027.402240000905]
[null,null,null,457,131.53088000000199,60109.612160000906]
[null,null,null,458,131.42272000000199,60191.605760000908]
[null,null,null,459,131.31456000000199,60273.38304000091]
[null,null,null,460,131.20640000000199,60354.944000000913]
[null,null,null,461,131.09824000000199,60436.288640000916]
[null,null,null,462,130.990080000002,60517.416960000919]
[null,null,null,463,130.881920000002,60598.328960000923]
[null,null,null,464,130.773760000002,60679.024640000927]
[null,null,null,465,130.665600000002,60759.504000000932]
[null,null,null,466,130.557440000002,60839.76704000093]
[null,null,null,467,130.44928000000201,60919.813760000936]
[null,null,null,468,130.34112000000201,60999.644160000942]
[null,null,null,469,130.23296000000201,61079.258240000941]
[null,null,null,470,130.12480000000201,61158.656000000949]
[null,null,null,471,130.01664000000201,61237.837440000949]
[null,null,null,472,129.90848000000202,61316.80256000095]
[null,null,null,473,129.80032000000202,61395.551360000951]
[null,null,null,474,129.69216000000202,61474.08384000096]
[null,null,null,475,129.58400000000202,61552.400000000962]
[null,null,null,476,129.47584000000202,61630.499840000964]
[null,null,null,477,129.36768000000203,61708.383360000968]
[null,null,null,478,129.25952000000203,61786.050560000971]
[null,null,null,479,129.15136000000203,61863.501440000975]
[null,null,null,480,129.04320000000203,61940.736000000972]
[null,null,null,481,128.93504000000203,62017.754240000977]
[null,null,null,482,128.82688000000203,62094.556160000982]
[null,null,null,483,128.71872000000204,62171.141760000981]
[null,null,null,484,128.61056000000204,62247.511040000987]
[null,null,null,485,128.50240000000204,{"$f":"E502*D502","v":62323.664000000987}]
[null,null,null,486,128.39424000000204,62399.600640000994]
[null,null,null,487,128.28608000000204,62475.320960000994]
[null,null,null,488,128.17792000000205,62550.824960001002]
[null,null,null,489,128.06976000000205,62626.112640001003]
[null,null,null,490,127.96160000000205,62701.184000001005]
[null,null,null,491,127.85344000000205,62776.039040001007]
[null,null,null,492,127.74528000000205,62850.67776000101]
[null,null,null,493,127.63712000000206,62925.100160001013]
[null,null,null,494,127.52896000000206,62999.306240001017]
[null,null,null,495,127.42080000000206,63073.296000001021]
[null,null,null,496,127.31264000000206,63147.069440001025]
[null,null,null,497,127.20448000000206,63220.626560001023]
[null,null,null,498,127.09632000000207,63293.967360001028]
[null,null,null,499,126.98816000000207,63367.091840001034]
[null,null,null,500,126.88000000000207,63440.000000001033]
[null,null,null,501,{"$f":"E517-$F$11","v":126.83424000000207},63543.95424000104]
[null,null,null,502,126.78848000000207,63647.816960001037]
[null,null,null,503,126.74272000000207,63751.58816000104]
[null,null,null,504,126.69696000000206,63855.267840001041]
[null,null,null,505,126.65120000000206,63958.85600000104]
[null,null,null,506,126.60544000000206,64062.352640001045]
[null,null,null,507,126.55968000000206,64165.757760001048]
[null,null,null,508,126.51392000000206,64269.071360001049]
[null,null,null,509,126.46816000000206,64372.293440001049]
[null,null,null,510,126.42240000000206,64475.424000001047]
[null,null,null,511,126.37664000000206,64578.46304000105]
[null,null,null,512,126.33088000000205,64681.410560001052]
[null,null,null,513,126.28512000000205,64784.266560001051]
[null,null,null,514,126.23936000000205,64887.031040001057]
[null,null,null,515,126.19360000000205,64989.704000001053]
[null,null,null,516,126.14784000000205,65092.285440001055]
[null,null,null,517,126.10208000000205,65194.775360001062]
[null,null,null,518,126.05632000000205,65297.17376000106]
[null,null,null,519,126.01056000000204,65399.480640001064]
[null,null,null,520,125.96480000000204,65501.696000001066]
[null,null,null,521,125.91904000000204,65603.819840001059]
[null,null,null,522,125.87328000000204,65705.852160001072]
[null,null,null,523,125.82752000000204,65807.792960001068]
[null,null,null,524,125.78176000000204,65909.642240001063]
[null,null,null,525,125.73600000000204,66011.400000001071]
[null,null,null,526,125.69024000000204,66113.066240001077]
[null,null,null,527,125.64448000000203,66214.640960001067]
[null,null,null,528,125.59872000000203,66316.124160001069]
[null,null,null,529,125.55296000000203,66417.51584000107]
[null,null,null,530,125.50720000000203,66518.816000001068]
[null,null,null,531,125.46144000000203,66620.02464000108]
[null,null,null,532,125.41568000000203,66721.141760001075]
[null,null,null,533,125.36992000000203,66822.167360001084]
[null,null,null,534,125.32416000000202,66923.101440001075]
[null,null,null,535,125.27840000000202,67023.94400000108]
[null,null,null,536,125.23264000000202,67124.695040001083]
[null,null,null,537,125.18688000000202,67225.354560001084]
[null,null,null,538,125.14112000000202,67325.922560001083]
[null,null,null,539,125.09536000000202,67426.399040001081]
[null,null,null,540,125.04960000000202,67526.784000001091]
[null,null,null,541,125.00384000000201,67627.077440001085]
[null,null,null,542,124.95808000000201,67727.279360001092]
[null,null,null,543,124.91232000000201,67827.389760001097]
[null,null,null,544,124.86656000000201,67927.4086400011]
[null,null,null,545,124.82080000000201,68027.336000001102]
[null,null,null,546,124.77504000000201,68127.171840001101]
[null,null,null,547,124.72928000000201,68226.916160001099]
[null,null,null,548,124.68352000000201,68326.568960001096]
[null,null,null,549,124.637760000002,{"$f":"E566*D566","v":68426.130240001105}]
[null,null,null,550,124.592000000002,68525.600000001097]
[null,null,null,551,124.546240000002,68624.978240001103]
[null,null,null,552,124.500480000002,68724.264960001106]
[null,null,null,553,124.454720000002,68823.460160001108]
[null,null,null,554,124.408960000002,68922.563840001108]
[null,null,null,555,124.363200000002,69021.576000001107]
[null,null,null,556,124.31744000000199,69120.496640001104]
[null,null,null,557,124.27168000000199,69219.325760001113]
[null,null,null,558,124.22592000000199,69318.063360001106]
[null,null,null,559,124.18016000000199,69416.709440001112]
[null,null,null,560,124.13440000000199,69515.264000001116]
[null,null,null,561,124.08864000000199,69613.727040001118]
[null,null,null,562,124.04288000000199,69712.098560001119]
[null,null,null,563,123.99712000000198,69810.378560001118]
[null,null,null,564,123.95136000000198,69908.567040001115]
[null,null,null,565,{"$f":"E581-$F$11","v":123.90560000000198},70006.664000001125]
[null,null,null,566,123.85984000000198,70104.669440001118]
[null,null,null,567,123.81408000000198,70202.583360001125]
[null,null,null,568,123.76832000000198,70300.405760001129]
[null,null,null,569,123.72256000000198,70398.136640001117]
[null,null,null,570,123.67680000000198,70495.776000001133]
[null,null,null,571,123.63104000000197,70593.323840001132]
[null,null,null,572,123.58528000000197,70690.78016000113]
[null,null,null,573,123.53952000000197,70788.144960001126]
[null,null,null,574,123.49376000000197,70885.418240001134]
[null,null,null,575,123.44800000000197,70982.600000001126]
[null,null,null,576,123.40224000000197,71079.690240001131]
[null,null,null,577,123.35648000000197,71176.688960001135]
[null,null,null,578,123.31072000000196,71273.596160001136]
[null,null,null,579,123.26496000000196,71370.411840001136]
[null,null,null,580,123.21920000000196,71467.136000001134]
[null,null,null,581,123.17344000000196,71563.768640001144]
[null,null,null,582,123.12768000000196,71660.309760001139]
[null,null,null,583,123.08192000000196,71756.759360001146]
[null,null,null,584,123.03616000000196,71853.117440001137]
[null,null,null,585,122.99040000000196,71949.384000001141]
[null,null,null,586,122.94464000000195,72045.559040001142]
[null,null,null,587,122.89888000000195,72141.642560001143]
[null,null,null,588,122.85312000000195,72237.634560001141]
[null,null,null,589,122.80736000000195,72333.535040001152]
[null,null,null,590,122.76160000000195,72429.344000001147]
[null,null,null,591,122.71584000000195,72525.061440001155]
[null,null,null,592,122.67008000000195,72620.687360001146]
[null,null,null,593,122.62432000000194,72716.22176000115]
[null,null,null,594,122.57856000000194,72811.664640001152]
[null,null,null,595,122.53280000000194,72907.016000001153]
[null,null,null,596,122.48704000000194,73002.275840001152]
[null,null,null,597,122.44128000000194,73097.444160001163]
[null,null,null,598,122.39552000000194,73192.520960001159]
[null,null,null,599,122.34976000000194,73287.506240001167]
[null,null,null,600,122.30400000000193,73382.400000001158]
[null,null,null,601,122.25824000000193,73477.202240001163]
[null,null,null,602,122.21248000000193,73571.912960001166]
[null,null,null,603,122.16672000000193,73666.532160001167]
[null,null,null,604,122.12096000000193,73761.059840001166]
[null,null,null,605,122.07520000000193,73855.496000001163]
[null,null,null,606,122.02944000000193,73949.840640001174]
[null,null,null,607,121.98368000000193,74044.093760001168]
[null,null,null,608,121.93792000000192,74138.255360001174]
[null,null,null,609,121.89216000000192,74232.325440001165]
[null,null,null,610,121.84640000000192,74326.304000001168]
[null,null,null,611,121.80064000000192,74420.191040001169]
[null,null,null,612,121.75488000000192,74513.986560001169]
[null,null,null,613,121.70912000000192,{"$f":"E630*D630","v":74607.690560001181}]
[null,null,null,614,121.66336000000192,74701.303040001178]
[null,null,null,615,121.61760000000191,74794.824000001172]
[null,null,null,616,121.57184000000191,74888.253440001179]
[null,null,null,617,121.52608000000191,74981.591360001185]
[null,null,null,618,121.48032000000191,75074.837760001174]
[null,null,null,619,121.43456000000191,75167.992640001175]
[null,null,null,620,121.38880000000191,75261.056000001176]
[null,null,null,621,121.34304000000191,75354.027840001188]
[null,null,null,622,121.2972800000019,75446.908160001185]
[null,null,null,623,121.2515200000019,75539.69696000118]
[null,null,null,624,121.2057600000019,75632.394240001187]
[null,null,null,625,121.1600000000019,75725.000000001193]
[null,null,null,626,121.1142400000019,75817.514240001183]
[null,null,null,627,121.0684800000019,75909.936960001185]
[null,null,null,628,121.0227200000019,76002.268160001186]
[null,null,null,629,{"$f":"E645-$F$11","v":120.9769600000019},76094.507840001199]
[null,null,null,630,120.93120000000189,76186.656000001196]
[null,null,null,631,120.88544000000189,76278.712640001191]
[null,null,null,632,120.83968000000189,76370.677760001199]
[null,null,null,633,120.79392000000189,76462.551360001191]
[null,null,null,634,120.74816000000189,76554.333440001195]
[null,null,null,635,120.70240000000189,76646.024000001198]
[null,null,null,636,120.65664000000189,76737.623040001199]
[null,null,null,637,120.61088000000188,76829.130560001198]
[null,null,null,638,120.56512000000188,76920.546560001196]
[null,null,null,639,120.51936000000188,77011.871040001206]
[null,null,null,640,120.47360000000188,77103.1040000012]
[null,null,null,641,120.42784000000188,77194.245440001207]
[null,null,null,642,120.38208000000188,77285.295360001212]
[null,null,null,643,120.33632000000188,77376.2537600012]
[null,null,null,644,120.29056000000188,77467.120640001202]
[null,null,null,645,120.24480000000187,77557.896000001216]
[null,null,null,646,120.19904000000187,77648.579840001214]
[null,null,null,647,120.15328000000187,77739.17216000121]
[null,null,null,648,120.10752000000187,77829.672960001219]
[null,null,null,649,120.06176000000187,77920.082240001211]
[null,null,null,650,120.01600000000187,78010.400000001217]
[null,null,null,651,119.97024000000187,78100.62624000122]
[null,null,null,652,119.92448000000186,78190.760960001222]
[null,null,null,653,119.87872000000186,78280.804160001222]
[null,null,null,654,119.83296000000186,78370.75584000122]
[null,null,null,655,119.78720000000186,78460.616000001217]
[null,null,null,656,119.74144000000186,78550.384640001226]
[null,null,null,657,119.69568000000186,78640.061760001219]
[null,null,null,658,119.64992000000186,78729.647360001225]
[null,null,null,659,119.60416000000185,78819.141440001229]
[null,null,null,660,119.55840000000185,78908.544000001217]
[null,null,null,661,119.51264000000185,78997.855040001217]
[null,null,null,662,119.46688000000185,79087.074560001231]
[null,null,null,663,119.42112000000185,79176.202560001228]
[null,null,null,664,119.37536000000185,79265.239040001223]
[null,null,null,665,119.32960000000185,79354.184000001231]
[null,null,null,666,119.28384000000185,79443.037440001222]
[null,null,null,667,119.23808000000184,79531.799360001227]
[null,null,null,668,119.19232000000184,79620.46976000123]
[null,null,null,669,119.14656000000184,79709.048640001231]
[null,null,null,670,119.10080000000184,79797.53600000123]
[null,null,null,671,119.05504000000184,79885.931840001227]
[null,null,null,672,119.00928000000184,79974.236160001237]
[null,null,null,673,118.96352000000184,80062.448960001231]
[null,null,null,674,118.91776000000183,80150.570240001238]
[null,null,null,675,118.87200000000183,80238.600000001243]
[null,null,null,676,118.82624000000183,80326.538240001231]
[null,null,null,677,118.78048000000183,{"$f":"E694*D694","v":80414.384960001233}]
[null,null,null,678,118.73472000000183,80502.140160001247]
[null,null,null,679,118.68896000000183,80589.803840001245]
[null,null,null,680,118.64320000000183,80677.376000001241]
[null,null,null,681,118.59744000000182,80764.85664000125]
[null,null,null,682,118.55168000000182,80852.245760001242]
[null,null,null,683,118.50592000000182,80939.543360001247]
[null,null,null,684,118.46016000000182,81026.749440001251]
[null,null,null,685,118.41440000000182,81113.864000001253]
[null,null,null,686,118.36864000000182,81200.887040001253]
[null,null,null,687,118.32288000000182,81287.818560001251]
[null,null,null,688,118.27712000000182,81374.658560001248]
[null,null,null,689,118.23136000000181,81461.407040001257]
[null,null,null,690,118.18560000000181,81548.06400000125]
[null,null,null,691,118.13984000000181,81634.629440001256]
[null,null,null,692,118.09408000000181,81721.10336000126]
[null,null,null,693,{"$f":"E709-$F$11","v":118.04832000000181},81807.485760001247]
[null,null,null,694,118.00256000000181,81893.776640001248]
[null,null,null,695,117.95680000000181,81979.976000001261]
[null,null,null,696,117.9110400000018,82066.083840001258]
[null,null,null,697,117.8652800000018,82152.100160001253]
[null,null,null,698,117.8195200000018,82238.024960001261]
[null,null,null,699,117.7737600000018,82323.858240001253]
[null,null,null,700,117.7280000000018,82409.600000001257]
[null,null,null,701,117.6822400000018,82495.25024000126]
[null,null,null,702,117.6364800000018,82580.808960001261]
[null,null,null,703,117.5907200000018,82666.27616000126]
[null,null,null,704,117.54496000000179,82751.651840001257]
[null,null,null,705,117.49920000000179,82836.936000001268]
[null,null,null,706,117.45344000000179,82922.128640001261]
[null,null,null,707,117.40768000000179,83007.229760001268]
[null,null,null,708,117.36192000000179,83092.239360001273]
[null,null,null,709,117.31616000000179,83177.157440001261]
[null,null,null,710,117.27040000000179,83261.984000001263]
[null,null,null,711,117.22464000000178,83346.719040001262]
[null,null,null,712,117.17888000000178,83431.362560001275]
[null,null,null,713,117.13312000000178,83515.914560001271]
[null,null,null,714,117.08736000000178,83600.375040001265]
[null,null,null,715,117.04160000000178,83684.744000001272]
[null,null,null,716,116.99584000000178,83769.021440001277]
[null,null,null,717,116.95008000000178,83853.207360001266]
[null,null,null,718,116.90432000000177,83937.301760001268]
[null,null,null,719,116.85856000000177,84021.304640001268]
[null,null,null,720,116.81280000000177,84105.216000001281]
[null,null,null,721,116.76704000000177,84189.035840001277]
[null,null,null,722,116.72128000000177,84272.764160001272]
[null,null,null,723,116.67552000000177,84356.40096000128]
[null,null,null,724,116.62976000000177,84439.946240001285]
[null,null,null,725,116.58400000000177,84523.400000001275]
[null,null,null,726,116.53824000000176,84606.762240001277]
[null,null,null,727,116.49248000000176,84690.032960001277]
[null,null,null,728,116.44672000000176,84773.212160001276]
[null,null,null,729,116.40096000000176,84856.299840001288]
[null,null,null,730,116.35520000000176,84939.296000001283]
[null,null,null,731,116.30944000000176,85022.200640001291]
[null,null,null,732,116.26368000000176,85105.013760001282]
[null,null,null,733,116.21792000000175,85187.735360001287]
[null,null,null,734,116.17216000000175,85270.365440001289]
[null,null,null,735,116.12640000000175,85352.90400000129]
[null,null,null,736,116.08064000000175,85435.351040001289]
[null,null,null,737,116.03488000000175,85517.706560001287]
[null,null,null,738,115.98912000000175,85599.970560001297]
[null,null,null,739,115.94336000000175,85682.143040001291]
[null,null,null,740,115.89760000000175,85764.224000001297]
[null,null,null,741,115.85184000000174,{"$f":"E758*D758","v":85846.213440001287}]
[null,null,null,742,115.80608000000174,85928.11136000129]
[null,null,null,743,115.76032000000174,86009.917760001292]
[null,null,null,744,115.71456000000174,86091.632640001291]
[null,null,null,745,115.66880000000174,86173.256000001289]
[null,null,null,746,115.62304000000174,86254.7878400013]
[null,null,null,747,115.57728000000174,86336.228160001294]
[null,null,null,748,115.53152000000173,86417.576960001301]
[null,null,null,749,115.48576000000173,86498.834240001292]
[null,null,null,750,115.44000000000173,86580.000000001295]
[null,null,null,751,115.39424000000173,86661.074240001297]
[null,null,null,752,115.34848000000173,86742.056960001297]
[null,null,null,753,115.30272000000173,86822.948160001295]
[null,null,null,754,115.25696000000173,86903.747840001306]
[null,null,null,755,115.21120000000172,86984.456000001301]
[null,null,null,756,115.16544000000172,87065.072640001308]
[null,null,null,757,{"$f":"E773-$F$11","v":115.11968000000172},87145.597760001299]
[null,null,null,758,115.07392000000172,87226.031360001303]
[null,null,null,759,115.02816000000172,87306.373440001305]
[null,null,null,760,114.98240000000172,87386.624000001306]
[null,null,null,761,114.93664000000172,87466.783040001304]
[null,null,null,762,114.89088000000172,87546.850560001301]
[null,null,null,763,114.84512000000171,87626.826560001311]
[null,null,null,764,114.79936000000171,87706.711040001304]
[null,null,null,765,114.75360000000171,87786.50400000131]
[null,null,null,766,114.70784000000171,87866.205440001315]
[null,null,null,767,114.66208000000171,87945.815360001317]
[null,null,null,768,114.61632000000171,88025.333760001318]
[null,null,null,769,114.57056000000171,88104.760640001317]
[null,null,null,770,114.5248000000017,88184.096000001315]
[null,null,null,771,114.4790400000017,88263.33984000131]
[null,null,null,772,114.4332800000017,88342.492160001319]
[null,null,null,773,114.3875200000017,88421.552960001311]
[null,null,null,774,114.3417600000017,88500.522240001315]
[null,null,null,775,114.2960000000017,88579.400000001318]
[null,null,null,776,114.2502400000017,88658.18624000132]
[null,null,null,777,114.20448000000169,88736.880960001319]
[null,null,null,778,114.15872000000169,88815.484160001317]
[null,null,null,779,114.11296000000169,88893.995840001313]
[null,null,null,780,114.06720000000169,88972.416000001322]
[null,null,null,781,114.02144000000169,89050.744640001314]
[null,null,null,782,113.97568000000169,89128.981760001319]
[null,null,null,783,113.92992000000169,89207.127360001323]
[null,null,null,784,113.88416000000169,89285.181440001325]
[null,null,null,785,113.83840000000168,89363.144000001324]
[null,null,null,786,113.79264000000168,89441.015040001323]
[null,null,null,787,113.74688000000168,89518.794560001319]
[null,null,null,788,113.70112000000168,89596.482560001328]
[null,null,null,789,113.65536000000168,89674.079040001321]
[null,null,null,790,113.60960000000168,89751.584000001327]
[null,null,null,791,113.56384000000168,89828.997440001331]
[null,null,null,792,113.51808000000167,89906.319360001333]
[null,null,null,793,113.47232000000167,89983.549760001333]
[null,null,null,794,113.42656000000167,90060.688640001332]
[null,null,null,795,113.38080000000167,90137.736000001329]
[null,null,null,796,113.33504000000167,90214.691840001324]
[null,null,null,797,113.28928000000167,90291.556160001332]
[null,null,null,798,113.24352000000167,90368.328960001323]
[null,null,null,799,113.19776000000167,90445.010240001327]
[null,null,null,800,113.15200000000166,90521.60000000133]
[null,null,null,801,113.10624000000166,90598.098240001331]
[null,null,null,802,113.06048000000166,90674.50496000133]
[null,null,null,803,113.01472000000166,90750.820160001327]
[null,null,null,804,112.96896000000166,90827.043840001337]
[null,null,null,805,112.92320000000166,{"$f":"E822*D822","v":90903.176000001331}]
[null,null,null,806,112.87744000000166,90979.216640001338]
[null,null,null,807,112.83168000000165,91055.165760001328]
[null,null,null,808,112.78592000000165,91131.023360001331]
[null,null,null,809,112.74016000000165,91206.789440001332]
[null,null,null,810,112.69440000000165,91282.464000001331]
[null,null,null,811,112.64864000000165,91358.047040001344]
[null,null,null,812,112.60288000000165,91433.53856000134]
[null,null,null,813,112.55712000000165,91508.938560001334]
[null,null,null,814,112.51136000000164,91584.247040001341]
[null,null,null,815,112.46560000000164,91659.464000001346]
[null,null,null,816,112.41984000000164,91734.589440001335]
[null,null,null,817,112.37408000000164,91809.623360001337]
[null,null,null,818,112.32832000000164,91884.565760001336]
[null,null,null,819,112.28256000000164,91959.416640001335]
[null,null,null,820,112.23680000000164,92034.176000001346]
[null,null,null,821,{"$f":"E837-$F$11","v":112.19104000000164},92108.84384000134]
[null,null,null,822,112.14528000000163,92183.420160001348]
[null,null,null,823,112.09952000000163,92257.904960001339]
[null,null,null,824,112.05376000000163,92332.298240001342]
[null,null,null,825,112.00800000000163,92406.600000001345]
[null,null,null,826,111.96224000000163,92480.810240001345]
[null,null,null,827,111.91648000000163,92554.928960001344]
[null,null,null,828,111.87072000000163,92628.95616000134]
[null,null,null,829,111.82496000000162,92702.89184000135]
[null,null,null,830,111.77920000000162,92776.736000001343]
[null,null,null,831,111.73344000000162,92850.488640001349]
[null,null,null,832,111.68768000000162,92924.149760001354]
[null,null,null,833,111.64192000000162,92997.719360001342]
[null,null,null,834,111.59616000000162,93071.197440001342]
[null,null,null,835,111.55040000000162,93144.584000001356]
[null,null,null,836,111.50464000000161,93217.879040001353]
[null,null,null,837,111.45888000000161,93291.082560001349]
[null,null,null,838,111.41312000000161,93364.194560001357]
[null,null,null,839,111.36736000000161,93437.215040001349]
[null,null,null,840,111.32160000000161,93510.144000001354]
[null,null,null,841,111.27584000000161,93582.981440001357]
[null,null,null,842,111.23008000000161,93655.727360001358]
[null,null,null,843,111.18432000000161,93728.381760001357]
[null,null,null,844,111.1385600000016,93800.944640001355]
[null,null,null,845,111.0928000000016,93873.416000001351]
[null,null,null,846,111.0470400000016,93945.795840001359]
[null,null,null,847,111.0012800000016,94018.084160001352]
[null,null,null,848,110.9555200000016,94090.280960001357]
[null,null,null,849,110.9097600000016,94162.38624000136]
[null,null,null,850,110.8640000000016,94234.400000001362]
[null,null,null,851,110.81824000000159,94306.322240001362]
[null,null,null,852,110.77248000000159,94378.15296000136]
[null,null,null,853,110.72672000000159,94449.892160001356]
[null,null,null,854,110.68096000000159,94521.539840001366]
[null,null,null,855,110.63520000000159,94593.096000001358]
[null,null,null,856,110.58944000000159,94664.560640001364]
[null,null,null,857,110.54368000000159,94735.933760001353]
[null,null,null,858,110.49792000000159,94807.215360001355]
[null,null,null,859,110.45216000000158,94878.405440001356]
[null,null,null,860,110.40640000000158,94949.504000001354]
[null,null,null,861,110.36064000000158,95020.511040001365]
[null,null,null,862,110.31488000000158,95091.42656000136]
[null,null,null,863,110.26912000000158,95162.250560001368]
[null,null,null,864,110.22336000000158,95232.98304000136]
[null,null,null,865,110.17760000000158,95303.624000001364]
[null,null,null,866,110.13184000000157,95374.173440001367]
[null,null,null,867,110.08608000000157,95444.631360001367]
[null,null,null,868,110.04032000000157,95514.997760001366]
[null,null,null,869,109.99456000000157,{"$f":"E886*D886","v":95585.272640001363}]
[null,null,null,870,109.94880000000157,95655.456000001359]
[null,null,null,871,109.90304000000157,95725.547840001367]
[null,null,null,872,109.85728000000157,95795.548160001359]
[null,null,null,873,109.81152000000156,95865.456960001364]
[null,null,null,874,109.76576000000156,95935.274240001367]
[null,null,null,875,109.72000000000156,96005.000000001368]
[null,null,null,876,109.67424000000156,96074.634240001367]
[null,null,null,877,109.62848000000156,96144.176960001365]
[null,null,null,878,109.58272000000156,96213.628160001361]
[null,null,null,879,109.53696000000156,96282.987840001369]
[null,null,null,880,109.49120000000156,96352.256000001362]
[null,null,null,881,109.44544000000155,96421.432640001367]
[null,null,null,882,109.39968000000155,96490.51776000137]
[null,null,null,883,109.35392000000155,96559.511360001372]
[null,null,null,884,109.30816000000155,96628.413440001372]
[null,null,null,885,{"$f":"E901-$F$11","v":109.26240000000155},96697.22400000137]
[null,null,null,886,109.21664000000155,96765.943040001366]
[null,null,null,887,109.17088000000155,96834.570560001375]
[null,null,null,888,109.12512000000154,96903.106560001368]
[null,null,null,889,109.07936000000154,96971.551040001374]
[null,null,null,890,109.03360000000154,97039.904000001377]
[null,null,null,891,108.98784000000154,97108.165440001379]
[null,null,null,892,108.94208000000154,97176.33536000138]
[null,null,null,893,108.89632000000154,97244.413760001378]
[null,null,null,894,108.85056000000154,97312.400640001375]
[null,null,null,895,108.80480000000153,97380.29600000137]
[null,null,null,896,108.75904000000153,97448.099840001378]
[null,null,null,897,108.71328000000153,97515.812160001369]
[null,null,null,898,108.66752000000153,97583.432960001373]
[null,null,null,899,108.62176000000153,97650.962240001376]
[null,null,null,900,108.57600000000153,97718.400000001377]
[null,null,null,901,108.53024000000153,97785.746240001376]
[null,null,null,902,108.48448000000153,97853.000960001373]
[null,null,null,903,108.43872000000152,97920.164160001383]
[null,null,null,904,108.39296000000152,97987.235840001376]
[null,null,null,905,108.34720000000152,98054.216000001383]
[null,null,null,906,108.30144000000152,98121.104640001373]
[null,null,null,907,108.25568000000152,98187.901760001376]
[null,null,null,908,108.20992000000152,98254.607360001377]
[null,null,null,909,108.16416000000152,98321.221440001376]
[null,null,null,910,108.11840000000151,98387.744000001374]
[null,null,null,911,108.07264000000151,98454.175040001384]
[null,null,null,912,108.02688000000151,98520.514560001378]
[null,null,null,913,107.98112000000151,98586.762560001385]
[null,null,null,914,107.93536000000151,98652.919040001376]
[null,null,null,915,107.88960000000151,98718.984000001379]
[null,null,null,916,107.84384000000151,98784.957440001381]
[null,null,null,917,107.79808000000151,98850.839360001381]
[null,null,null,918,107.7523200000015,98916.629760001379]
[null,null,null,919,107.7065600000015,98982.328640001375]
[null,null,null,920,107.6608000000015,99047.936000001384]
[null,null,null,921,107.6150400000015,99113.451840001377]
[null,null,null,922,107.5692800000015,99178.876160001382]
[null,null,null,923,107.5235200000015,99244.208960001386]
[null,null,null,924,107.4777600000015,99309.450240001388]
[null,null,null,925,107.43200000000149,99374.600000001388]
[null,null,null,926,107.38624000000149,99439.658240001387]
[null,null,null,927,107.34048000000149,99504.624960001383]
[null,null,null,928,107.29472000000149,99569.500160001378]
[null,null,null,929,107.24896000000149,99634.283840001386]
[null,null,null,930,107.20320000000149,99698.976000001378]
[null,null,null,931,107.15744000000149,99763.576640001382]
[null,null,null,932,107.11168000000148,99828.085760001384]
[null,null,null,933,107.06592000000148,{"$f":"E950*D950","v":99892.503360001385}]
[null,null,null,934,107.02016000000148,99956.829440001384]
[null,null,null,935,106.97440000000148,100021.06400000138]
[null,null,null,936,106.92864000000148,100085.20704000139]
[null,null,null,937,106.88288000000148,100149.25856000138]
[null,null,null,938,106.83712000000148,100213.21856000139]
[null,null,null,939,106.79136000000148,100277.08704000138]
[null,null,null,940,106.74560000000147,100340.86400000138]
[null,null,null,941,106.69984000000147,100404.54944000138]
[null,null,null,942,106.65408000000147,100468.14336000138]
[null,null,null,943,106.60832000000147,100531.64576000138]
[null,null,null,944,106.56256000000147,100595.05664000139]
[null,null,null,945,106.51680000000147,100658.37600000139]
[null,null,null,946,106.47104000000147,100721.60384000139]
[null,null,null,947,106.42528000000146,100784.74016000138]
[null,null,null,948,106.37952000000146,100847.78496000139]
[null,null,null,949,{"$f":"E965-$F$11","v":106.33376000000146},100910.73824000139]
[null,null,null,950,106.28800000000146,100973.60000000139]
[null,null,null,951,106.24224000000146,101036.37024000139]
[null,null,null,952,106.19648000000146,101099.04896000138]
[null,null,null,953,106.15072000000146,101161.63616000139]
[null,null,null,954,106.10496000000146,101224.13184000138]
[null,null,null,955,106.05920000000145,101286.53600000139]
[null,null,null,956,106.01344000000145,101348.84864000139]
[null,null,null,957,105.96768000000145,101411.0697600014]
[null,null,null,958,105.92192000000145,101473.1993600014]
[null,null,null,959,105.87616000000145,101535.23744000139]
[null,null,null,960,105.83040000000145,101597.18400000139]
[null,null,null,961,105.78464000000145,101659.03904000139]
[null,null,null,962,105.73888000000144,101720.80256000139]
[null,null,null,963,105.69312000000144,101782.47456000138]
[null,null,null,964,105.64736000000144,101844.05504000139]
[null,null,null,965,105.60160000000144,101905.54400000139]
[null,null,null,966,105.55584000000144,101966.94144000139]
[null,null,null,967,105.51008000000144,102028.24736000139]
[null,null,null,968,105.46432000000144,102089.46176000139]
[null,null,null,969,105.41856000000143,102150.58464000138]
[null,null,null,970,105.37280000000143,102211.61600000139]
[null,null,null,971,105.32704000000143,102272.55584000138]
[null,null,null,972,105.28128000000143,102333.40416000139]
[null,null,null,973,105.23552000000143,102394.16096000139]
[null,null,null,974,105.18976000000143,102454.82624000139]
[null,null,null,975,105.14400000000143,102515.40000000139]
[null,null,null,976,105.09824000000143,102575.88224000139]
[null,null,null,977,105.05248000000142,102636.27296000138]
[null,null,null,978,105.00672000000142,102696.57216000139]
[null,null,null,979,104.96096000000142,102756.77984000139]
[null,null,null,980,104.91520000000142,102816.89600000139]
[null,null,null,981,104.86944000000142,102876.92064000139]
[null,null,null,982,104.82368000000142,102936.8537600014]
[null,null,null,983,104.77792000000142,102996.69536000139]
[null,null,null,984,104.73216000000141,103056.44544000139]
[null,null,null,985,104.68640000000141,103116.10400000139]
[null,null,null,986,104.64064000000141,103175.6710400014]
[null,null,null,987,104.59488000000141,103235.14656000139]
[null,null,null,988,104.54912000000141,103294.5305600014]
[null,null,null,989,104.50336000000141,103353.82304000139]
[null,null,null,990,104.45760000000141,103413.02400000139]
[null,null,null,991,104.4118400000014,103472.13344000139]
[null,null,null,992,104.3660800000014,103531.15136000139]
[null,null,null,993,104.3203200000014,103590.0777600014]
[null,null,null,994,104.2745600000014,103648.91264000139]
[null,null,null,995,104.2288000000014,103707.6560000014]
[null,null,null,996,104.1830400000014,103766.30784000139]
[null,null,null,997,104.1372800000014,{"$f":"E1014*D1014","v":103824.8681600014}]
[null,null,null,998,104.0915200000014,103883.3369600014]
[null,null,null,999,104.04576000000139,103941.7142400014]
[null,null,null,1000,104.00000000000139,104000.0000000014]
[null,null,null,1001,{"$f":"E1017-$F$12","v":103.98960000000139},104093.58960000139]
[null,null,null,1002,103.97920000000138,104187.15840000138]
[null,null,null,1003,103.96880000000138,104280.70640000138]
[null,null,null,1004,103.95840000000138,104374.23360000137]
[null,null,null,1005,103.94800000000137,104467.74000000137]
[null,null,null,1006,103.93760000000137,104561.22560000137]
[null,null,null,1007,103.92720000000136,104654.69040000137]
[null,null,null,1008,103.91680000000136,104748.13440000136]
[null,null,null,1009,103.90640000000136,104841.55760000137]
[null,null,null,1010,103.89600000000135,104934.96000000136]
[null,null,null,1011,103.88560000000135,105028.34160000137]
[null,null,null,1012,103.87520000000134,105121.70240000136]
[null,null,null,1013,103.86480000000134,105215.04240000136]
[null,null,null,1014,103.85440000000133,105308.36160000136]
[null,null,null,1015,103.84400000000133,105401.66000000136]
[null,null,null,1016,103.83360000000133,105494.93760000134]
[null,null,null,1017,103.82320000000132,105588.19440000135]
[null,null,null,1018,103.81280000000132,105681.43040000134]
[null,null,null,1019,103.80240000000131,105774.64560000134]
[null,null,null,1020,103.79200000000131,105867.84000000134]
[null,null,null,1021,103.7816000000013,105961.01360000133]
[null,null,null,1022,103.7712000000013,106054.16640000133]
[null,null,null,1023,103.7608000000013,106147.29840000132]
[null,null,null,1024,103.75040000000129,106240.40960000132]
[null,null,null,1025,103.74000000000129,106333.50000000132]
[null,null,null,1026,103.72960000000128,106426.56960000131]
[null,null,null,1027,103.71920000000128,106519.61840000132]
[null,null,null,1028,103.70880000000128,106612.64640000131]
[null,null,null,1029,103.69840000000127,106705.65360000131]
[null,null,null,1030,103.68800000000127,106798.64000000131]
[null,null,null,1031,103.67760000000126,106891.6056000013]
[null,null,null,1032,103.66720000000126,106984.5504000013]
[null,null,null,1033,103.65680000000125,107077.4744000013]
[null,null,null,1034,103.64640000000125,107170.37760000129]
[null,null,null,1035,103.63600000000125,107263.26000000129]
[null,null,null,1036,103.62560000000124,107356.12160000129]
[null,null,null,1037,103.61520000000124,107448.96240000128]
[null,null,null,1038,103.60480000000123,107541.78240000128]
[null,null,null,1039,103.59440000000123,107634.58160000127]
[null,null,null,1040,103.58400000000123,107727.36000000128]
[null,null,null,1041,103.57360000000122,107820.11760000128]
[null,null,null,1042,103.56320000000122,107912.85440000126]
[null,null,null,1043,103.55280000000121,108005.57040000126]
[null,null,null,1044,103.54240000000121,108098.26560000126]
[null,null,null,1045,103.5320000000012,108190.94000000125]
[null,null,null,1046,103.5216000000012,108283.59360000126]
[null,null,null,1047,103.5112000000012,108376.22640000125]
[null,null,null,1048,103.50080000000119,108468.83840000124]
[null,null,null,1049,103.49040000000119,108561.42960000124]
[null,null,null,1050,103.48000000000118,108654.00000000124]
[null,null,null,1051,103.46960000000118,108746.54960000124]
[null,null,null,1052,103.45920000000118,108839.07840000124]
[null,null,null,1053,103.44880000000117,108931.58640000124]
[null,null,null,1054,103.43840000000117,109024.07360000123]
[null,null,null,1055,103.42800000000116,109116.54000000123]
[null,null,null,1056,103.41760000000116,109208.98560000122]
[null,null,null,1057,103.40720000000115,109301.41040000122]
[null,null,null,1058,103.39680000000115,109393.81440000121]
[null,null,null,1059,103.38640000000115,109486.19760000121]
[null,null,null,1060,103.37600000000114,109578.56000000121]
[null,null,null,1061,103.36560000000114,{"$f":"E1078*D1078","v":109670.90160000121}]
[null,null,null,1062,103.35520000000113,109763.22240000121]
[null,null,null,1063,103.34480000000113,109855.52240000119]
[null,null,null,1064,103.33440000000112,109947.8016000012]
[null,null,null,1065,{"$f":"E1081-$F$12","v":103.32400000000112},110040.06000000119]
[null,null,null,1066,103.31360000000112,110132.29760000118]
[null,null,null,1067,103.30320000000111,110224.51440000119]
[null,null,null,1068,103.29280000000111,110316.71040000119]
[null,null,null,1069,103.2824000000011,110408.88560000119]
[null,null,null,1070,103.2720000000011,110501.04000000117]
[null,null,null,1071,103.2616000000011,110593.17360000117]
[null,null,null,1072,103.25120000000109,110685.28640000118]
[null,null,null,1073,103.24080000000109,110777.37840000117]
[null,null,null,1074,103.23040000000108,110869.44960000116]
[null,null,null,1075,103.22000000000108,110961.50000000116]
[null,null,null,1076,103.20960000000107,111053.52960000116]
[null,null,null,1077,103.19920000000107,111145.53840000115]
[null,null,null,1078,103.18880000000107,111237.52640000115]
[null,null,null,1079,103.17840000000106,111329.49360000115]
[null,null,null,1080,103.16800000000106,111421.44000000114]
[null,null,null,1081,103.15760000000105,111513.36560000114]
[null,null,null,1082,103.14720000000105,111605.27040000113]
[null,null,null,1083,103.13680000000105,111697.15440000113]
[null,null,null,1084,103.12640000000104,111789.01760000113]
[null,null,null,1085,103.11600000000104,111880.86000000112]
[null,null,null,1086,103.10560000000103,111972.68160000112]
[null,null,null,1087,103.09520000000103,112064.48240000111]
[null,null,null,1088,103.08480000000102,112156.26240000111]
[null,null,null,1089,103.07440000000102,112248.02160000111]
[null,null,null,1090,103.06400000000102,112339.7600000011]
[null,null,null,1091,103.05360000000101,112431.4776000011]
[null,null,null,1092,103.04320000000101,112523.17440000109]
[null,null,null,1093,103.032800000001,112614.8504000011]
[null,null,null,1094,103.022400000001,112706.5056000011]
[null,null,null,1095,103.012000000001,112798.14000000109]
[null,null,null,1096,103.00160000000099,112889.75360000109]
[null,null,null,1097,102.99120000000099,112981.34640000109]
[null,null,null,1098,102.98080000000098,113072.91840000107]
[null,null,null,1099,102.97040000000098,113164.46960000107]
[null,null,null,1100,102.96000000000097,113256.00000000108]
[null,null,null,1101,102.94960000000097,113347.50960000107]
[null,null,null,1102,102.93920000000097,113438.99840000106]
[null,null,null,1103,102.92880000000096,113530.46640000107]
[null,null,null,1104,102.91840000000096,113621.91360000106]
[null,null,null,1105,102.90800000000095,113713.34000000106]
[null,null,null,1106,102.89760000000095,113804.74560000106]
[null,null,null,1107,102.88720000000095,113896.13040000104]
[null,null,null,1108,102.87680000000094,113987.49440000104]
[null,null,null,1109,102.86640000000094,114078.83760000103]
[null,null,null,1110,102.85600000000093,114170.16000000104]
[null,null,null,1111,102.84560000000093,114261.46160000103]
[null,null,null,1112,102.83520000000092,114352.74240000102]
[null,null,null,1113,102.82480000000092,114444.00240000103]
[null,null,null,1114,102.81440000000092,114535.24160000103]
[null,null,null,1115,102.80400000000091,114626.46000000101]
[null,null,null,1116,102.79360000000091,114717.65760000101]
[null,null,null,1117,102.7832000000009,114808.83440000101]
[null,null,null,1118,102.7728000000009,114899.990400001]
[null,null,null,1119,102.76240000000089,114991.125600001]
[null,null,null,1120,102.75200000000089,115082.24000000099]
[null,null,null,1121,102.74160000000089,115173.33360000099]
[null,null,null,1122,102.73120000000088,115264.406400001]
[null,null,null,1123,102.72080000000088,115355.45840000099]
[null,null,null,1124,102.71040000000087,115446.48960000098]
[null,null,null,1125,102.70000000000087,{"$f":"E1142*D1142","v":115537.50000000097}]
[null,null,null,1126,102.68960000000087,115628.48960000098]
[null,null,null,1127,102.67920000000086,115719.45840000096]
[null,null,null,1128,102.66880000000086,115810.40640000097]
[null,null,null,1129,{"$f":"E1145-$F$12","v":102.65840000000085},115901.33360000096]
[null,null,null,1130,102.64800000000085,115992.24000000097]
[null,null,null,1131,102.63760000000084,116083.12560000096]
[null,null,null,1132,102.62720000000084,116173.99040000096]
[null,null,null,1133,102.61680000000084,116264.83440000095]
[null,null,null,1134,102.60640000000083,116355.65760000094]
[null,null,null,1135,102.59600000000083,116446.46000000094]
[null,null,null,1136,102.58560000000082,116537.24160000094]
[null,null,null,1137,102.57520000000082,116628.00240000093]
[null,null,null,1138,102.56480000000082,116718.74240000093]
[null,null,null,1139,102.55440000000081,116809.46160000093]
[null,null,null,1140,102.54400000000081,116900.16000000092]
[null,null,null,1141,102.5336000000008,116990.83760000092]
[null,null,null,1142,102.5232000000008,117081.49440000091]
[null,null,null,1143,102.51280000000079,117172.13040000091]
[null,null,null,1144,102.50240000000079,117262.7456000009]
[null,null,null,1145,102.49200000000079,117353.3400000009]
[null,null,null,1146,102.48160000000078,117443.9136000009]
[null,null,null,1147,102.47120000000078,117534.46640000089]
[null,null,null,1148,102.46080000000077,117624.99840000088]
[null,null,null,1149,102.45040000000077,117715.50960000088]
[null,null,null,1150,102.44000000000077,117806.00000000087]
[null,null,null,1151,102.42960000000076,117896.46960000087]
[null,null,null,1152,102.41920000000076,117986.91840000087]
[null,null,null,1153,102.40880000000075,118077.34640000087]
[null,null,null,1154,102.39840000000075,118167.75360000087]
[null,null,null,1155,102.38800000000074,118258.14000000086]
[null,null,null,1156,102.37760000000074,118348.50560000086]
[null,null,null,1157,102.36720000000074,118438.85040000085]
[null,null,null,1158,102.35680000000073,118529.17440000085]
[null,null,null,1159,102.34640000000073,118619.47760000084]
[null,null,null,1160,102.33600000000072,118709.76000000084]
[null,null,null,1161,102.32560000000072,118800.02160000084]
[null,null,null,1162,102.31520000000071,118890.26240000084]
[null,null,null,1163,102.30480000000071,118980.48240000082]
[null,null,null,1164,102.29440000000071,119070.68160000083]
[null,null,null,1165,102.2840000000007,119160.86000000082]
[null,null,null,1166,102.2736000000007,119251.01760000081]
[null,null,null,1167,102.26320000000069,119341.15440000081]
[null,null,null,1168,102.25280000000069,119431.27040000081]
[null,null,null,1169,102.24240000000069,119521.3656000008]
[null,null,null,1170,102.23200000000068,119611.4400000008]
[null,null,null,1171,102.22160000000068,119701.49360000079]
[null,null,null,1172,102.21120000000067,119791.52640000079]
[null,null,null,1173,102.20080000000067,119881.53840000079]
[null,null,null,1174,102.19040000000066,119971.52960000078]
[null,null,null,1175,102.18000000000066,120061.50000000077]
[null,null,null,1176,102.16960000000066,120151.44960000078]
[null,null,null,1177,102.15920000000065,120241.37840000077]
[null,null,null,1178,102.14880000000065,120331.28640000077]
[null,null,null,1179,102.13840000000064,120421.17360000077]
[null,null,null,1180,102.12800000000064,120511.04000000075]
[null,null,null,1181,102.11760000000064,120600.88560000075]
[null,null,null,1182,102.10720000000063,120690.71040000075]
[null,null,null,1183,102.09680000000063,120780.51440000074]
[null,null,null,1184,102.08640000000062,120870.29760000073]
[null,null,null,1185,102.07600000000062,120960.06000000074]
[null,null,null,1186,102.06560000000061,121049.80160000073]
[null,null,null,1187,102.05520000000061,121139.52240000073]
[null,null,null,1188,102.04480000000061,121229.22240000073]
[null,null,null,1189,102.0344000000006,{"$f":"E1206*D1206","v":121318.90160000071}]
[null,null,null,1190,102.0240000000006,121408.56000000071]
[null,null,null,1191,102.01360000000059,121498.19760000071]
[null,null,null,1192,102.00320000000059,121587.8144000007]
[null,null,null,1193,{"$f":"E1209-$F$12","v":101.99280000000059},121677.41040000069]
[null,null,null,1194,101.98240000000058,121766.9856000007]
[null,null,null,1195,101.97200000000058,121856.54000000069]
[null,null,null,1196,101.96160000000057,121946.07360000069]
[null,null,null,1197,101.95120000000057,122035.58640000068]
[null,null,null,1198,101.94080000000056,122125.07840000068]
[null,null,null,1199,101.93040000000056,122214.54960000067]
[null,null,null,1200,101.92000000000056,122304.00000000067]
[null,null,null,1201,101.90960000000055,122393.42960000066]
[null,null,null,1202,101.89920000000055,122482.83840000066]
[null,null,null,1203,101.88880000000054,122572.22640000065]
[null,null,null,1204,101.87840000000054,122661.59360000065]
[null,null,null,1205,101.86800000000054,122750.94000000064]
[null,null,null,1206,101.85760000000053,122840.26560000064]
[null,null,null,1207,101.84720000000053,122929.57040000064]
[null,null,null,1208,101.83680000000052,123018.85440000064]
[null,null,null,1209,101.82640000000052,123108.11760000062]
[null,null,null,1210,101.81600000000051,123197.36000000063]
[null,null,null,1211,101.80560000000051,123286.58160000062]
[null,null,null,1212,101.79520000000051,123375.78240000061]
[null,null,null,1213,101.7848000000005,123464.96240000062]
[null,null,null,1214,101.7744000000005,123554.12160000061]
[null,null,null,1215,101.76400000000049,123643.26000000061]
[null,null,null,1216,101.75360000000049,123732.37760000059]
[null,null,null,1217,101.74320000000048,123821.47440000059]
[null,null,null,1218,101.73280000000048,123910.55040000059]
[null,null,null,1219,101.72240000000048,123999.60560000058]
[null,null,null,1220,101.71200000000047,124088.64000000058]
[null,null,null,1221,101.70160000000047,124177.65360000057]
[null,null,null,1222,101.69120000000046,124266.64640000057]
[null,null,null,1223,101.68080000000046,124355.61840000056]
[null,null,null,1224,101.67040000000046,124444.56960000056]
[null,null,null,1225,101.66000000000045,124533.50000000055]
[null,null,null,1226,101.64960000000045,124622.40960000055]
[null,null,null,1227,101.63920000000044,124711.29840000054]
[null,null,null,1228,101.62880000000044,124800.16640000054]
[null,null,null,1229,101.61840000000043,124889.01360000053]
[null,null,null,1230,101.60800000000043,124977.84000000053]
[null,null,null,1231,101.59760000000043,125066.64560000053]
[null,null,null,1232,101.58720000000042,125155.43040000052]
[null,null,null,1233,101.57680000000042,125244.19440000052]
[null,null,null,1234,101.56640000000041,125332.93760000051]
[null,null,null,1235,101.55600000000041,125421.66000000051]
[null,null,null,1236,101.54560000000041,125510.3616000005]
[null,null,null,1237,101.5352000000004,125599.0424000005]
[null,null,null,1238,101.5248000000004,125687.70240000049]
[null,null,null,1239,101.51440000000039,125776.34160000048]
[null,null,null,1240,101.50400000000039,125864.96000000049]
[null,null,null,1241,101.49360000000038,125953.55760000048]
[null,null,null,1242,101.48320000000038,126042.13440000048]
[null,null,null,1243,101.47280000000038,126130.69040000047]
[null,null,null,1244,101.46240000000037,126219.22560000046]
[null,null,null,1245,101.45200000000037,126307.74000000046]
[null,null,null,1246,101.44160000000036,126396.23360000046]
[null,null,null,1247,101.43120000000036,126484.70640000045]
[null,null,null,1248,101.42080000000036,126573.15840000044]
[null,null,null,1249,101.41040000000035,126661.58960000044]
[null,null,null,1250,101.40000000000035,126750.00000000044]
[null,null,null,1251,101.38960000000034,126838.38960000043]
[null,null,null,1252,101.37920000000034,126926.75840000043]
[null,null,null,1253,101.36880000000033,{"$f":"E1270*D1270","v":127015.10640000041}]
[null,null,null,1254,101.35840000000033,127103.43360000041]
[null,null,null,1255,101.34800000000033,127191.74000000041]
[null,null,null,1256,101.33760000000032,127280.0256000004]
[null,null,null,1257,{"$f":"E1273-$F$12","v":101.32720000000032},127368.29040000041]
[null,null,null,1258,101.31680000000031,127456.5344000004]
[null,null,null,1259,101.30640000000031,127544.75760000039]
[null,null,null,1260,101.2960000000003,127632.96000000038]
[null,null,null,1261,101.2856000000003,127721.14160000038]
[null,null,null,1262,101.2752000000003,127809.30240000038]
[null,null,null,1263,101.26480000000029,127897.44240000036]
[null,null,null,1264,101.25440000000029,127985.56160000036]
[null,null,null,1265,101.24400000000028,128073.66000000035]
[null,null,null,1266,101.23360000000028,128161.73760000036]
[null,null,null,1267,101.22320000000028,128249.79440000035]
[null,null,null,1268,101.21280000000027,128337.83040000034]
[null,null,null,1269,101.20240000000027,128425.84560000034]
[null,null,null,1270,101.19200000000026,128513.84000000033]
[null,null,null,1271,101.18160000000026,128601.81360000033]
[null,null,null,1272,101.17120000000025,128689.76640000033]
[null,null,null,1273,101.16080000000025,128777.69840000031]
[null,null,null,1274,101.15040000000025,128865.60960000032]
[null,null,null,1275,101.14000000000024,128953.50000000031]
[null,null,null,1276,101.12960000000024,129041.3696000003]
[null,null,null,1277,101.11920000000023,129129.2184000003]
[null,null,null,1278,101.10880000000023,129217.0464000003]
[null,null,null,1279,101.09840000000023,129304.85360000029]
[null,null,null,1280,101.08800000000022,129392.64000000028]
[null,null,null,1281,101.07760000000022,129480.40560000027]
[null,null,null,1282,101.06720000000021,129568.15040000028]
[null,null,null,1283,101.05680000000021,129655.87440000026]
[null,null,null,1284,101.0464000000002,129743.57760000027]
[null,null,null,1285,101.0360000000002,129831.26000000026]
[null,null,null,1286,101.0256000000002,129918.92160000025]
[null,null,null,1287,101.01520000000019,130006.56240000024]
[null,null,null,1288,101.00480000000019,130094.18240000024]
[null,null,null,1289,100.99440000000018,130181.78160000023]
[null,null,null,1290,100.98400000000018,130269.36000000023]
[null,null,null,1291,100.97360000000018,130356.91760000022]
[null,null,null,1292,100.96320000000017,130444.45440000022]
[null,null,null,1293,100.95280000000017,130531.97040000021]
[null,null,null,1294,100.94240000000016,130619.46560000021]
[null,null,null,1295,100.93200000000016,130706.94000000021]
[null,null,null,1296,100.92160000000015,130794.3936000002]
[null,null,null,1297,100.91120000000015,130881.82640000019]
[null,null,null,1298,100.90080000000015,130969.23840000019]
[null,null,null,1299,100.89040000000014,131056.62960000019]
[null,null,null,1300,100.88000000000014,131144.00000000017]
[null,null,null,1301,100.86960000000013,131231.34960000016]
[null,null,null,1302,100.85920000000013,131318.67840000018]
[null,null,null,1303,100.84880000000013,131405.98640000017]
[null,null,null,1304,100.83840000000012,131493.27360000016]
[null,null,null,1305,100.82800000000012,131580.54000000015]
[null,null,null,1306,100.81760000000011,131667.78560000015]
[null,null,null,1307,100.80720000000011,131755.01040000014]
[null,null,null,1308,100.7968000000001,131842.21440000014]
[null,null,null,1309,100.7864000000001,131929.39760000014]
[null,null,null,1310,100.7760000000001,132016.56000000011]
[null,null,null,1311,100.76560000000009,132103.70160000012]
[null,null,null,1312,100.75520000000009,132190.82240000012]
[null,null,null,1313,100.74480000000008,132277.9224000001]
[null,null,null,1314,100.73440000000008,132365.00160000011]
[null,null,null,1315,100.72400000000007,132452.06000000008]
[null,null,null,1316,100.71360000000007,132539.0976000001]
[null,null,null,1317,100.70320000000007,{"$f":"E1334*D1334","v":132626.11440000008}]
[null,null,null,1318,100.69280000000006,132713.11040000009]
[null,null,null,1319,100.68240000000006,132800.08560000008]
[null,null,null,1320,100.67200000000005,132887.04000000007]
[null,null,null,1321,{"$f":"E1337-$F$12","v":100.66160000000005},132973.97360000006]
[null,null,null,1322,100.65120000000005,133060.88640000005]
[null,null,null,1323,100.64080000000004,133147.77840000007]
[null,null,null,1324,100.63040000000004,133234.64960000006]
[null,null,null,1325,100.62000000000003,133321.50000000006]
[null,null,null,1326,100.60960000000003,133408.32960000003]
[null,null,null,1327,100.59920000000002,133495.13840000003]
[null,null,null,1328,100.58880000000002,133581.92640000003]
[null,null,null,1329,100.57840000000002,133668.69360000003]
[null,null,null,1330,100.56800000000001,133755.44]
[null,null,null,1331,100.55760000000001,133842.16560000001]
[null,null,null,1332,100.5472,133928.87040000001]
[null,null,null,1333,100.5368,134015.55439999999]
[null,null,null,1334,100.5264,134102.2176]
[null,null,null,1335,100.51599999999999,134188.85999999999]
[null,null,null,1336,100.50559999999999,134275.48159999997]
[null,null,null,1337,100.49519999999998,134362.08239999998]
[null,null,null,1338,100.48479999999998,134448.66239999997]
[null,null,null,1339,100.47439999999997,134535.22159999996]
[null,null,null,1340,100.46399999999997,134621.75999999995]
[null,null,null,1341,100.45359999999997,134708.27759999994]
[null,null,null,1342,100.44319999999996,134794.77439999994]
[null,null,null,1343,100.43279999999996,134881.25039999993]
[null,null,null,1344,100.42239999999995,134967.70559999993]
[null,null,null,1345,100.41199999999995,135054.13999999993]
[null,null,null,1346,100.40159999999995,135140.55359999993]
[null,null,null,1347,100.39119999999994,135226.94639999993]
[null,null,null,1348,100.38079999999994,135313.3183999999]
[null,null,null,1349,100.37039999999993,135399.66959999991]
[null,null,null,1350,100.35999999999993,135485.99999999991]
[null,null,null,1351,100.34959999999992,135572.30959999989]
[null,null,null,1352,100.33919999999992,135658.5983999999]
[null,null,null,1353,100.32879999999992,135744.86639999988]
[null,null,null,1354,100.31839999999991,135831.11359999987]
[null,null,null,1355,100.30799999999991,135917.33999999988]
[null,null,null,1356,100.2975999999999,136003.54559999987]
[null,null,null,1357,100.2871999999999,136089.73039999985]
[null,null,null,1358,100.27679999999989,136175.89439999984]
[null,null,null,1359,100.26639999999989,136262.03759999987]
[null,null,null,1360,100.25599999999989,136348.15999999986]
[null,null,null,1361,100.24559999999988,136434.26159999985]
[null,null,null,1362,100.23519999999988,136520.34239999985]
[null,null,null,1363,100.22479999999987,136606.40239999982]
[null,null,null,1364,100.21439999999987,136692.44159999982]
[null,null,null,1365,100.20399999999987,136778.45999999982]
[null,null,null,1366,100.19359999999986,136864.45759999982]
[null,null,null,1367,100.18319999999986,136950.43439999979]
[null,null,null,1368,100.17279999999985,137036.3903999998]
[null,null,null,1369,100.16239999999985,137122.32559999981]
[null,null,null,1370,100.15199999999984,137208.23999999979]
[null,null,null,1371,100.14159999999984,137294.13359999977]
[null,null,null,1372,100.13119999999984,137380.00639999978]
[null,null,null,1373,100.12079999999983,137465.85839999976]
[null,null,null,1374,100.11039999999983,137551.68959999975]
[null,null,null,1375,100.09999999999982,137637.49999999977]
[null,null,null,1376,100.08959999999982,137723.28959999976]
[null,null,null,1377,100.07919999999982,137809.05839999975]
[null,null,null,1378,100.06879999999981,137894.80639999974]
[null,null,null,1379,100.05839999999981,137980.53359999973]
[null,null,null,1380,100.0479999999998,138066.23999999973]
[null,null,null,1381,100.0375999999998,{"$f":"E1398*D1398","v":138151.92559999973}]
[null,null,null,1382,100.02719999999979,138237.59039999972]
[null,null,null,1383,100.01679999999979,138323.2343999997]
[null,null,null,1384,100.00639999999979,138408.8575999997]
[null,null,null,1385,{"$f":"E1401-$F$12","v":99.995999999999782},138494.4599999997]
[null,null,null,1386,99.985599999999778,138580.04159999971]
[null,null,null,1387,99.975199999999774,138665.60239999968]
[null,null,null,1388,99.964799999999769,138751.14239999969]
[null,null,null,1389,99.954399999999765,138836.66159999967]
[null,null,null,1390,99.943999999999761,138922.15999999965]
[null,null,null,1391,99.933599999999757,139007.63759999967]
[null,null,null,1392,99.923199999999753,139093.09439999965]
[null,null,null,1393,99.912799999999748,139178.53039999964]
[null,null,null,1394,99.902399999999744,139263.94559999966]
[null,null,null,1395,99.89199999999974,139349.33999999965]
[null,null,null,1396,99.881599999999736,139434.71359999964]
[null,null,null,1397,99.871199999999732,139520.06639999963]
[null,null,null,1398,99.860799999999728,139605.39839999963]
[null,null,null,1399,99.850399999999723,139690.70959999962]
[null,null,null,1400,99.839999999999719,139775.99999999959]
[null,null,null,1401,99.829599999999715,139861.26959999959]
[null,null,null,1402,99.819199999999711,139946.51839999959]
[null,null,null,1403,99.808799999999707,140031.7463999996]
[null,null,null,1404,99.798399999999702,140116.95359999957]
[null,null,null,1405,99.787999999999698,140202.13999999958]
[null,null,null,1406,99.777599999999694,140287.30559999956]
[null,null,null,1407,99.76719999999969,140372.45039999956]
[null,null,null,1408,99.756799999999686,140457.57439999955]
[null,null,null,1409,99.746399999999682,140542.67759999956]
[null,null,null,1410,99.735999999999677,140627.75999999954]
[null,null,null,1411,99.725599999999673,140712.82159999953]
[null,null,null,1412,99.715199999999669,140797.86239999955]
[null,null,null,1413,99.704799999999665,140882.88239999954]
[null,null,null,1414,99.694399999999661,140967.88159999953]
[null,null,null,1415,99.683999999999656,141052.85999999952]
[null,null,null,1416,99.673599999999652,141137.81759999951]
[null,null,null,1417,99.663199999999648,141222.75439999951]
[null,null,null,1418,99.652799999999644,141307.67039999951]
[null,null,null,1419,99.64239999999964,141392.56559999948]
[null,null,null,1420,99.631999999999636,141477.43999999948]
[null,null,null,1421,99.621599999999631,141562.29359999948]
[null,null,null,1422,99.611199999999627,141647.12639999946]
[null,null,null,1423,99.600799999999623,141731.93839999946]
[null,null,null,1424,99.590399999999619,141816.72959999947]
[null,null,null,1425,99.579999999999615,141901.49999999945]
[null,null,null,1426,99.56959999999961,141986.24959999946]
[null,null,null,1427,99.559199999999606,142070.97839999944]
[null,null,null,1428,99.548799999999602,142155.68639999942]
[null,null,null,1429,99.538399999999598,142240.37359999944]
[null,null,null,1430,99.527999999999594,142325.03999999943]
[null,null,null,1431,99.517599999999589,142409.68559999941]
[null,null,null,1432,99.507199999999585,142494.31039999941]
[null,null,null,1433,99.496799999999581,142578.9143999994]
[null,null,null,1434,99.486399999999577,142663.49759999939]
[null,null,null,1435,99.475999999999573,142748.05999999939]
[null,null,null,1436,99.465599999999569,142832.60159999938]
[null,null,null,1437,99.455199999999564,142917.12239999938]
[null,null,null,1438,99.44479999999956,143001.62239999938]
[null,null,null,1439,99.434399999999556,143086.10159999935]
[null,null,null,1440,99.423999999999552,143170.55999999936]
[null,null,null,1441,99.413599999999548,143254.99759999936]
[null,null,null,1442,99.403199999999543,143339.41439999934]
[null,null,null,1443,99.392799999999539,143423.81039999935]
[null,null,null,1444,99.382399999999535,143508.18559999933]
[null,null,null,1445,99.371999999999531,{"$f":"E1462*D1462","v":143592.53999999931}]
[null,null,null,1446,99.361599999999527,143676.87359999932]
[null,null,null,1447,99.351199999999523,143761.18639999931]
[null,null,null,1448,99.340799999999518,143845.47839999929]
[null,null,null,1449,{"$f":"E1465-$F$12","v":99.330399999999514},143929.74959999928]
[null,null,null,1450,99.31999999999951,144013.9999999993]
[null,null,null,1451,99.309599999999506,144098.22959999929]
[null,null,null,1452,99.299199999999502,144182.43839999929]
[null,null,null,1453,99.288799999999497,144266.62639999928]
[null,null,null,1454,99.278399999999493,144350.79359999928]
[null,null,null,1455,99.267999999999489,144434.93999999925]
[null,null,null,1456,99.257599999999485,144519.06559999925]
[null,null,null,1457,99.247199999999481,144603.17039999925]
[null,null,null,1458,99.236799999999477,144687.25439999925]
[null,null,null,1459,99.226399999999472,144771.31759999922]
[null,null,null,1460,99.215999999999468,144855.35999999923]
[null,null,null,1461,99.205599999999464,144939.38159999921]
[null,null,null,1462,99.19519999999946,145023.38239999922]
[null,null,null,1463,99.184799999999456,145107.3623999992]
[null,null,null,1464,99.174399999999451,145191.32159999921]
[null,null,null,1465,99.163999999999447,145275.25999999919]
[null,null,null,1466,99.153599999999443,145359.17759999918]
[null,null,null,1467,99.143199999999439,145443.07439999917]
[null,null,null,1468,99.132799999999435,145526.95039999916]
[null,null,null,1469,99.122399999999431,145610.80559999918]
[null,null,null,1470,99.111999999999426,145694.63999999917]
[null,null,null,1471,99.101599999999422,145778.45359999916]
[null,null,null,1472,99.091199999999418,145862.24639999913]
[null,null,null,1473,99.080799999999414,145946.01839999913]
[null,null,null,1474,99.07039999999941,146029.76959999913]
[null,null,null,1475,99.059999999999405,146113.49999999913]
[null,null,null,1476,99.049599999999401,146197.20959999913]
[null,null,null,1477,99.039199999999397,146280.8983999991]
[null,null,null,1478,99.028799999999393,146364.56639999911]
[null,null,null,1479,99.018399999999389,146448.21359999909]
[null,null,null,1480,99.007999999999384,146531.83999999909]
[null,null,null,1481,98.99759999999938,146615.44559999908]
[null,null,null,1482,98.987199999999376,146699.03039999909]
[null,null,null,1483,98.976799999999372,146782.59439999907]
[null,null,null,1484,98.966399999999368,146866.13759999906]
[null,null,null,1485,98.955999999999364,146949.65999999904]
[null,null,null,1486,98.945599999999359,147033.16159999906]
[null,null,null,1487,98.935199999999355,147116.64239999905]
[null,null,null,1488,98.924799999999351,147200.10239999904]
[null,null,null,1489,98.914399999999347,147283.54159999904]
[null,null,null,1490,98.903999999999343,147366.95999999903]
[null,null,null,1491,98.893599999999338,147450.35759999903]
[null,null,null,1492,98.883199999999334,147533.734399999]
[null,null,null,1493,98.87279999999933,147617.090399999]
[null,null,null,1494,98.862399999999326,147700.425599999]
[null,null,null,1495,98.851999999999322,147783.73999999897]
[null,null,null,1496,98.841599999999318,147867.03359999898]
[null,null,null,1497,98.831199999999313,147950.30639999898]
[null,null,null,1498,98.820799999999309,148033.55839999896]
[null,null,null,1499,98.810399999999305,148116.78959999897]
[null,null,null,1500,98.799999999999301,148199.99999999895]
[null,null,null,1501,98.789599999999297,148283.18959999894]
[null,null,null,1502,98.779199999999292,148366.35839999895]
[null,null,null,1503,98.768799999999288,148449.50639999894]
[null,null,null,1504,98.758399999999284,148532.63359999892]
[null,null,null,1505,98.74799999999928,148615.73999999891]
[null,null,null,1506,98.737599999999276,148698.82559999891]
[null,null,null,1507,98.727199999999272,148781.8903999989]
[null,null,null,1508,98.716799999999267,148864.93439999889]
[null,null,null,1509,98.706399999999263,{"$f":"E1526*D1526","v":148947.95759999889}]
[null,null,null,1510,98.695999999999259,149030.95999999889]
[null,null,null,1511,98.685599999999255,149113.94159999889]
[null,null,null,1512,98.675199999999251,149196.90239999886]
[null,null,null,1513,{"$f":"E1529-$F$12","v":98.664799999999246},149279.84239999886]
[null,null,null,1514,98.654399999999242,149362.76159999886]
[null,null,null,1515,98.643999999999238,149445.65999999884]
[null,null,null,1516,98.633599999999234,149528.53759999885]
[null,null,null,1517,98.62319999999923,149611.39439999883]
[null,null,null,1518,98.612799999999226,149694.23039999884]
[null,null,null,1519,98.602399999999221,149777.04559999882]
[null,null,null,1520,98.591999999999217,149859.8399999988]
[null,null,null,1521,98.581599999999213,149942.61359999879]
[null,null,null,1522,98.571199999999209,150025.36639999881]
[null,null,null,1523,98.560799999999205,150108.09839999879]
[null,null,null,1524,98.5503999999992,150190.80959999879]
[null,null,null,1525,98.539999999999196,150273.49999999878]
[null,null,null,1526,98.529599999999192,150356.16959999877]
[null,null,null,1527,98.519199999999188,150438.81839999877]
[null,null,null,1528,98.508799999999184,150521.44639999876]
[null,null,null,1529,98.498399999999179,150604.05359999873]
[null,null,null,1530,98.487999999999175,150686.63999999873]
[null,null,null,1531,98.477599999999171,150769.20559999874]
[null,null,null,1532,98.467199999999167,150851.75039999871]
[null,null,null,1533,98.456799999999163,150934.27439999871]
[null,null,null,1534,98.446399999999159,151016.77759999872]
[null,null,null,1535,98.435999999999154,151099.2599999987]
[null,null,null,1536,98.42559999999915,151181.72159999871]
[null,null,null,1537,98.415199999999146,151264.16239999869]
[null,null,null,1538,98.404799999999142,151346.58239999868]
[null,null,null,1539,98.394399999999138,151428.98159999866]
[null,null,null,1540,98.383999999999133,151511.35999999868]
[null,null,null,1541,98.373599999999129,151593.71759999866]
[null,null,null,1542,98.363199999999125,151676.05439999865]
[null,null,null,1543,98.352799999999121,151758.37039999865]
[null,null,null,1544,98.342399999999117,151840.66559999864]
[null,null,null,1545,98.331999999999113,151922.93999999863]
[null,null,null,1546,98.321599999999108,152005.19359999863]
[null,null,null,1547,98.311199999999104,152087.4263999986]
[null,null,null,1548,98.3007999999991,152169.6383999986]
[null,null,null,1549,98.290399999999096,152251.8295999986]
[null,null,null,1550,98.279999999999092,152333.9999999986]
[null,null,null,1551,98.269599999999087,152416.14959999858]
[null,null,null,1552,98.259199999999083,152498.27839999858]
[null,null,null,1553,98.248799999999079,152580.38639999856]
[null,null,null,1554,98.238399999999075,152662.47359999857]
[null,null,null,1555,98.227999999999071,152744.53999999855]
[null,null,null,1556,98.217599999999067,152826.58559999854]
[null,null,null,1557,98.207199999999062,152908.61039999855]
[null,null,null,1558,98.196799999999058,152990.61439999854]
[null,null,null,1559,98.186399999999054,153072.59759999852]
[null,null,null,1560,98.17599999999905,153154.55999999851]
[null,null,null,1561,98.165599999999046,153236.5015999985]
[null,null,null,1562,98.155199999999041,153318.4223999985]
[null,null,null,1563,98.144799999999037,153400.32239999849]
[null,null,null,1564,98.134399999999033,153482.20159999849]
[null,null,null,1565,98.123999999999029,153564.05999999848]
[null,null,null,1566,98.113599999999025,153645.89759999848]
[null,null,null,1567,98.103199999999021,153727.71439999845]
[null,null,null,1568,98.092799999999016,153809.51039999846]
[null,null,null,1569,98.082399999999012,153891.28559999846]
[null,null,null,1570,98.071999999999008,153973.03999999844]
[null,null,null,1571,98.061599999999004,154054.77359999844]
[null,null,null,1572,98.051199999999,154136.48639999842]
[null,null,null,1573,98.040799999998995,{"$f":"E1590*D1590","v":154218.17839999843}]
[null,null,null,1574,98.030399999998991,154299.84959999842]
[null,null,null,1575,98.019999999998987,154381.4999999984]
[null,null,null,1576,98.009599999998983,154463.12959999838]
[null,null,null,1577,{"$f":"E1593-$F$12","v":97.999199999998979},154544.7383999984]
[null,null,null,1578,97.988799999998974,154626.32639999839]
[null,null,null,1579,97.97839999999897,154707.89359999838]
[null,null,null,1580,97.967999999998966,154789.43999999837]
[null,null,null,1581,97.957599999998962,154870.96559999837]
[null,null,null,1582,97.947199999998958,154952.47039999836]
[null,null,null,1583,97.936799999998954,155033.95439999836]
[null,null,null,1584,97.926399999998949,155115.41759999833]
[null,null,null,1585,97.915999999998945,155196.85999999833]
[null,null,null,1586,97.905599999998941,155278.28159999833]
[null,null,null,1587,97.895199999998937,155359.6823999983]
[null,null,null,1588,97.884799999998933,155441.06239999831]
[null,null,null,1589,97.874399999998928,155522.42159999828]
[null,null,null,1590,97.863999999998924,155603.75999999829]
[null,null,null,1591,97.85359999999892,155685.07759999827]
[null,null,null,1592,97.843199999998916,155766.37439999828]
[null,null,null,1593,97.832799999998912,155847.65039999827]
[null,null,null,1594,97.822399999998908,155928.90559999825]
[null,null,null,1595,97.811999999998903,156010.13999999824]
[null,null,null,1596,97.801599999998899,156091.35359999826]
[null,null,null,1597,97.791199999998895,156172.54639999825]
[null,null,null,1598,97.780799999998891,156253.71839999824]
[null,null,null,1599,97.770399999998887,156334.86959999823]
[null,null,null,1600,97.759999999998882,156415.99999999822]
[null,null,null,1601,97.749599999998878,156497.10959999819]
[null,null,null,1602,97.739199999998874,156578.19839999819]
[null,null,null,1603,97.72879999999887,156659.26639999819]
[null,null,null,1604,97.718399999998866,156740.31359999819]
[null,null,null,1605,97.707999999998862,156821.33999999816]
[null,null,null,1606,97.697599999998857,156902.34559999817]
[null,null,null,1607,97.687199999998853,156983.33039999814]
[null,null,null,1608,97.676799999998849,157064.29439999815]
[null,null,null,1609,97.666399999998845,157145.23759999813]
[null,null,null,1610,97.655999999998841,157226.15999999814]
[null,null,null,1611,97.645599999998836,157307.06159999812]
[null,null,null,1612,97.635199999998832,157387.94239999811]
[null,null,null,1613,97.624799999998828,157468.80239999812]
[null,null,null,1614,97.614399999998824,157549.64159999811]
[null,null,null,1615,97.60399999999882,157630.4599999981]
[null,null,null,1616,97.593599999998816,157711.25759999809]
[null,null,null,1617,97.583199999998811,157792.03439999808]
[null,null,null,1618,97.572799999998807,157872.79039999808]
[null,null,null,1619,97.562399999998803,157953.52559999807]
[null,null,null,1620,97.551999999998799,158034.23999999804]
[null,null,null,1621,97.541599999998795,158114.93359999804]
[null,null,null,1622,97.53119999999879,158195.60639999804]
[null,null,null,1623,97.520799999998786,158276.25839999804]
[null,null,null,1624,97.510399999998782,158356.88959999802]
[null,null,null,1625,97.499999999998778,158437.49999999802]
[null,null,null,1626,97.489599999998774,158518.089599998]
[null,null,null,1627,97.479199999998769,158598.65839999801]
[null,null,null,1628,97.468799999998765,158679.20639999799]
[null,null,null,1629,97.458399999998761,158759.73359999797]
[null,null,null,1630,97.447999999998757,158840.23999999798]
[null,null,null,1631,97.437599999998753,158920.72559999797]
[null,null,null,1632,97.427199999998749,159001.19039999795]
[null,null,null,1633,97.416799999998744,159081.63439999794]
[null,null,null,1634,97.40639999999874,159162.05759999793]
[null,null,null,1635,97.395999999998736,159242.45999999793]
[null,null,null,1636,97.385599999998732,159322.84159999792]
[null,null,null,1637,97.375199999998728,{"$f":"E1654*D1654","v":159403.20239999791}]
[null,null,null,1638,97.364799999998723,159483.54239999791]
[null,null,null,1639,97.354399999998719,159563.86159999791]
[null,null,null,1640,97.343999999998715,159644.15999999788]
[null,null,null,1641,{"$f":"E1657-$F$12","v":97.333599999998711},159724.43759999788]
[null,null,null,1642,97.323199999998707,159804.69439999788]
[null,null,null,1643,97.312799999998703,159884.93039999786]
[null,null,null,1644,97.302399999998698,159965.14559999786]
[null,null,null,1645,97.291999999998694,160045.33999999784]
[null,null,null,1646,97.28159999999869,160125.51359999785]
[null,null,null,1647,97.271199999998686,160205.66639999783]
[null,null,null,1648,97.260799999998682,160285.79839999782]
[null,null,null,1649,97.250399999998677,160365.90959999783]
[null,null,null,1650,97.239999999998673,160445.99999999782]
[null,null,null,1651,97.229599999998669,160526.06959999781]
[null,null,null,1652,97.219199999998665,160606.11839999779]
[null,null,null,1653,97.208799999998661,160686.14639999779]
[null,null,null,1654,97.198399999998657,160766.15359999778]
[null,null,null,1655,97.187999999998652,160846.13999999777]
[null,null,null,1656,97.177599999998648,160926.10559999777]
[null,null,null,1657,97.167199999998644,161006.05039999777]
[null,null,null,1658,97.15679999999864,161085.97439999774]
[null,null,null,1659,97.146399999998636,161165.87759999774]
[null,null,null,1660,97.135999999998631,161245.75999999774]
[null,null,null,1661,97.125599999998627,161325.62159999771]
[null,null,null,1662,97.115199999998623,161405.46239999772]
[null,null,null,1663,97.104799999998619,161485.2823999977]
[null,null,null,1664,97.094399999998615,161565.08159999771]
[null,null,null,1665,97.083999999998611,161644.85999999769]
[null,null,null,1666,97.073599999998606,161724.61759999767]
[null,null,null,1667,97.063199999998602,161804.35439999768]
[null,null,null,1668,97.052799999998598,161884.07039999767]
[null,null,null,1669,97.042399999998594,161963.76559999766]
[null,null,null,1670,97.03199999999859,162043.43999999764]
[null,null,null,1671,97.021599999998585,162123.09359999764]
[null,null,null,1672,97.011199999998581,162202.72639999763]
[null,null,null,1673,97.000799999998577,162282.33839999762]
[null,null,null,1674,96.990399999998573,162361.92959999762]
[null,null,null,1675,96.979999999998569,162441.49999999761]
[null,null,null,1676,96.969599999998564,162521.04959999758]
[null,null,null,1677,96.95919999999856,162600.57839999758]
[null,null,null,1678,96.948799999998556,162680.08639999758]
[null,null,null,1679,96.938399999998552,162759.57359999756]
[null,null,null,1680,96.927999999998548,162839.03999999756]
[null,null,null,1681,96.917599999998544,162918.48559999754]
[null,null,null,1682,96.907199999998539,162997.91039999755]
[null,null,null,1683,96.896799999998535,163077.31439999753]
[null,null,null,1684,96.886399999998531,163156.69759999754]
[null,null,null,1685,96.875999999998527,163236.05999999752]
[null,null,null,1686,96.865599999998523,163315.40159999751]
[null,null,null,1687,96.855199999998518,163394.7223999975]
[null,null,null,1688,96.844799999998514,163474.02239999748]
[null,null,null,1689,96.83439999999851,163553.30159999747]
[null,null,null,1690,96.823999999998506,163632.55999999747]
[null,null,null,1691,96.813599999998502,163711.79759999746]
[null,null,null,1692,96.803199999998498,163791.01439999745]
[null,null,null,1693,96.792799999998493,163870.21039999745]
[null,null,null,1694,96.782399999998489,163949.38559999745]
[null,null,null,1695,96.771999999998485,164028.53999999742]
[null,null,null,1696,96.761599999998481,164107.67359999742]
[null,null,null,1697,96.751199999998477,164186.78639999742]
[null,null,null,1698,96.740799999998472,164265.8783999974]
[null,null,null,1699,96.730399999998468,164344.9495999974]
[null,null,null,1700,96.719999999998464,164423.99999999738]
[null,null,null,1701,96.70959999999846,{"$f":"E1718*D1718","v":164503.02959999739}]
[null,null,null,1702,96.699199999998456,164582.03839999737]
[null,null,null,1703,96.688799999998452,164661.02639999735]
[null,null,null,1704,96.678399999998447,164739.99359999737]
[null,null,null,1705,{"$f":"E1721-$F$12","v":96.667999999998443},164818.93999999735]
[null,null,null,1706,96.657599999998439,164897.86559999734]
[null,null,null,1707,96.647199999998435,164976.77039999733]
[null,null,null,1708,96.636799999998431,165055.65439999732]
[null,null,null,1709,96.626399999998426,165134.51759999731]
[null,null,null,1710,96.615999999998422,165213.35999999731]
[null,null,null,1711,96.605599999998418,165292.1815999973]
[null,null,null,1712,96.595199999998414,165370.98239999727]
[null,null,null,1713,96.58479999999841,165449.76239999727]
[null,null,null,1714,96.574399999998406,165528.52159999727]
[null,null,null,1715,96.563999999998401,165607.25999999724]
[null,null,null,1716,96.553599999998397,165685.97759999725]
[null,null,null,1717,96.543199999998393,165764.67439999725]
[null,null,null,1718,96.532799999998389,165843.35039999723]
[null,null,null,1719,96.522399999998385,165922.00559999721]
[null,null,null,1720,96.51199999999838,166000.63999999722]
[null,null,null,1721,96.501599999998376,166079.2535999972]
[null,null,null,1722,96.491199999998372,166157.84639999719]
[null,null,null,1723,96.480799999998368,166236.4183999972]
[null,null,null,1724,96.470399999998364,166314.96959999719]
[null,null,null,1725,96.459999999998359,166393.49999999718]
[null,null,null,1726,96.449599999998355,166472.00959999717]
[null,null,null,1727,96.439199999998351,166550.49839999716]
[null,null,null,1728,96.428799999998347,166628.96639999715]
[null,null,null,1729,96.418399999998343,166707.41359999715]
[null,null,null,1730,96.407999999998339,166785.83999999712]
[null,null,null,1731,96.397599999998334,166864.24559999711]
[null,null,null,1732,96.38719999999833,166942.63039999711]
[null,null,null,1733,96.376799999998326,167020.99439999709]
[null,null,null,1734,96.366399999998322,167099.33759999709]
[null,null,null,1735,96.355999999998318,167177.65999999709]
[null,null,null,1736,96.345599999998313,167255.96159999707]
[null,null,null,1737,96.335199999998309,167334.24239999705]
[null,null,null,1738,96.324799999998305,167412.50239999706]
[null,null,null,1739,96.314399999998301,167490.74159999704]
[null,null,null,1740,96.303999999998297,167568.95999999702]
[null,null,null,1741,96.293599999998293,167647.15759999704]
[null,null,null,1742,96.283199999998288,167725.33439999702]
[null,null,null,1743,96.272799999998284,167803.49039999701]
[null,null,null,1744,96.26239999999828,167881.625599997]
[null,null,null,1745,96.251999999998276,167959.73999999699]
[null,null,null,1746,96.241599999998272,168037.83359999699]
[null,null,null,1747,96.231199999998267,168115.90639999698]
[null,null,null,1748,96.220799999998263,168193.95839999698]
[null,null,null,1749,96.210399999998259,168271.98959999694]
[null,null,null,1750,96.199999999998255,168349.99999999694]
[null,null,null,1751,96.189599999998251,168427.98959999694]
[null,null,null,1752,96.179199999998247,168505.95839999692]
[null,null,null,1753,96.168799999998242,168583.90639999692]
[null,null,null,1754,96.158399999998238,168661.8335999969]
[null,null,null,1755,96.147999999998234,168739.73999999691]
[null,null,null,1756,96.13759999999823,168817.62559999689]
[null,null,null,1757,96.127199999998226,168895.4903999969]
[null,null,null,1758,96.116799999998221,168973.33439999688]
[null,null,null,1759,96.106399999998217,169051.15759999686]
[null,null,null,1760,96.095999999998213,169128.95999999685]
[null,null,null,1761,96.085599999998209,169206.74159999684]
[null,null,null,1762,96.075199999998205,169284.50239999683]
[null,null,null,1763,96.064799999998201,169362.24239999682]
[null,null,null,1764,96.054399999998196,169439.96159999681]
[null,null,null,1765,96.043999999998192,{"$f":"E1782*D1782","v":169517.6599999968}]
[null,null,null,1766,96.033599999998188,169595.3375999968]
[null,null,null,1767,96.023199999998184,169672.99439999679]
[null,null,null,1768,96.01279999999818,169750.63039999679]
[null,null,null,1769,{"$f":"E1785-$F$12","v":96.002399999998175},169828.24559999676]
[null,null,null,1770,95.991999999998171,169905.83999999677]
[null,null,null,1771,95.981599999998167,169983.41359999674]
[null,null,null,1772,95.971199999998163,170060.96639999675]
[null,null,null,1773,95.960799999998159,170138.49839999672]
[null,null,null,1774,95.950399999998154,170216.00959999673]
[null,null,null,1775,95.93999999999815,170293.49999999671]
[null,null,null,1776,95.929599999998146,170370.96959999669]
[null,null,null,1777,95.919199999998142,170448.41839999671]
[null,null,null,1778,95.908799999998138,170525.84639999669]
[null,null,null,1779,95.898399999998134,170603.25359999668]
[null,null,null,1780,95.887999999998129,170680.63999999667]
[null,null,null,1781,95.877599999998125,170758.00559999666]
[null,null,null,1782,95.867199999998121,170835.35039999665]
[null,null,null,1783,95.856799999998117,170912.67439999664]
[null,null,null,1784,95.846399999998113,170989.97759999664]
[null,null,null,1785,95.835999999998108,171067.25999999663]
[null,null,null,1786,95.825599999998104,171144.5215999966]
[null,null,null,1787,95.8151999999981,171221.7623999966]
[null,null,null,1788,95.804799999998096,171298.9823999966]
[null,null,null,1789,95.794399999998092,171376.18159999658]
[null,null,null,1790,95.783999999998088,171453.35999999658]
[null,null,null,1791,95.773599999998083,171530.51759999656]
[null,null,null,1792,95.763199999998079,171607.65439999657]
[null,null,null,1793,95.752799999998075,171684.77039999655]
[null,null,null,1794,95.742399999998071,171761.86559999653]
[null,null,null,1795,95.731999999998067,171838.93999999654]
[null,null,null,1796,95.721599999998062,171915.99359999652]
[null,null,null,1797,95.711199999998058,171993.02639999651]
[null,null,null,1798,95.700799999998054,172070.0383999965]
[null,null,null,1799,95.69039999999805,172147.02959999649]
[null,null,null,1800,95.679999999998046,172223.99999999648]
[null,null,null,1801,95.669599999998042,172300.94959999647]
[null,null,null,1802,95.659199999998037,172377.87839999647]
[null,null,null,1803,95.648799999998033,172454.78639999646]
[null,null,null,1804,95.638399999998029,172531.67359999646]
[null,null,null,1805,95.627999999998025,172608.53999999643]
[null,null,null,1806,95.617599999998021,172685.38559999643]
[null,null,null,1807,95.607199999998016,172762.2103999964]
[null,null,null,1808,95.596799999998012,172839.01439999641]
[null,null,null,1809,95.586399999998008,172915.79759999641]
[null,null,null,1810,95.575999999998004,172992.55999999639]
[null,null,null,1811,95.565599999998,173069.30159999637]
[null,null,null,1812,95.555199999997996,173146.02239999638]
[null,null,null,1813,95.544799999997991,173222.72239999636]
[null,null,null,1814,95.534399999997987,173299.40159999634]
[null,null,null,1815,95.523999999997983,173376.05999999633]
[null,null,null,1816,95.513599999997979,173452.69759999632]
[null,null,null,1817,95.503199999997975,173529.31439999631]
[null,null,null,1818,95.49279999999797,173605.9103999963]
[null,null,null,1819,95.482399999997966,173682.48559999629]
[null,null,null,1820,95.471999999997962,173759.03999999628]
[null,null,null,1821,95.461599999997958,173835.57359999628]
[null,null,null,1822,95.451199999997954,173912.08639999627]
[null,null,null,1823,95.440799999997949,173988.57839999627]
[null,null,null,1824,95.430399999997945,174065.04959999624]
[null,null,null,1825,95.419999999997941,174141.49999999625]
[null,null,null,1826,95.409599999997937,174217.92959999622]
[null,null,null,1827,95.399199999997933,174294.33839999622]
[null,null,null,1828,95.388799999997929,174370.7263999962]
[null,null,null,1829,95.378399999997924,{"$f":"E1846*D1846","v":174447.09359999621}]
[null,null,null,1830,95.36799999999792,174523.43999999619]
[null,null,null,1831,95.357599999997916,174599.76559999617]
[null,null,null,1832,95.347199999997912,174676.07039999618]
[null,null,null,1833,{"$f":"E1849-$F$12","v":95.336799999997908},174752.35439999617]
[null,null,null,1834,95.326399999997903,174828.61759999616]
[null,null,null,1835,95.315999999997899,174904.85999999614]
[null,null,null,1836,95.305599999997895,174981.08159999613]
[null,null,null,1837,95.295199999997891,175057.28239999613]
[null,null,null,1838,95.284799999997887,175133.46239999612]
[null,null,null,1839,95.274399999997883,175209.62159999611]
[null,null,null,1840,95.263999999997878,175285.75999999611]
[null,null,null,1841,95.253599999997874,175361.87759999608]
[null,null,null,1842,95.24319999999787,175437.97439999608]
[null,null,null,1843,95.232799999997866,175514.05039999608]
[null,null,null,1844,95.222399999997862,175590.10559999605]
[null,null,null,1845,95.211999999997857,175666.13999999606]
[null,null,null,1846,95.201599999997853,175742.15359999603]
[null,null,null,1847,95.191199999997849,175818.14639999604]
[null,null,null,1848,95.180799999997845,175894.11839999602]
[null,null,null,1849,95.170399999997841,175970.069599996]
[null,null,null,1850,95.159999999997837,176045.99999999598]
[null,null,null,1851,95.149599999997832,176121.909599996]
[null,null,null,1852,95.139199999997828,176197.79839999598]
[null,null,null,1853,95.128799999997824,176273.66639999597]
[null,null,null,1854,95.11839999999782,176349.51359999596]
[null,null,null,1855,95.107999999997816,176425.33999999595]
[null,null,null,1856,95.097599999997811,176501.14559999594]
[null,null,null,1857,95.087199999997807,176576.93039999594]
[null,null,null,1858,95.076799999997803,176652.6943999959]
[null,null,null,1859,95.066399999997799,176728.4375999959]
[null,null,null,1860,95.055999999997795,176804.1599999959]
[null,null,null,1861,95.045599999997791,176879.8615999959]
[null,null,null,1862,95.035199999997786,176955.54239999587]
[null,null,null,1863,95.024799999997782,177031.20239999588]
[null,null,null,1864,95.014399999997778,177106.84159999585]
[null,null,null,1865,95.003999999997774,177182.45999999586]
[null,null,null,1866,94.99359999999777,177258.05759999584]
[null,null,null,1867,94.983199999997765,177333.63439999582]
[null,null,null,1868,94.972799999997761,177409.19039999583]
[null,null,null,1869,94.962399999997757,177484.72559999581]
[null,null,null,1870,94.951999999997753,177560.2399999958]
[null,null,null,1871,94.941599999997749,177635.73359999579]
[null,null,null,1872,94.931199999997744,177711.20639999578]
[null,null,null,1873,94.92079999999774,177786.65839999577]
[null,null,null,1874,94.910399999997736,177862.08959999576]
[null,null,null,1875,94.899999999997732,177937.49999999575]
[null,null,null,1876,94.889599999997728,178012.88959999575]
[null,null,null,1877,94.879199999997724,178088.25839999571]
[null,null,null,1878,94.868799999997719,178163.60639999571]
[null,null,null,1879,94.858399999997715,178238.93359999571]
[null,null,null,1880,94.847999999997711,178314.23999999568]
[null,null,null,1881,94.837599999997707,178389.52559999569]
[null,null,null,1882,94.827199999997703,178464.79039999569]
[null,null,null,1883,94.816799999997698,178540.03439999567]
[null,null,null,1884,94.806399999997694,178615.25759999565]
[null,null,null,1885,94.79599999999769,178690.45999999566]
[null,null,null,1886,94.785599999997686,178765.64159999564]
[null,null,null,1887,94.775199999997682,178840.80239999562]
[null,null,null,1888,94.764799999997678,178915.94239999561]
[null,null,null,1889,94.754399999997673,178991.06159999559]
[null,null,null,1890,94.743999999997669,179066.15999999561]
[null,null,null,1891,94.733599999997665,179141.2375999956]
[null,null,null,1892,94.723199999997661,179216.29439999556]
[null,null,null,1893,94.712799999997657,{"$f":"E1910*D1910","v":179291.33039999555}]
[null,null,null,1894,94.702399999997652,179366.34559999555]
[null,null,null,1895,94.691999999997648,179441.33999999554]
[null,null,null,1896,94.681599999997644,179516.31359999554]
[null,null,null,1897,{"$f":"E1913-$F$12","v":94.67119999999764},179591.26639999551]
[null,null,null,1898,94.660799999997636,179666.19839999551]
[null,null,null,1899,94.650399999997632,179741.10959999551]
[null,null,null,1900,94.639999999997627,179815.99999999549]
[null,null,null,1901,94.629599999997623,179890.86959999549]
[null,null,null,1902,94.619199999997619,179965.71839999547]
[null,null,null,1903,94.608799999997615,180040.54639999545]
[null,null,null,1904,94.598399999997611,180115.35359999546]
[null,null,null,1905,94.587999999997606,180190.13999999544]
[null,null,null,1906,94.577599999997602,180264.90559999543]
[null,null,null,1907,94.567199999997598,180339.65039999541]
[null,null,null,1908,94.556799999997594,180414.3743999954]
[null,null,null,1909,94.54639999999759,180489.07759999539]
[null,null,null,1910,94.535999999997586,180563.75999999538]
[null,null,null,1911,94.525599999997581,180638.42159999537]
[null,null,null,1912,94.515199999997577,180713.06239999537]
[null,null,null,1913,94.504799999997573,180787.68239999536]
[null,null,null,1914,94.494399999997569,180862.28159999536]
[null,null,null,1915,94.483999999997565,180936.85999999533]
[null,null,null,1916,94.47359999999756,181011.41759999533]
[null,null,null,1917,94.463199999997556,181085.9543999953]
[null,null,null,1918,94.452799999997552,181160.47039999531]
[null,null,null,1919,94.442399999997548,181234.96559999528]
[null,null,null,1920,94.431999999997544,181309.43999999529]
[null,null,null,1921,94.421599999997539,181383.89359999527]
[null,null,null,1922,94.411199999997535,181458.32639999528]
[null,null,null,1923,94.400799999997531,181532.73839999526]
[null,null,null,1924,94.390399999997527,181607.12959999524]
[null,null,null,1925,94.379999999997523,181681.49999999523]
[null,null,null,1926,94.369599999997519,181755.84959999521]
[null,null,null,1927,94.359199999997514,181830.1783999952]
[null,null,null,1928,94.34879999999751,181904.48639999519]
[null,null,null,1929,94.338399999997506,181978.77359999518]
[null,null,null,1930,94.327999999997502,182053.03999999518]
[null,null,null,1931,94.317599999997498,182127.28559999517]
[null,null,null,1932,94.307199999997493,182201.51039999517]
[null,null,null,1933,94.296799999997489,182275.71439999514]
[null,null,null,1934,94.286399999997485,182349.89759999514]
[null,null,null,1935,94.275999999997481,182424.05999999514]
[null,null,null,1936,94.265599999997477,182498.20159999511]
[null,null,null,1937,94.255199999997473,182572.32239999512]
[null,null,null,1938,94.244799999997468,182646.42239999509]
[null,null,null,1939,94.234399999997464,182720.50159999507]
[null,null,null,1940,94.22399999999746,182794.55999999508]
[null,null,null,1941,94.213599999997456,182868.59759999506]
[null,null,null,1942,94.203199999997452,182942.61439999504]
[null,null,null,1943,94.192799999997447,183016.61039999503]
[null,null,null,1944,94.182399999997443,183090.58559999504]
[null,null,null,1945,94.171999999997439,183164.53999999503]
[null,null,null,1946,94.161599999997435,183238.47359999502]
[null,null,null,1947,94.151199999997431,183312.38639999501]
[null,null,null,1948,94.140799999997427,183386.27839999498]
[null,null,null,1949,94.130399999997422,183460.14959999497]
[null,null,null,1950,94.119999999997418,183533.99999999497]
[null,null,null,1951,94.109599999997414,183607.82959999496]
[null,null,null,1952,94.09919999999741,183681.63839999493]
[null,null,null,1953,94.088799999997406,183755.42639999493]
[null,null,null,1954,94.078399999997401,183829.19359999493]
[null,null,null,1955,94.067999999997397,183902.93999999491]
[null,null,null,1956,94.057599999997393,183976.66559999491]
[null,null,null,1957,94.047199999997389,{"$f":"E1974*D1974","v":184050.37039999489}]
[null,null,null,1958,94.036799999997385,184124.05439999487]
[null,null,null,1959,94.026399999997381,184197.71759999488]
[null,null,null,1960,94.015999999997376,184271.35999999486]
[null,null,null,1961,{"$f":"E1977-$F$12","v":94.005599999997372},184344.98159999485]
[null,null,null,1962,93.995199999997368,184418.58239999483]
[null,null,null,1963,93.984799999997364,184492.16239999482]
[null,null,null,1964,93.97439999999736,184565.72159999481]
[null,null,null,1965,93.963999999997355,184639.2599999948]
[null,null,null,1966,93.953599999997351,184712.77759999479]
[null,null,null,1967,93.943199999997347,184786.27439999479]
[null,null,null,1968,93.932799999997343,184859.75039999478]
[null,null,null,1969,93.922399999997339,184933.20559999475]
[null,null,null,1970,93.911999999997334,185006.63999999475]
[null,null,null,1971,93.90159999999733,185080.05359999475]
[null,null,null,1972,93.891199999997326,185153.44639999472]
[null,null,null,1973,93.880799999997322,185226.81839999472]
[null,null,null,1974,93.870399999997318,185300.1695999947]
[null,null,null,1975,93.859999999997314,185373.4999999947]
[null,null,null,1976,93.849599999997309,185446.80959999468]
[null,null,null,1977,93.839199999997305,185520.09839999466]
[null,null,null,1978,93.828799999997301,185593.36639999467]
[null,null,null,1979,93.818399999997297,185666.61359999466]
[null,null,null,1980,93.807999999997293,185739.83999999464]
[null,null,null,1981,93.797599999997288,185813.04559999463]
[null,null,null,1982,93.787199999997284,185886.23039999462]
[null,null,null,1983,93.77679999999728,185959.39439999461]
[null,null,null,1984,93.766399999997276,186032.5375999946]
[null,null,null,1985,93.755999999997272,186105.65999999459]
[null,null,null,1986,93.745599999997268,186178.76159999458]
[null,null,null,1987,93.735199999997263,186251.84239999455]
[null,null,null,1988,93.724799999997259,186324.90239999455]
[null,null,null,1989,93.714399999997255,186397.94159999455]
[null,null,null,1990,93.703999999997251,186470.95999999452]
[null,null,null,1991,93.693599999997247,186543.95759999452]
[null,null,null,1992,93.683199999997242,186616.9343999945]
[null,null,null,1993,93.672799999997238,186689.8903999945]
[null,null,null,1994,93.662399999997234,186762.82559999448]
[null,null,null,1995,93.65199999999723,186835.73999999446]
[null,null,null,1996,93.641599999997226,186908.63359999447]
[null,null,null,1997,93.631199999997222,186981.50639999445]
[null,null,null,1998,93.620799999997217,187054.35839999444]
[null,null,null,1999,93.610399999997213,187127.18959999442]
[null,null,null,2000,93.599999999997209,187199.99999999441]
[null,null,null,2001,{"$f":"$E$13","v":93.600000000000009},187293.6]
[null,null,null,2002,{"$f":"$E$13","v":93.600000000000009},187387.2]
[null,null,null,2003,93.600000000000009,187480.80000000002]
[null,null,null,2004,93.600000000000009,187574.40000000002]
[null,null,null,2005,93.600000000000009,187668.00000000003]
[null,null,null,2006,93.600000000000009,187761.6]
[null,null,null,2007,93.600000000000009,187855.2]
[null,null,null,2008,93.600000000000009,187948.80000000002]
[null,null,null,2009,93.600000000000009,188042.40000000002]
[null,null,null,2010,93.600000000000009,188136.00000000003]
[null,null,null,2011,93.600000000000009,188229.6]
[null,null,null,2012,93.600000000000009,188323.20000000001]
[null,null,null,2013,93.600000000000009,188416.80000000002]
[null,null,null,2014,93.600000000000009,188510.40000000002]
[null,null,null,2015,93.600000000000009,188604.00000000003]
[null,null,null,2016,93.600000000000009,188697.60000000001]
[null,null,null,2017,93.600000000000009,188791.2]
[null,null,null,2018,93.600000000000009,188884.80000000002]
[null,null,null,2019,93.600000000000009,188978.40000000002]
[null,null,null,2020,93.600000000000009,189072.00000000003]
[null,null,null,2021,93.600000000000009,{"$f":"E2038*D2038","v":189165.6}]
[null,null,null,2022,93.600000000000009,189259.2]
[null,null,null,2023,93.600000000000009,189352.80000000002]
[null,null,null,2024,93.600000000000009,189446.40000000002]
[null,null,null,2025,93.600000000000009,189540.00000000003]
[null,null,null,2026,93.600000000000009,189633.6]
[null,null,null,2027,93.600000000000009,189727.2]
[null,null,null,2028,93.600000000000009,189820.80000000002]
[null,null,null,2029,93.600000000000009,189914.40000000002]
[null,null,null,2030,93.600000000000009,190008.00000000003]
[null,null,null,2031,93.600000000000009,190101.6]
[null,null,null,2032,93.600000000000009,190195.20000000001]
[null,null,null,2033,93.600000000000009,190288.80000000002]
[null,null,null,2034,93.600000000000009,190382.40000000002]
[null,null,null,2035,93.600000000000009,190476.00000000003]
[null,null,null,2036,93.600000000000009,190569.60000000001]
[null,null,null,2037,93.600000000000009,190663.2]
[null,null,null,2038,93.600000000000009,190756.80000000002]
[null,null,null,2039,93.600000000000009,190850.40000000002]
[null,null,null,2040,93.600000000000009,190944.00000000003]
[null,null,null,2041,93.600000000000009,191037.6]
[null,null,null,2042,93.600000000000009,191131.2]
[null,null,null,2043,93.600000000000009,191224.80000000002]
[null,null,null,2044,93.600000000000009,191318.40000000002]
[null,null,null,2045,93.600000000000009,191412.00000000003]
[null,null,null,2046,93.600000000000009,191505.6]
[null,null,null,2047,93.600000000000009,191599.2]
[null,null,null,2048,93.600000000000009,191692.80000000002]
[null,null,null,2049,93.600000000000009,191786.40000000002]
[null,null,null,2050,93.600000000000009,191880.00000000003]
[null,null,null,2051,93.600000000000009,191973.6]
[null,null,null,2052,93.600000000000009,192067.20000000001]
[null,null,null,2053,93.600000000000009,192160.80000000002]
[null,null,null,2054,93.600000000000009,192254.40000000002]
[null,null,null,2055,93.600000000000009,192348.00000000003]
[null,null,null,2056,93.600000000000009,192441.60000000001]
[null,null,null,2057,93.600000000000009,192535.2]
[null,null,null,2058,93.600000000000009,192628.80000000002]
[null,null,null,2059,93.600000000000009,192722.40000000002]
[null,null,null,2060,93.600000000000009,192816.00000000003]
[null,null,null,2061,93.600000000000009,192909.6]
[null,null,null,2062,93.600000000000009,193003.2]
[null,null,null,2063,93.600000000000009,193096.80000000002]
[null,null,null,2064,93.600000000000009,193190.40000000002]
[null,null,null,2065,93.600000000000009,193284.00000000003]
[null,null,null,2066,{"$f":"$E$13","v":93.600000000000009},193377.6]
[null,null,null,2067,93.600000000000009,193471.2]
[null,null,null,2068,93.600000000000009,193564.80000000002]
[null,null,null,2069,93.600000000000009,193658.40000000002]
[null,null,null,2070,93.600000000000009,193752.00000000003]
[null,null,null,2071,93.600000000000009,193845.6]
[null,null,null,2072,93.600000000000009,193939.20000000001]
[null,null,null,2073,93.600000000000009,194032.80000000002]
[null,null,null,2074,93.600000000000009,194126.40000000002]
[null,null,null,2075,93.600000000000009,194220.00000000003]
[null,null,null,2076,93.600000000000009,194313.60000000001]
[null,null,null,2077,93.600000000000009,194407.2]
[null,null,null,2078,93.600000000000009,194500.80000000002]
[null,null,null,2079,93.600000000000009,194594.40000000002]
[null,null,null,2080,93.600000000000009,194688.00000000003]
[null,null,null,2081,93.600000000000009,194781.6]
[null,null,null,2082,93.600000000000009,194875.2]
[null,null,null,2083,93.600000000000009,194968.80000000002]
[null,null,null,2084,93.600000000000009,195062.40000000002]
[null,null,null,2085,93.600000000000009,{"$f":"E2102*D2102","v":195156.00000000003}]
[null,null,null,2086,93.600000000000009,195249.6]
[null,null,null,2087,93.600000000000009,195343.2]
[null,null,null,2088,93.600000000000009,195436.80000000002]
[null,null,null,2089,93.600000000000009,195530.40000000002]
[null,null,null,2090,93.600000000000009,195624.00000000003]
[null,null,null,2091,93.600000000000009,195717.6]
[null,null,null,2092,93.600000000000009,195811.20000000001]
[null,null,null,2093,93.600000000000009,195904.80000000002]
[null,null,null,2094,93.600000000000009,195998.40000000002]
[null,null,null,2095,93.600000000000009,196092.00000000003]
[null,null,null,2096,93.600000000000009,196185.60000000001]
[null,null,null,2097,93.600000000000009,196279.2]
[null,null,null,2098,93.600000000000009,196372.80000000002]
[null,null,null,2099,93.600000000000009,196466.40000000002]
[null,null,null,2100,93.600000000000009,196560.00000000003]
[null,null,null,2101,93.600000000000009,196653.6]
[null,null,null,2102,93.600000000000009,196747.2]
[null,null,null,2103,93.600000000000009,196840.80000000002]
[null,null,null,2104,93.600000000000009,196934.40000000002]
[null,null,null,2105,93.600000000000009,197028.00000000003]
[null,null,null,2106,93.600000000000009,197121.6]
[null,null,null,2107,93.600000000000009,197215.2]
[null,null,null,2108,93.600000000000009,197308.80000000002]
[null,null,null,2109,93.600000000000009,197402.40000000002]
[null,null,null,2110,93.600000000000009,197496.00000000003]
[null,null,null,2111,93.600000000000009,197589.6]
[null,null,null,2112,93.600000000000009,197683.20000000001]
[null,null,null,2113,93.600000000000009,197776.80000000002]
[null,null,null,2114,93.600000000000009,197870.40000000002]
[null,null,null,2115,93.600000000000009,197964.00000000003]
[null,null,null,2116,93.600000000000009,198057.60000000001]
[null,null,null,2117,93.600000000000009,198151.2]
[null,null,null,2118,93.600000000000009,198244.80000000002]
[null,null,null,2119,93.600000000000009,198338.40000000002]
[null,null,null,2120,93.600000000000009,198432.00000000003]
[null,null,null,2121,93.600000000000009,198525.6]
[null,null,null,2122,93.600000000000009,198619.2]
[null,null,null,2123,93.600000000000009,198712.80000000002]
[null,null,null,2124,93.600000000000009,198806.40000000002]
[null,null,null,2125,93.600000000000009,198900.00000000003]
[null,null,null,2126,93.600000000000009,198993.6]
[null,null,null,2127,93.600000000000009,199087.2]
[null,null,null,2128,93.600000000000009,199180.80000000002]
[null,null,null,2129,93.600000000000009,199274.40000000002]
[null,null,null,2130,{"$f":"$E$13","v":93.600000000000009},199368.00000000003]
[null,null,null,2131,93.600000000000009,199461.6]
[null,null,null,2132,93.600000000000009,199555.20000000001]
[null,null,null,2133,93.600000000000009,199648.80000000002]
[null,null,null,2134,93.600000000000009,199742.40000000002]
[null,null,null,2135,93.600000000000009,199836.00000000003]
[null,null,null,2136,93.600000000000009,199929.60000000001]
[null,null,null,2137,93.600000000000009,200023.2]
[null,null,null,2138,93.600000000000009,200116.80000000002]
[null,null,null,2139,93.600000000000009,200210.40000000002]
[null,null,null,2140,93.600000000000009,200304.00000000003]
[null,null,null,2141,93.600000000000009,200397.6]
[null,null,null,2142,93.600000000000009,200491.2]
[null,null,null,2143,93.600000000000009,200584.80000000002]
[null,null,null,2144,93.600000000000009,200678.40000000002]
[null,null,null,2145,93.600000000000009,200772.00000000003]
[null,null,null,2146,93.600000000000009,200865.6]
[null,null,null,2147,93.600000000000009,200959.2]
[null,null,null,2148,93.600000000000009,201052.80000000002]
[null,null,null,2149,93.600000000000009,{"$f":"E2166*D2166","v":201146.40000000002}]
[null,null,null,2150,93.600000000000009,201240.00000000003]
[null,null,null,2151,93.600000000000009,201333.6]
[null,null,null,2152,93.600000000000009,201427.20000000001]
[null,null,null,2153,93.600000000000009,201520.80000000002]
[null,null,null,2154,93.600000000000009,201614.40000000002]
[null,null,null,2155,93.600000000000009,201708.00000000003]
[null,null,null,2156,93.600000000000009,201801.60000000001]
[null,null,null,2157,93.600000000000009,201895.2]
[null,null,null,2158,93.600000000000009,201988.80000000002]
[null,null,null,2159,93.600000000000009,202082.40000000002]
[null,null,null,2160,93.600000000000009,202176.00000000003]
[null,null,null,2161,93.600000000000009,202269.6]
[null,null,null,2162,93.600000000000009,202363.2]
[null,null,null,2163,93.600000000000009,202456.80000000002]
[null,null,null,2164,93.600000000000009,202550.40000000002]
[null,null,null,2165,93.600000000000009,202644.00000000003]
[null,null,null,2166,93.600000000000009,202737.6]
[null,null,null,2167,93.600000000000009,202831.2]
[null,null,null,2168,93.600000000000009,202924.80000000002]
[null,null,null,2169,93.600000000000009,203018.40000000002]
[null,null,null,2170,93.600000000000009,203112.00000000003]
[null,null,null,2171,93.600000000000009,203205.6]
[null,null,null,2172,93.600000000000009,203299.20000000001]
[null,null,null,2173,93.600000000000009,203392.80000000002]
[null,null,null,2174,93.600000000000009,203486.40000000002]
[null,null,null,2175,93.600000000000009,203580.00000000003]
[null,null,null,2176,93.600000000000009,203673.60000000001]
[null,null,null,2177,93.600000000000009,203767.2]
[null,null,null,2178,93.600000000000009,203860.80000000002]
[null,null,null,2179,93.600000000000009,203954.40000000002]
[null,null,null,2180,93.600000000000009,204048.00000000003]
[null,null,null,2181,93.600000000000009,204141.6]
[null,null,null,2182,93.600000000000009,204235.2]
[null,null,null,2183,93.600000000000009,204328.80000000002]
[null,null,null,2184,93.600000000000009,204422.40000000002]
[null,null,null,2185,93.600000000000009,204516.00000000003]
[null,null,null,2186,93.600000000000009,204609.6]
[null,null,null,2187,93.600000000000009,204703.2]
[null,null,null,2188,93.600000000000009,204796.80000000002]
[null,null,null,2189,93.600000000000009,204890.40000000002]
[null,null,null,2190,93.600000000000009,204984.00000000003]
[null,null,null,2191,93.600000000000009,205077.6]
[null,null,null,2192,93.600000000000009,205171.20000000001]
[null,null,null,2193,93.600000000000009,205264.80000000002]
[null,null,null,2194,{"$f":"$E$13","v":93.600000000000009},205358.40000000002]
[null,null,null,2195,93.600000000000009,205452.00000000003]
[null,null,null,2196,93.600000000000009,205545.60000000001]
[null,null,null,2197,93.600000000000009,205639.2]
[null,null,null,2198,93.600000000000009,205732.80000000002]
[null,null,null,2199,93.600000000000009,205826.40000000002]
[null,null,null,2200,93.600000000000009,205920.00000000003]
[null,null,null,2201,93.600000000000009,206013.6]
[null,null,null,2202,93.600000000000009,206107.2]
[null,null,null,2203,93.600000000000009,206200.80000000002]
[null,null,null,2204,93.600000000000009,206294.40000000002]
[null,null,null,2205,93.600000000000009,206388.00000000003]
[null,null,null,2206,93.600000000000009,206481.6]
[null,null,null,2207,93.600000000000009,206575.2]
[null,null,null,2208,93.600000000000009,206668.80000000002]
[null,null,null,2209,93.600000000000009,206762.40000000002]
[null,null,null,2210,93.600000000000009,206856.00000000003]
[null,null,null,2211,93.600000000000009,206949.6]
[null,null,null,2212,93.600000000000009,207043.20000000001]
[null,null,null,2213,93.600000000000009,{"$f":"E2230*D2230","v":207136.80000000002}]
[null,null,null,2214,93.600000000000009,207230.40000000002]
[null,null,null,2215,93.600000000000009,207324.00000000003]
[null,null,null,2216,93.600000000000009,207417.60000000001]
[null,null,null,2217,93.600000000000009,207511.2]
[null,null,null,2218,93.600000000000009,207604.80000000002]
[null,null,null,2219,93.600000000000009,207698.40000000002]
[null,null,null,2220,93.600000000000009,207792.00000000003]
[null,null,null,2221,93.600000000000009,207885.6]
[null,null,null,2222,93.600000000000009,207979.2]
[null,null,null,2223,93.600000000000009,208072.80000000002]
[null,null,null,2224,93.600000000000009,208166.40000000002]
[null,null,null,2225,93.600000000000009,208260.00000000003]
[null,null,null,2226,93.600000000000009,208353.6]
[null,null,null,2227,93.600000000000009,208447.2]
[null,null,null,2228,93.600000000000009,208540.80000000002]
[null,null,null,2229,93.600000000000009,208634.40000000002]
[null,null,null,2230,93.600000000000009,208728.00000000003]
[null,null,null,2231,93.600000000000009,208821.6]
[null,null,null,2232,93.600000000000009,208915.20000000001]
[null,null,null,2233,93.600000000000009,209008.80000000002]
[null,null,null,2234,93.600000000000009,209102.40000000002]
[null,null,null,2235,93.600000000000009,209196.00000000003]
[null,null,null,2236,93.600000000000009,209289.60000000001]
[null,null,null,2237,93.600000000000009,209383.2]
[null,null,null,2238,93.600000000000009,209476.80000000002]
[null,null,null,2239,93.600000000000009,209570.40000000002]
[null,null,null,2240,93.600000000000009,209664.00000000003]
[null,null,null,2241,93.600000000000009,209757.6]
[null,null,null,2242,93.600000000000009,209851.2]
[null,null,null,2243,93.600000000000009,209944.80000000002]
[null,null,null,2244,93.600000000000009,210038.40000000002]
[null,null,null,2245,93.600000000000009,210132.00000000003]
[null,null,null,2246,93.600000000000009,210225.6]
[null,null,null,2247,93.600000000000009,210319.2]
[null,null,null,2248,93.600000000000009,210412.80000000002]
[null,null,null,2249,93.600000000000009,210506.40000000002]
[null,null,null,2250,93.600000000000009,210600.00000000003]
[null,null,null,2251,93.600000000000009,210693.6]
[null,null,null,2252,93.600000000000009,210787.20000000001]
[null,null,null,2253,93.600000000000009,210880.80000000002]
[null,null,null,2254,93.600000000000009,210974.40000000002]
[null,null,null,2255,93.600000000000009,211068.00000000003]
[null,null,null,2256,93.600000000000009,211161.60000000001]
[null,null,null,2257,93.600000000000009,211255.2]
[null,null,null,2258,{"$f":"$E$13","v":93.600000000000009},211348.80000000002]
[null,null,null,2259,93.600000000000009,211442.40000000002]
[null,null,null,2260,93.600000000000009,211536.00000000003]
[null,null,null,2261,93.600000000000009,211629.6]
[null,null,null,2262,93.600000000000009,211723.2]
[null,null,null,2263,93.600000000000009,211816.80000000002]
[null,null,null,2264,93.600000000000009,211910.40000000002]
[null,null,null,2265,93.600000000000009,212004.00000000003]
[null,null,null,2266,93.600000000000009,212097.6]
[null,null,null,2267,93.600000000000009,212191.2]
[null,null,null,2268,93.600000000000009,212284.80000000002]
[null,null,null,2269,93.600000000000009,212378.40000000002]
[null,null,null,2270,93.600000000000009,212472.00000000003]
[null,null,null,2271,93.600000000000009,212565.6]
[null,null,null,2272,93.600000000000009,212659.20000000001]
[null,null,null,2273,93.600000000000009,212752.80000000002]
[null,null,null,2274,93.600000000000009,212846.40000000002]
[null,null,null,2275,93.600000000000009,212940.00000000003]
[null,null,null,2276,93.600000000000009,213033.60000000001]
[null,null,null,2277,93.600000000000009,{"$f":"E2294*D2294","v":213127.2}]
[null,null,null,2278,93.600000000000009,213220.80000000002]
[null,null,null,2279,93.600000000000009,213314.40000000002]
[null,null,null,2280,93.600000000000009,213408.00000000003]
[null,null,null,2281,93.600000000000009,213501.6]
[null,null,null,2282,93.600000000000009,213595.2]
[null,null,null,2283,93.600000000000009,213688.80000000002]
[null,null,null,2284,93.600000000000009,213782.40000000002]
[null,null,null,2285,93.600000000000009,213876.00000000003]
[null,null,null,2286,93.600000000000009,213969.6]
[null,null,null,2287,93.600000000000009,214063.2]
[null,null,null,2288,93.600000000000009,214156.80000000002]
[null,null,null,2289,93.600000000000009,214250.40000000002]
[null,null,null,2290,93.600000000000009,214344.00000000003]
[null,null,null,2291,93.600000000000009,214437.6]
[null,null,null,2292,93.600000000000009,214531.20000000001]
[null,null,null,2293,93.600000000000009,214624.80000000002]
[null,null,null,2294,93.600000000000009,214718.40000000002]
[null,null,null,2295,93.600000000000009,214812.00000000003]
[null,null,null,2296,93.600000000000009,214905.60000000001]
[null,null,null,2297,93.600000000000009,214999.2]
[null,null,null,2298,93.600000000000009,215092.80000000002]
[null,null,null,2299,93.600000000000009,215186.40000000002]
[null,null,null,2300,93.600000000000009,215280.00000000003]
[null,null,null,2301,93.600000000000009,215373.6]
[null,null,null,2302,93.600000000000009,215467.2]
[null,null,null,2303,93.600000000000009,215560.80000000002]
[null,null,null,2304,93.600000000000009,215654.40000000002]
[null,null,null,2305,93.600000000000009,215748.00000000003]
[null,null,null,2306,93.600000000000009,215841.6]
[null,null,null,2307,93.600000000000009,215935.2]
[null,null,null,2308,93.600000000000009,216028.80000000002]
[null,null,null,2309,93.600000000000009,216122.40000000002]
[null,null,null,2310,93.600000000000009,216216.00000000003]
[null,null,null,2311,93.600000000000009,216309.6]
[null,null,null,2312,93.600000000000009,216403.20000000001]
[null,null,null,2313,93.600000000000009,216496.80000000002]
[null,null,null,2314,93.600000000000009,216590.40000000002]
[null,null,null,2315,93.600000000000009,216684.00000000003]
[null,null,null,2316,93.600000000000009,216777.60000000001]
[null,null,null,2317,93.600000000000009,216871.2]
[null,null,null,2318,93.600000000000009,216964.80000000002]
[null,null,null,2319,93.600000000000009,217058.40000000002]
[null,null,null,2320,93.600000000000009,217152.00000000003]
[null,null,null,2321,93.600000000000009,217245.6]
[null,null,null,2322,{"$f":"$E$13","v":93.600000000000009},217339.2]
[null,null,null,2323,93.600000000000009,217432.80000000002]
[null,null,null,2324,93.600000000000009,217526.40000000002]
[null,null,null,2325,93.600000000000009,217620.00000000003]
[null,null,null,2326,93.600000000000009,217713.6]
[null,null,null,2327,93.600000000000009,217807.2]
[null,null,null,2328,93.600000000000009,217900.80000000002]
[null,null,null,2329,93.600000000000009,217994.40000000002]
[null,null,null,2330,93.600000000000009,218088.00000000003]
[null,null,null,2331,93.600000000000009,218181.6]
[null,null,null,2332,93.600000000000009,218275.20000000001]
[null,null,null,2333,93.600000000000009,218368.80000000002]
[null,null,null,2334,93.600000000000009,218462.40000000002]
[null,null,null,2335,93.600000000000009,218556.00000000003]
[null,null,null,2336,93.600000000000009,218649.60000000001]
[null,null,null,2337,93.600000000000009,218743.2]
[null,null,null,2338,93.600000000000009,218836.80000000002]
[null,null,null,2339,93.600000000000009,218930.40000000002]
[null,null,null,2340,93.600000000000009,219024.00000000003]
[null,null,null,2341,93.600000000000009,{"$f":"E2358*D2358","v":219117.6}]
[null,null,null,2342,93.600000000000009,219211.2]
[null,null,null,2343,93.600000000000009,219304.80000000002]
[null,null,null,2344,93.600000000000009,219398.40000000002]
[null,null,null,2345,93.600000000000009,219492.00000000003]
[null,null,null,2346,93.600000000000009,219585.6]
[null,null,null,2347,93.600000000000009,219679.2]
[null,null,null,2348,93.600000000000009,219772.80000000002]
[null,null,null,2349,93.600000000000009,219866.40000000002]
[null,null,null,2350,93.600000000000009,219960.00000000003]
[null,null,null,2351,93.600000000000009,220053.6]
[null,null,null,2352,93.600000000000009,220147.20000000001]
[null,null,null,2353,93.600000000000009,220240.80000000002]
[null,null,null,2354,93.600000000000009,220334.40000000002]
[null,null,null,2355,93.600000000000009,220428.00000000003]
[null,null,null,2356,93.600000000000009,220521.60000000001]
[null,null,null,2357,93.600000000000009,220615.2]
[null,null,null,2358,93.600000000000009,220708.80000000002]
[null,null,null,2359,93.600000000000009,220802.40000000002]
[null,null,null,2360,93.600000000000009,220896.00000000003]
[null,null,null,2361,93.600000000000009,220989.6]
[null,null,null,2362,93.600000000000009,221083.2]
[null,null,null,2363,93.600000000000009,221176.80000000002]
[null,null,null,2364,93.600000000000009,221270.40000000002]
[null,null,null,2365,93.600000000000009,221364.00000000003]
[null,null,null,2366,93.600000000000009,221457.6]
[null,null,null,2367,93.600000000000009,221551.2]
[null,null,null,2368,93.600000000000009,221644.80000000002]
[null,null,null,2369,93.600000000000009,221738.40000000002]
[null,null,null,2370,93.600000000000009,221832.00000000003]
[null,null,null,2371,93.600000000000009,221925.6]
[null,null,null,2372,93.600000000000009,222019.20000000001]
[null,null,null,2373,93.600000000000009,222112.80000000002]
[null,null,null,2374,93.600000000000009,222206.40000000002]
[null,null,null,2375,93.600000000000009,222300.00000000003]
[null,null,null,2376,93.600000000000009,222393.60000000001]
[null,null,null,2377,93.600000000000009,222487.2]
[null,null,null,2378,93.600000000000009,222580.80000000002]
[null,null,null,2379,93.600000000000009,222674.40000000002]
[null,null,null,2380,93.600000000000009,222768.00000000003]
[null,null,null,2381,93.600000000000009,222861.6]
[null,null,null,2382,93.600000000000009,222955.2]
[null,null,null,2383,93.600000000000009,223048.80000000002]
[null,null,null,2384,93.600000000000009,223142.40000000002]
[null,null,null,2385,93.600000000000009,223236.00000000003]
[null,null,null,2386,{"$f":"$E$13","v":93.600000000000009},223329.6]
[null,null,null,2387,93.600000000000009,223423.2]
[null,null,null,2388,93.600000000000009,223516.80000000002]
[null,null,null,2389,93.600000000000009,223610.40000000002]
[null,null,null,2390,93.600000000000009,223704.00000000003]
[null,null,null,2391,93.600000000000009,223797.60000000003]
[null,null,null,2392,93.600000000000009,223891.20000000001]
[null,null,null,2393,93.600000000000009,223984.80000000002]
[null,null,null,2394,93.600000000000009,224078.40000000002]
[null,null,null,2395,93.600000000000009,224172.00000000003]
[null,null,null,2396,93.600000000000009,224265.60000000003]
[null,null,null,2397,93.600000000000009,224359.2]
[null,null,null,2398,93.600000000000009,224452.80000000002]
[null,null,null,2399,93.600000000000009,224546.40000000002]
[null,null,null,2400,93.600000000000009,224640.00000000003]
[null,null,null,2401,93.600000000000009,224733.60000000003]
[null,null,null,2402,93.600000000000009,224827.2]
[null,null,null,2403,93.600000000000009,224920.80000000002]
[null,null,null,2404,93.600000000000009,225014.40000000002]
[null,null,null,2405,93.600000000000009,{"$f":"E2422*D2422","v":225108.00000000003}]
[null,null,null,2406,93.600000000000009,225201.60000000003]
[null,null,null,2407,93.600000000000009,225295.2]
[null,null,null,2408,93.600000000000009,225388.80000000002]
[null,null,null,2409,93.600000000000009,225482.40000000002]
[null,null,null,2410,93.600000000000009,225576.00000000003]
[null,null,null,2411,93.600000000000009,225669.60000000003]
[null,null,null,2412,93.600000000000009,225763.20000000001]
[null,null,null,2413,93.600000000000009,225856.80000000002]
[null,null,null,2414,93.600000000000009,225950.40000000002]
[null,null,null,2415,93.600000000000009,226044.00000000003]
[null,null,null,2416,93.600000000000009,226137.60000000003]
[null,null,null,2417,93.600000000000009,226231.2]
[null,null,null,2418,93.600000000000009,226324.80000000002]
[null,null,null,2419,93.600000000000009,226418.40000000002]
[null,null,null,2420,93.600000000000009,226512.00000000003]
[null,null,null,2421,93.600000000000009,226605.60000000003]
[null,null,null,2422,93.600000000000009,226699.2]
[null,null,null,2423,93.600000000000009,226792.80000000002]
[null,null,null,2424,93.600000000000009,226886.40000000002]
[null,null,null,2425,93.600000000000009,226980.00000000003]
[null,null,null,2426,93.600000000000009,227073.60000000003]
[null,null,null,2427,93.600000000000009,227167.2]
[null,null,null,2428,93.600000000000009,227260.80000000002]
[null,null,null,2429,93.600000000000009,227354.40000000002]
[null,null,null,2430,93.600000000000009,227448.00000000003]
[null,null,null,2431,93.600000000000009,227541.60000000003]
[null,null,null,2432,93.600000000000009,227635.20000000001]
[null,null,null,2433,93.600000000000009,227728.80000000002]
[null,null,null,2434,93.600000000000009,227822.40000000002]
[null,null,null,2435,93.600000000000009,227916.00000000003]
[null,null,null,2436,93.600000000000009,228009.60000000003]
[null,null,null,2437,93.600000000000009,228103.2]
[null,null,null,2438,93.600000000000009,228196.80000000002]
[null,null,null,2439,93.600000000000009,228290.40000000002]
[null,null,null,2440,93.600000000000009,228384.00000000003]
[null,null,null,2441,93.600000000000009,228477.60000000003]
[null,null,null,2442,93.600000000000009,228571.2]
[null,null,null,2443,93.600000000000009,228664.80000000002]
[null,null,null,2444,93.600000000000009,228758.40000000002]
[null,null,null,2445,93.600000000000009,228852.00000000003]
[null,null,null,2446,93.600000000000009,228945.60000000003]
[null,null,null,2447,93.600000000000009,229039.2]
[null,null,null,2448,93.600000000000009,229132.80000000002]
[null,null,null,2449,93.600000000000009,229226.40000000002]
[null,null,null,2450,{"$f":"$E$13","v":93.600000000000009},229320.00000000003]
[null,null,null,2451,93.600000000000009,229413.60000000003]
[null,null,null,2452,93.600000000000009,229507.20000000001]
[null,null,null,2453,93.600000000000009,229600.80000000002]
[null,null,null,2454,93.600000000000009,229694.40000000002]
[null,null,null,2455,93.600000000000009,229788.00000000003]
[null,null,null,2456,93.600000000000009,229881.60000000003]
[null,null,null,2457,93.600000000000009,229975.2]
[null,null,null,2458,93.600000000000009,230068.80000000002]
[null,null,null,2459,93.600000000000009,230162.40000000002]
[null,null,null,2460,93.600000000000009,230256.00000000003]
[null,null,null,2461,93.600000000000009,230349.60000000003]
[null,null,null,2462,93.600000000000009,230443.2]
[null,null,null,2463,93.600000000000009,230536.80000000002]
[null,null,null,2464,93.600000000000009,230630.40000000002]
[null,null,null,2465,93.600000000000009,230724.00000000003]
[null,null,null,2466,93.600000000000009,230817.60000000003]
[null,null,null,2467,93.600000000000009,230911.2]
[null,null,null,2468,93.600000000000009,231004.80000000002]
[null,null,null,2469,93.600000000000009,{"$f":"E2486*D2486","v":231098.40000000002}]
[null,null,null,2470,93.600000000000009,231192.00000000003]
[null,null,null,2471,93.600000000000009,231285.60000000003]
[null,null,null,2472,93.600000000000009,231379.20000000001]
[null,null,null,2473,93.600000000000009,231472.80000000002]
[null,null,null,2474,93.600000000000009,231566.40000000002]
[null,null,null,2475,93.600000000000009,231660.00000000003]
[null,null,null,2476,93.600000000000009,231753.60000000003]
[null,null,null,2477,93.600000000000009,231847.2]
[null,null,null,2478,93.600000000000009,231940.80000000002]
[null,null,null,2479,93.600000000000009,232034.40000000002]
[null,null,null,2480,93.600000000000009,232128.00000000003]
[null,null,null,2481,93.600000000000009,232221.60000000003]
[null,null,null,2482,93.600000000000009,232315.2]
[null,null,null,2483,93.600000000000009,232408.80000000002]
[null,null,null,2484,93.600000000000009,232502.40000000002]
[null,null,null,2485,93.600000000000009,232596.00000000003]
[null,null,null,2486,93.600000000000009,232689.60000000003]
[null,null,null,2487,93.600000000000009,232783.2]
[null,null,null,2488,93.600000000000009,232876.80000000002]
[null,null,null,2489,93.600000000000009,232970.40000000002]
[null,null,null,2490,93.600000000000009,233064.00000000003]
[null,null,null,2491,93.600000000000009,233157.60000000003]
[null,null,null,2492,93.600000000000009,233251.20000000001]
[null,null,null,2493,93.600000000000009,233344.80000000002]
[null,null,null,2494,93.600000000000009,233438.40000000002]
[null,null,null,2495,93.600000000000009,233532.00000000003]
[null,null,null,2496,93.600000000000009,233625.60000000003]
[null,null,null,2497,93.600000000000009,233719.2]
[null,null,null,2498,93.600000000000009,233812.80000000002]
[null,null,null,2499,93.600000000000009,233906.40000000002]
[null,null,null,2500,93.600000000000009,234000.00000000003]
[null,null,null,2501,93.600000000000009,234093.60000000003]
[null,null,null,2502,93.600000000000009,234187.2]
[null,null,null,2503,93.600000000000009,234280.80000000002]
[null,null,null,2504,93.600000000000009,234374.40000000002]
[null,null,null,2505,93.600000000000009,234468.00000000003]
[null,null,null,2506,93.600000000000009,234561.60000000003]
[null,null,null,2507,93.600000000000009,234655.2]
[null,null,null,2508,93.600000000000009,234748.80000000002]
[null,null,null,2509,93.600000000000009,234842.40000000002]
[null,null,null,2510,93.600000000000009,234936.00000000003]
[null,null,null,2511,93.600000000000009,235029.60000000003]
[null,null,null,2512,93.600000000000009,235123.20000000001]
[null,null,null,2513,93.600000000000009,235216.80000000002]
[null,null,null,2514,{"$f":"$E$13","v":93.600000000000009},235310.40000000002]
[null,null,null,2515,93.600000000000009,235404.00000000003]
[null,null,null,2516,93.600000000000009,235497.60000000003]
[null,null,null,2517,93.600000000000009,235591.2]
[null,null,null,2518,93.600000000000009,235684.80000000002]
[null,null,null,2519,93.600000000000009,235778.40000000002]
[null,null,null,2520,93.600000000000009,235872.00000000003]
[null,null,null,2521,93.600000000000009,235965.60000000003]
[null,null,null,2522,93.600000000000009,236059.2]
[null,null,null,2523,93.600000000000009,236152.80000000002]
[null,null,null,2524,93.600000000000009,236246.40000000002]
[null,null,null,2525,93.600000000000009,236340.00000000003]
[null,null,null,2526,93.600000000000009,236433.60000000003]
[null,null,null,2527,93.600000000000009,236527.2]
[null,null,null,2528,93.600000000000009,236620.80000000002]
[null,null,null,2529,93.600000000000009,236714.40000000002]
[null,null,null,2530,93.600000000000009,236808.00000000003]
[null,null,null,2531,93.600000000000009,236901.60000000003]
[null,null,null,2532,93.600000000000009,236995.20000000001]
[null,null,null,2533,93.600000000000009,{"$f":"E2550*D2550","v":237088.80000000002}]
[null,null,null,2534,93.600000000000009,237182.40000000002]
[null,null,null,2535,93.600000000000009,237276.00000000003]
[null,null,null,2536,93.600000000000009,237369.60000000003]
[null,null,null,2537,93.600000000000009,237463.2]
[null,null,null,2538,93.600000000000009,237556.80000000002]
[null,null,null,2539,93.600000000000009,237650.40000000002]
[null,null,null,2540,93.600000000000009,237744.00000000003]
[null,null,null,2541,93.600000000000009,237837.60000000003]
[null,null,null,2542,93.600000000000009,237931.2]
[null,null,null,2543,93.600000000000009,238024.80000000002]
[null,null,null,2544,93.600000000000009,238118.40000000002]
[null,null,null,2545,93.600000000000009,238212.00000000003]
[null,null,null,2546,93.600000000000009,238305.60000000003]
[null,null,null,2547,93.600000000000009,238399.2]
[null,null,null,2548,93.600000000000009,238492.80000000002]
[null,null,null,2549,93.600000000000009,238586.40000000002]
[null,null,null,2550,93.600000000000009,238680.00000000003]
[null,null,null,2551,93.600000000000009,238773.60000000003]
[null,null,null,2552,93.600000000000009,238867.20000000001]
[null,null,null,2553,93.600000000000009,238960.80000000002]
[null,null,null,2554,93.600000000000009,239054.40000000002]
[null,null,null,2555,93.600000000000009,239148.00000000003]
[null,null,null,2556,93.600000000000009,239241.60000000003]
[null,null,null,2557,93.600000000000009,239335.2]
[null,null,null,2558,93.600000000000009,239428.80000000002]
[null,null,null,2559,93.600000000000009,239522.40000000002]
[null,null,null,2560,93.600000000000009,239616.00000000003]
[null,null,null,2561,93.600000000000009,239709.60000000003]
[null,null,null,2562,93.600000000000009,239803.2]
[null,null,null,2563,93.600000000000009,239896.80000000002]
[null,null,null,2564,93.600000000000009,239990.40000000002]
[null,null,null,2565,93.600000000000009,240084.00000000003]
[null,null,null,2566,93.600000000000009,240177.60000000003]
[null,null,null,2567,93.600000000000009,240271.2]
[null,null,null,2568,93.600000000000009,240364.80000000002]
[null,null,null,2569,93.600000000000009,240458.40000000002]
[null,null,null,2570,93.600000000000009,240552.00000000003]
[null,null,null,2571,93.600000000000009,240645.60000000003]
[null,null,null,2572,93.600000000000009,240739.20000000001]
[null,null,null,2573,93.600000000000009,240832.80000000002]
[null,null,null,2574,93.600000000000009,240926.40000000002]
[null,null,null,2575,93.600000000000009,241020.00000000003]
[null,null,null,2576,93.600000000000009,241113.60000000003]
[null,null,null,2577,93.600000000000009,241207.2]
[null,null,null,2578,{"$f":"$E$13","v":93.600000000000009},241300.80000000002]
[null,null,null,2579,93.600000000000009,241394.40000000002]
[null,null,null,2580,93.600000000000009,241488.00000000003]
[null,null,null,2581,93.600000000000009,241581.60000000003]
[null,null,null,2582,93.600000000000009,241675.2]
[null,null,null,2583,93.600000000000009,241768.80000000002]
[null,null,null,2584,93.600000000000009,241862.40000000002]
[null,null,null,2585,93.600000000000009,241956.00000000003]
[null,null,null,2586,93.600000000000009,242049.60000000003]
[null,null,null,2587,93.600000000000009,242143.2]
[null,null,null,2588,93.600000000000009,242236.80000000002]
[null,null,null,2589,93.600000000000009,242330.40000000002]
[null,null,null,2590,93.600000000000009,242424.00000000003]
[null,null,null,2591,93.600000000000009,242517.60000000003]
[null,null,null,2592,93.600000000000009,242611.20000000001]
[null,null,null,2593,93.600000000000009,242704.80000000002]
[null,null,null,2594,93.600000000000009,242798.40000000002]
[null,null,null,2595,93.600000000000009,242892.00000000003]
[null,null,null,2596,93.600000000000009,242985.60000000003]
[null,null,null,2597,93.600000000000009,{"$f":"E2614*D2614","v":243079.2}]
[null,null,null,2598,93.600000000000009,243172.80000000002]
[null,null,null,2599,93.600000000000009,243266.40000000002]
[null,null,null,2600,93.600000000000009,243360.00000000003]
[null,null,null,2601,93.600000000000009,243453.60000000003]
[null,null,null,2602,93.600000000000009,243547.2]
[null,null,null,2603,93.600000000000009,243640.80000000002]
[null,null,null,2604,93.600000000000009,243734.40000000002]
[null,null,null,2605,93.600000000000009,243828.00000000003]
[null,null,null,2606,93.600000000000009,243921.60000000003]
[null,null,null,2607,93.600000000000009,244015.2]
[null,null,null,2608,93.600000000000009,244108.80000000002]
[null,null,null,2609,93.600000000000009,244202.40000000002]
[null,null,null,2610,93.600000000000009,244296.00000000003]
[null,null,null,2611,93.600000000000009,244389.60000000003]
[null,null,null,2612,93.600000000000009,244483.20000000001]
[null,null,null,2613,93.600000000000009,244576.80000000002]
[null,null,null,2614,93.600000000000009,244670.40000000002]
[null,null,null,2615,93.600000000000009,244764.00000000003]
[null,null,null,2616,93.600000000000009,244857.60000000003]
[null,null,null,2617,93.600000000000009,244951.2]
[null,null,null,2618,93.600000000000009,245044.80000000002]
[null,null,null,2619,93.600000000000009,245138.40000000002]
[null,null,null,2620,93.600000000000009,245232.00000000003]
[null,null,null,2621,93.600000000000009,245325.60000000003]
[null,null,null,2622,93.600000000000009,245419.2]
[null,null,null,2623,93.600000000000009,245512.80000000002]
[null,null,null,2624,93.600000000000009,245606.40000000002]
[null,null,null,2625,93.600000000000009,245700.00000000003]
[null,null,null,2626,93.600000000000009,245793.60000000003]
[null,null,null,2627,93.600000000000009,245887.2]
[null,null,null,2628,93.600000000000009,245980.80000000002]
[null,null,null,2629,93.600000000000009,246074.40000000002]
[null,null,null,2630,93.600000000000009,246168.00000000003]
[null,null,null,2631,93.600000000000009,246261.60000000003]
[null,null,null,2632,93.600000000000009,246355.20000000001]
[null,null,null,2633,93.600000000000009,246448.80000000002]
[null,null,null,2634,93.600000000000009,246542.40000000002]
[null,null,null,2635,93.600000000000009,246636.00000000003]
[null,null,null,2636,93.600000000000009,246729.60000000003]
[null,null,null,2637,93.600000000000009,246823.2]
[null,null,null,2638,93.600000000000009,246916.80000000002]
[null,null,null,2639,93.600000000000009,247010.40000000002]
[null,null,null,2640,93.600000000000009,247104.00000000003]
[null,null,null,2641,93.600000000000009,247197.60000000003]
[null,null,null,2642,{"$f":"$E$13","v":93.600000000000009},247291.2]
[null,null,null,2643,93.600000000000009,247384.80000000002]
[null,null,null,2644,93.600000000000009,247478.40000000002]
[null,null,null,2645,93.600000000000009,247572.00000000003]
[null,null,null,2646,93.600000000000009,247665.60000000003]
[null,null,null,2647,93.600000000000009,247759.2]
[null,null,null,2648,93.600000000000009,247852.80000000002]
[null,null,null,2649,93.600000000000009,247946.40000000002]
[null,null,null,2650,93.600000000000009,248040.00000000003]
[null,null,null,2651,93.600000000000009,248133.60000000003]
[null,null,null,2652,93.600000000000009,248227.20000000001]
[null,null,null,2653,93.600000000000009,248320.80000000002]
[null,null,null,2654,93.600000000000009,248414.40000000002]
[null,null,null,2655,93.600000000000009,248508.00000000003]
[null,null,null,2656,93.600000000000009,248601.60000000003]
[null,null,null,2657,93.600000000000009,248695.2]
[null,null,null,2658,93.600000000000009,248788.80000000002]
[null,null,null,2659,93.600000000000009,248882.40000000002]
[null,null,null,2660,93.600000000000009,248976.00000000003]
[null,null,null,2661,93.600000000000009,{"$f":"E2678*D2678","v":249069.60000000003}]
[null,null,null,2662,93.600000000000009,249163.2]
[null,null,null,2663,93.600000000000009,249256.80000000002]
[null,null,null,2664,93.600000000000009,249350.40000000002]
[null,null,null,2665,93.600000000000009,249444.00000000003]
[null,null,null,2666,93.600000000000009,249537.60000000003]
[null,null,null,2667,93.600000000000009,249631.2]
[null,null,null,2668,93.600000000000009,249724.80000000002]
[null,null,null,2669,93.600000000000009,249818.40000000002]
[null,null,null,2670,93.600000000000009,249912.00000000003]
[null,null,null,2671,93.600000000000009,250005.60000000003]
[null,null,null,2672,93.600000000000009,250099.20000000001]
[null,null,null,2673,93.600000000000009,250192.80000000002]
[null,null,null,2674,93.600000000000009,250286.40000000002]
[null,null,null,2675,93.600000000000009,250380.00000000003]
[null,null,null,2676,93.600000000000009,250473.60000000003]
[null,null,null,2677,93.600000000000009,250567.2]
[null,null,null,2678,93.600000000000009,250660.80000000002]
[null,null,null,2679,93.600000000000009,250754.40000000002]
[null,null,null,2680,93.600000000000009,250848.00000000003]
[null,null,null,2681,93.600000000000009,250941.60000000003]
[null,null,null,2682,93.600000000000009,251035.2]
[null,null,null,2683,93.600000000000009,251128.80000000002]
[null,null,null,2684,93.600000000000009,251222.40000000002]
[null,null,null,2685,93.600000000000009,251316.00000000003]
[null,null,null,2686,93.600000000000009,251409.60000000003]
[null,null,null,2687,93.600000000000009,251503.2]
[null,null,null,2688,93.600000000000009,251596.80000000002]
[null,null,null,2689,93.600000000000009,251690.40000000002]
[null,null,null,2690,93.600000000000009,251784.00000000003]
[null,null,null,2691,93.600000000000009,251877.60000000003]
[null,null,null,2692,93.600000000000009,251971.20000000001]
[null,null,null,2693,93.600000000000009,252064.80000000002]
[null,null,null,2694,93.600000000000009,252158.40000000002]
[null,null,null,2695,93.600000000000009,252252.00000000003]
[null,null,null,2696,93.600000000000009,252345.60000000003]
[null,null,null,2697,93.600000000000009,252439.2]
[null,null,null,2698,93.600000000000009,252532.80000000002]
[null,null,null,2699,93.600000000000009,252626.40000000002]
[null,null,null,2700,93.600000000000009,252720.00000000003]
[null,null,null,2701,93.600000000000009,252813.60000000003]
[null,null,null,2702,93.600000000000009,252907.2]
[null,null,null,2703,93.600000000000009,253000.80000000002]
[null,null,null,2704,93.600000000000009,253094.40000000002]
[null,null,null,2705,93.600000000000009,253188.00000000003]
[null,null,null,2706,{"$f":"$E$13","v":93.600000000000009},253281.60000000003]
[null,null,null,2707,93.600000000000009,253375.2]
[null,null,null,2708,93.600000000000009,253468.80000000002]
[null,null,null,2709,93.600000000000009,253562.40000000002]
[null,null,null,2710,93.600000000000009,253656.00000000003]
[null,null,null,2711,93.600000000000009,253749.60000000003]
[null,null,null,2712,93.600000000000009,253843.20000000001]
[null,null,null,2713,93.600000000000009,253936.80000000002]
[null,null,null,2714,93.600000000000009,254030.40000000002]
[null,null,null,2715,93.600000000000009,254124.00000000003]
[null,null,null,2716,93.600000000000009,254217.60000000003]
[null,null,null,2717,93.600000000000009,254311.2]
[null,null,null,2718,93.600000000000009,254404.80000000002]
[null,null,null,2719,93.600000000000009,254498.40000000002]
[null,null,null,2720,93.600000000000009,254592.00000000003]
[null,null,null,2721,93.600000000000009,254685.60000000003]
[null,null,null,2722,93.600000000000009,254779.2]
[null,null,null,2723,93.600000000000009,254872.80000000002]
[null,null,null,2724,93.600000000000009,254966.40000000002]
[null,null,null,2725,93.600000000000009,{"$f":"E2742*D2742","v":255060.00000000003}]
[null,null,null,2726,93.600000000000009,255153.60000000003]
[null,null,null,2727,93.600000000000009,255247.2]
[null,null,null,2728,93.600000000000009,255340.80000000002]
[null,null,null,2729,93.600000000000009,255434.40000000002]
[null,null,null,2730,93.600000000000009,255528.00000000003]
[null,null,null,2731,93.600000000000009,255621.60000000003]
[null,null,null,2732,93.600000000000009,255715.20000000001]
[null,null,null,2733,93.600000000000009,255808.80000000002]
[null,null,null,2734,93.600000000000009,255902.40000000002]
[null,null,null,2735,93.600000000000009,255996.00000000003]
[null,null,null,2736,93.600000000000009,256089.60000000003]
[null,null,null,2737,93.600000000000009,256183.2]
[null,null,null,2738,93.600000000000009,256276.80000000002]
[null,null,null,2739,93.600000000000009,256370.40000000002]
[null,null,null,2740,93.600000000000009,256464.00000000003]
[null,null,null,2741,93.600000000000009,256557.60000000003]
[null,null,null,2742,93.600000000000009,256651.2]
[null,null,null,2743,93.600000000000009,256744.80000000002]
[null,null,null,2744,93.600000000000009,256838.40000000002]
[null,null,null,2745,93.600000000000009,256932.00000000003]
[null,null,null,2746,93.600000000000009,257025.60000000003]
[null,null,null,2747,93.600000000000009,257119.2]
[null,null,null,2748,93.600000000000009,257212.80000000002]
[null,null,null,2749,93.600000000000009,257306.40000000002]
[null,null,null,2750,93.600000000000009,257400.00000000003]
[null,null,null,2751,93.600000000000009,257493.60000000003]
[null,null,null,2752,93.600000000000009,257587.20000000001]
[null,null,null,2753,93.600000000000009,257680.80000000002]
[null,null,null,2754,93.600000000000009,257774.40000000002]
[null,null,null,2755,93.600000000000009,257868.00000000003]
[null,null,null,2756,93.600000000000009,257961.60000000003]
[null,null,null,2757,93.600000000000009,258055.2]
[null,null,null,2758,93.600000000000009,258148.80000000002]
[null,null,null,2759,93.600000000000009,258242.40000000002]
[null,null,null,2760,93.600000000000009,258336.00000000003]
[null,null,null,2761,93.600000000000009,258429.60000000003]
[null,null,null,2762,93.600000000000009,258523.2]
[null,null,null,2763,93.600000000000009,258616.80000000002]
[null,null,null,2764,93.600000000000009,258710.40000000002]
[null,null,null,2765,93.600000000000009,258804.00000000003]
[null,null,null,2766,93.600000000000009,258897.60000000003]
[null,null,null,2767,93.600000000000009,258991.2]
[null,null,null,2768,93.600000000000009,259084.80000000002]
[null,null,null,2769,93.600000000000009,259178.40000000002]
[null,null,null,2770,{"$f":"$E$13","v":93.600000000000009},259272.00000000003]
[null,null,null,2771,93.600000000000009,259365.60000000003]
[null,null,null,2772,93.600000000000009,259459.20000000001]
[null,null,null,2773,93.600000000000009,259552.80000000002]
[null,null,null,2774,93.600000000000009,259646.40000000002]
[null,null,null,2775,93.600000000000009,259740.00000000003]
[null,null,null,2776,93.600000000000009,259833.60000000003]
[null,null,null,2777,93.600000000000009,259927.2]
[null,null,null,2778,93.600000000000009,260020.80000000002]
[null,null,null,2779,93.600000000000009,260114.40000000002]
[null,null,null,2780,93.600000000000009,260208.00000000003]
[null,null,null,2781,93.600000000000009,260301.60000000003]
[null,null,null,2782,93.600000000000009,260395.2]
[null,null,null,2783,93.600000000000009,260488.80000000002]
[null,null,null,2784,93.600000000000009,260582.40000000002]
[null,null,null,2785,93.600000000000009,260676.00000000003]
[null,null,null,2786,93.600000000000009,260769.60000000003]
[null,null,null,2787,93.600000000000009,260863.2]
[null,null,null,2788,93.600000000000009,260956.80000000002]
[null,null,null,2789,93.600000000000009,{"$f":"E2806*D2806","v":261050.40000000002}]
[null,null,null,2790,93.600000000000009,261144.00000000003]
[null,null,null,2791,93.600000000000009,261237.60000000003]
[null,null,null,2792,93.600000000000009,261331.20000000001]
[null,null,null,2793,93.600000000000009,261424.80000000002]
[null,null,null,2794,93.600000000000009,261518.40000000002]
[null,null,null,2795,93.600000000000009,261612.00000000003]
[null,null,null,2796,93.600000000000009,261705.60000000003]
[null,null,null,2797,93.600000000000009,261799.2]
[null,null,null,2798,93.600000000000009,261892.80000000002]
[null,null,null,2799,93.600000000000009,261986.40000000002]
[null,null,null,2800,93.600000000000009,262080.00000000003]
[null,null,null,2801,93.600000000000009,262173.60000000003]
[null,null,null,2802,93.600000000000009,262267.2]
[null,null,null,2803,93.600000000000009,262360.80000000005]
[null,null,null,2804,93.600000000000009,262454.40000000002]
[null,null,null,2805,93.600000000000009,262548]
[null,null,null,2806,93.600000000000009,262641.60000000003]
[null,null,null,2807,93.600000000000009,262735.2]
[null,null,null,2808,93.600000000000009,262828.80000000005]
[null,null,null,2809,93.600000000000009,262922.40000000002]
[null,null,null,2810,93.600000000000009,263016]
[null,null,null,2811,93.600000000000009,263109.60000000003]
[null,null,null,2812,93.600000000000009,263203.20000000001]
[null,null,null,2813,93.600000000000009,263296.80000000005]
[null,null,null,2814,93.600000000000009,263390.40000000002]
[null,null,null,2815,93.600000000000009,263484]
[null,null,null,2816,93.600000000000009,263577.60000000003]
[null,null,null,2817,93.600000000000009,263671.2]
[null,null,null,2818,93.600000000000009,263764.80000000005]
[null,null,null,2819,93.600000000000009,263858.40000000002]
[null,null,null,2820,93.600000000000009,263952]
[null,null,null,2821,93.600000000000009,264045.60000000003]
[null,null,null,2822,93.600000000000009,264139.2]
[null,null,null,2823,93.600000000000009,264232.80000000005]
[null,null,null,2824,93.600000000000009,264326.40000000002]
[null,null,null,2825,93.600000000000009,264420]
[null,null,null,2826,93.600000000000009,264513.60000000003]
[null,null,null,2827,93.600000000000009,264607.2]
[null,null,null,2828,93.600000000000009,264700.80000000005]
[null,null,null,2829,93.600000000000009,264794.40000000002]
[null,null,null,2830,93.600000000000009,264888]
[null,null,null,2831,93.600000000000009,264981.60000000003]
[null,null,null,2832,93.600000000000009,265075.20000000001]
[null,null,null,2833,93.600000000000009,265168.80000000005]
[null,null,null,2834,{"$f":"$E$13","v":93.600000000000009},265262.40000000002]
[null,null,null,2835,93.600000000000009,265356]
[null,null,null,2836,93.600000000000009,265449.60000000003]
[null,null,null,2837,93.600000000000009,265543.2]
[null,null,null,2838,93.600000000000009,265636.80000000005]
[null,null,null,2839,93.600000000000009,265730.40000000002]
[null,null,null,2840,93.600000000000009,265824]
[null,null,null,2841,93.600000000000009,265917.60000000003]
[null,null,null,2842,93.600000000000009,266011.2]
[null,null,null,2843,93.600000000000009,266104.80000000005]
[null,null,null,2844,93.600000000000009,266198.40000000002]
[null,null,null,2845,93.600000000000009,266292]
[null,null,null,2846,93.600000000000009,266385.60000000003]
[null,null,null,2847,93.600000000000009,266479.2]
[null,null,null,2848,93.600000000000009,266572.80000000005]
[null,null,null,2849,93.600000000000009,266666.40000000002]
[null,null,null,2850,93.600000000000009,266760]
[null,null,null,2851,93.600000000000009,266853.60000000003]
[null,null,null,2852,93.600000000000009,266947.20000000001]
[null,null,null,2853,93.600000000000009,{"$f":"E2870*D2870","v":267040.80000000005}]
[null,null,null,2854,93.600000000000009,267134.40000000002]
[null,null,null,2855,93.600000000000009,267228]
[null,null,null,2856,93.600000000000009,267321.60000000003]
[null,null,null,2857,93.600000000000009,267415.2]
[null,null,null,2858,93.600000000000009,267508.80000000005]
[null,null,null,2859,93.600000000000009,267602.40000000002]
[null,null,null,2860,93.600000000000009,267696]
[null,null,null,2861,93.600000000000009,267789.60000000003]
[null,null,null,2862,93.600000000000009,267883.2]
[null,null,null,2863,93.600000000000009,267976.80000000005]
[null,null,null,2864,93.600000000000009,268070.40000000002]
[null,null,null,2865,93.600000000000009,268164]
[null,null,null,2866,93.600000000000009,268257.60000000003]
[null,null,null,2867,93.600000000000009,268351.2]
[null,null,null,2868,93.600000000000009,268444.80000000005]
[null,null,null,2869,93.600000000000009,268538.40000000002]
[null,null,null,2870,93.600000000000009,268632]
[null,null,null,2871,93.600000000000009,268725.60000000003]
[null,null,null,2872,93.600000000000009,268819.20000000001]
[null,null,null,2873,93.600000000000009,268912.80000000005]
[null,null,null,2874,93.600000000000009,269006.40000000002]
[null,null,null,2875,93.600000000000009,269100]
[null,null,null,2876,93.600000000000009,269193.60000000003]
[null,null,null,2877,93.600000000000009,269287.2]
[null,null,null,2878,93.600000000000009,269380.80000000005]
[null,null,null,2879,93.600000000000009,269474.40000000002]
[null,null,null,2880,93.600000000000009,269568]
[null,null,null,2881,93.600000000000009,269661.60000000003]
[null,null,null,2882,93.600000000000009,269755.2]
[null,null,null,2883,93.600000000000009,269848.80000000005]
[null,null,null,2884,93.600000000000009,269942.40000000002]
[null,null,null,2885,93.600000000000009,270036]
[null,null,null,2886,93.600000000000009,270129.60000000003]
[null,null,null,2887,93.600000000000009,270223.2]
[null,null,null,2888,93.600000000000009,270316.80000000005]
[null,null,null,2889,93.600000000000009,270410.40000000002]
[null,null,null,2890,93.600000000000009,270504]
[null,null,null,2891,93.600000000000009,270597.60000000003]
[null,null,null,2892,93.600000000000009,270691.20000000001]
[null,null,null,2893,93.600000000000009,270784.80000000005]
[null,null,null,2894,93.600000000000009,270878.40000000002]
[null,null,null,2895,93.600000000000009,270972]
[null,null,null,2896,93.600000000000009,271065.60000000003]
[null,null,null,2897,93.600000000000009,271159.2]
[null,null,null,2898,{"$f":"$E$13","v":93.600000000000009},271252.80000000005]
[null,null,null,2899,93.600000000000009,271346.40000000002]
[null,null,null,2900,93.600000000000009,271440]
[null,null,null,2901,93.600000000000009,271533.60000000003]
[null,null,null,2902,93.600000000000009,271627.2]
[null,null,null,2903,93.600000000000009,271720.80000000005]
[null,null,null,2904,93.600000000000009,271814.40000000002]
[null,null,null,2905,93.600000000000009,271908]
[null,null,null,2906,93.600000000000009,272001.60000000003]
[null,null,null,2907,93.600000000000009,272095.2]
[null,null,null,2908,93.600000000000009,272188.80000000005]
[null,null,null,2909,93.600000000000009,272282.40000000002]
[null,null,null,2910,93.600000000000009,272376]
[null,null,null,2911,93.600000000000009,272469.60000000003]
[null,null,null,2912,93.600000000000009,272563.20000000001]
[null,null,null,2913,93.600000000000009,272656.80000000005]
[null,null,null,2914,93.600000000000009,272750.40000000002]
[null,null,null,2915,93.600000000000009,272844]
[null,null,null,2916,93.600000000000009,272937.60000000003]
[null,null,null,2917,93.600000000000009,{"$f":"E2934*D2934","v":273031.2}]
[null,null,null,2918,93.600000000000009,273124.80000000005]
[null,null,null,2919,93.600000000000009,273218.40000000002]
[null,null,null,2920,93.600000000000009,273312]
[null,null,null,2921,93.600000000000009,273405.60000000003]
[null,null,null,2922,93.600000000000009,273499.2]
[null,null,null,2923,93.600000000000009,273592.80000000005]
[null,null,null,2924,93.600000000000009,273686.40000000002]
[null,null,null,2925,93.600000000000009,273780]
[null,null,null,2926,93.600000000000009,273873.60000000003]
[null,null,null,2927,93.600000000000009,273967.2]
[null,null,null,2928,93.600000000000009,274060.80000000005]
[null,null,null,2929,93.600000000000009,274154.40000000002]
[null,null,null,2930,93.600000000000009,274248]
[null,null,null,2931,93.600000000000009,274341.60000000003]
[null,null,null,2932,93.600000000000009,274435.20000000001]
[null,null,null,2933,93.600000000000009,274528.80000000005]
[null,null,null,2934,93.600000000000009,274622.40000000002]
[null,null,null,2935,93.600000000000009,274716]
[null,null,null,2936,93.600000000000009,274809.60000000003]
[null,null,null,2937,93.600000000000009,274903.2]
[null,null,null,2938,93.600000000000009,274996.80000000005]
[null,null,null,2939,93.600000000000009,275090.40000000002]
[null,null,null,2940,93.600000000000009,275184]
[null,null,null,2941,93.600000000000009,275277.60000000003]
[null,null,null,2942,93.600000000000009,275371.2]
[null,null,null,2943,93.600000000000009,275464.80000000005]
[null,null,null,2944,93.600000000000009,275558.40000000002]
[null,null,null,2945,93.600000000000009,275652]
[null,null,null,2946,93.600000000000009,275745.60000000003]
[null,null,null,2947,93.600000000000009,275839.2]
[null,null,null,2948,93.600000000000009,275932.80000000005]
[null,null,null,2949,93.600000000000009,276026.40000000002]
[null,null,null,2950,93.600000000000009,276120]
[null,null,null,2951,93.600000000000009,276213.60000000003]
[null,null,null,2952,93.600000000000009,276307.20000000001]
[null,null,null,2953,93.600000000000009,276400.80000000005]
[null,null,null,2954,93.600000000000009,276494.40000000002]
[null,null,null,2955,93.600000000000009,276588]
[null,null,null,2956,93.600000000000009,276681.60000000003]
[null,null,null,2957,93.600000000000009,276775.2]
[null,null,null,2958,93.600000000000009,276868.80000000005]
[null,null,null,2959,93.600000000000009,276962.40000000002]
[null,null,null,2960,93.600000000000009,277056]
[null,null,null,2961,93.600000000000009,277149.60000000003]
[null,null,null,2962,{"$f":"$E$13","v":93.600000000000009},277243.2]
[null,null,null,2963,93.600000000000009,277336.80000000005]
[null,null,null,2964,93.600000000000009,277430.40000000002]
[null,null,null,2965,93.600000000000009,277524]
[null,null,null,2966,93.600000000000009,277617.60000000003]
[null,null,null,2967,93.600000000000009,277711.2]
[null,null,null,2968,93.600000000000009,277804.80000000005]
[null,null,null,2969,93.600000000000009,277898.40000000002]
[null,null,null,2970,93.600000000000009,277992]
[null,null,null,2971,93.600000000000009,278085.60000000003]
[null,null,null,2972,93.600000000000009,278179.20000000001]
[null,null,null,2973,93.600000000000009,278272.80000000005]
[null,null,null,2974,93.600000000000009,278366.40000000002]
[null,null,null,2975,93.600000000000009,278460]
[null,null,null,2976,93.600000000000009,278553.60000000003]
[null,null,null,2977,93.600000000000009,278647.2]
[null,null,null,2978,93.600000000000009,278740.80000000005]
[null,null,null,2979,93.600000000000009,278834.40000000002]
[null,null,null,2980,93.600000000000009,278928]
[null,null,null,2981,93.600000000000009,{"$f":"E2998*D2998","v":279021.60000000003}]
[null,null,null,2982,93.600000000000009,279115.2]
[null,null,null,2983,93.600000000000009,279208.80000000005]
[null,null,null,2984,93.600000000000009,279302.40000000002]
[null,null,null,2985,93.600000000000009,279396]
[null,null,null,2986,93.600000000000009,279489.60000000003]
[null,null,null,2987,93.600000000000009,279583.2]
[null,null,null,2988,93.600000000000009,279676.80000000005]
[null,null,null,2989,93.600000000000009,279770.40000000002]
[null,null,null,2990,93.600000000000009,279864]
[null,null,null,2991,93.600000000000009,279957.60000000003]
[null,null,null,2992,93.600000000000009,280051.20000000001]
[null,null,null,2993,93.600000000000009,280144.80000000005]
[null,null,null,2994,93.600000000000009,280238.40000000002]
[null,null,null,2995,93.600000000000009,280332]
[null,null,null,2996,93.600000000000009,280425.60000000003]
[null,null,null,2997,93.600000000000009,280519.2]
[null,null,null,2998,93.600000000000009,280612.80000000005]
[null,null,null,2999,93.600000000000009,280706.40000000002]
[null,null,null,3000,93.600000000000009,280800]
[null,null,null,3001,93.600000000000009,280893.60000000003]
[null,null,null,3002,93.600000000000009,280987.2]
[null,null,null,3003,93.600000000000009,281080.80000000005]
[null,null,null,3004,93.600000000000009,281174.40000000002]
[null,null,null,3005,93.600000000000009,281268]
[null,null,null,3006,93.600000000000009,281361.60000000003]
[null,null,null,3007,93.600000000000009,281455.2]
[null,null,null,3008,93.600000000000009,281548.80000000005]
[null,null,null,3009,93.600000000000009,281642.40000000002]
[null,null,null,3010,93.600000000000009,281736]
[null,null,null,3011,93.600000000000009,281829.60000000003]
[null,null,null,3012,93.600000000000009,281923.20000000001]
[null,null,null,3013,93.600000000000009,282016.80000000005]
[null,null,null,3014,93.600000000000009,282110.40000000002]
[null,null,null,3015,93.600000000000009,282204]
[null,null,null,3016,93.600000000000009,282297.60000000003]
[null,null,null,3017,93.600000000000009,282391.2]
[null,null,null,3018,93.600000000000009,282484.80000000005]
[null,null,null,3019,93.600000000000009,282578.40000000002]
[null,null,null,3020,93.600000000000009,282672]
[null,null,null,3021,93.600000000000009,282765.60000000003]
[null,null,null,3022,93.600000000000009,282859.2]
[null,null,null,3023,93.600000000000009,282952.80000000005]
[null,null,null,3024,93.600000000000009,283046.40000000002]
[null,null,null,3025,93.600000000000009,283140]
[null,null,null,3026,{"$f":"$E$13","v":93.600000000000009},283233.60000000003]
[null,null,null,3027,93.600000000000009,283327.2]
[null,null,null,3028,93.600000000000009,283420.80000000005]
[null,null,null,3029,93.600000000000009,283514.40000000002]
[null,null,null,3030,93.600000000000009,283608]
[null,null,null,3031,93.600000000000009,283701.60000000003]
[null,null,null,3032,93.600000000000009,283795.20000000001]
[null,null,null,3033,93.600000000000009,283888.80000000005]
[null,null,null,3034,93.600000000000009,283982.40000000002]
[null,null,null,3035,93.600000000000009,284076]
[null,null,null,3036,93.600000000000009,284169.60000000003]
[null,null,null,3037,93.600000000000009,284263.2]
[null,null,null,3038,93.600000000000009,284356.80000000005]
[null,null,null,3039,93.600000000000009,284450.40000000002]
[null,null,null,3040,93.600000000000009,284544]
[null,null,null,3041,93.600000000000009,284637.60000000003]
[null,null,null,3042,93.600000000000009,284731.2]
[null,null,null,3043,93.600000000000009,284824.80000000005]
[null,null,null,3044,93.600000000000009,284918.40000000002]
[null,null,null,3045,93.600000000000009,{"$f":"E3062*D3062","v":285012}]
[null,null,null,3046,93.600000000000009,285105.60000000003]
[null,null,null,3047,93.600000000000009,285199.2]
[null,null,null,3048,93.600000000000009,285292.80000000005]
[null,null,null,3049,93.600000000000009,285386.40000000002]
[null,null,null,3050,93.600000000000009,285480]
[null,null,null,3051,93.600000000000009,285573.60000000003]
[null,null,null,3052,93.600000000000009,285667.20000000001]
[null,null,null,3053,93.600000000000009,285760.80000000005]
[null,null,null,3054,93.600000000000009,285854.40000000002]
[null,null,null,3055,93.600000000000009,285948]
[null,null,null,3056,93.600000000000009,286041.60000000003]
[null,null,null,3057,93.600000000000009,286135.2]
[null,null,null,3058,93.600000000000009,286228.80000000005]
[null,null,null,3059,93.600000000000009,286322.40000000002]
[null,null,null,3060,93.600000000000009,286416]
[null,null,null,3061,93.600000000000009,286509.60000000003]
[null,null,null,3062,93.600000000000009,286603.2]
[null,null,null,3063,93.600000000000009,286696.80000000005]
[null,null,null,3064,93.600000000000009,286790.40000000002]
[null,null,null,3065,93.600000000000009,286884]
[null,null,null,3066,93.600000000000009,286977.60000000003]
[null,null,null,3067,93.600000000000009,287071.2]
[null,null,null,3068,93.600000000000009,287164.80000000005]
[null,null,null,3069,93.600000000000009,287258.40000000002]
[null,null,null,3070,93.600000000000009,287352]
[null,null,null,3071,93.600000000000009,287445.60000000003]
[null,null,null,3072,93.600000000000009,287539.20000000001]
[null,null,null,3073,93.600000000000009,287632.80000000005]
[null,null,null,3074,93.600000000000009,287726.40000000002]
[null,null,null,3075,93.600000000000009,287820]
[null,null,null,3076,93.600000000000009,287913.60000000003]
[null,null,null,3077,93.600000000000009,288007.2]
[null,null,null,3078,93.600000000000009,288100.80000000005]
[null,null,null,3079,93.600000000000009,288194.40000000002]
[null,null,null,3080,93.600000000000009,288288]
[null,null,null,3081,93.600000000000009,288381.60000000003]
[null,null,null,3082,93.600000000000009,288475.2]
[null,null,null,3083,93.600000000000009,288568.80000000005]
[null,null,null,3084,93.600000000000009,288662.40000000002]
[null,null,null,3085,93.600000000000009,288756]
[null,null,null,3086,93.600000000000009,288849.60000000003]
[null,null,null,3087,93.600000000000009,288943.2]
[null,null,null,3088,93.600000000000009,289036.80000000005]
[null,null,null,3089,93.600000000000009,289130.40000000002]
[null,null,null,3090,{"$f":"$E$13","v":93.600000000000009},289224]
[null,null,null,3091,93.600000000000009,289317.60000000003]
[null,null,null,3092,93.600000000000009,289411.20000000001]
[null,null,null,3093,93.600000000000009,289504.80000000005]
[null,null,null,3094,93.600000000000009,289598.40000000002]
[null,null,null,3095,93.600000000000009,289692]
[null,null,null,3096,93.600000000000009,289785.60000000003]
[null,null,null,3097,93.600000000000009,289879.2]
[null,null,null,3098,93.600000000000009,289972.80000000005]
[null,null,null,3099,93.600000000000009,290066.40000000002]
[null,null,null,3100,93.600000000000009,290160]
[null,null,null,3101,93.600000000000009,290253.60000000003]
[null,null,null,3102,93.600000000000009,290347.2]
[null,null,null,3103,93.600000000000009,290440.80000000005]
[null,null,null,3104,93.600000000000009,290534.40000000002]
[null,null,null,3105,93.600000000000009,290628]
[null,null,null,3106,93.600000000000009,290721.60000000003]
[null,null,null,3107,93.600000000000009,290815.2]
[null,null,null,3108,93.600000000000009,290908.80000000005]
[null,null,null,3109,93.600000000000009,{"$f":"E3126*D3126","v":291002.40000000002}]
[null,null,null,3110,93.600000000000009,291096]
[null,null,null,3111,93.600000000000009,291189.60000000003]
[null,null,null,3112,93.600000000000009,291283.20000000001]
[null,null,null,3113,93.600000000000009,291376.80000000005]
[null,null,null,3114,93.600000000000009,291470.40000000002]
[null,null,null,3115,93.600000000000009,291564]
[null,null,null,3116,93.600000000000009,291657.60000000003]
[null,null,null,3117,93.600000000000009,291751.2]
[null,null,null,3118,93.600000000000009,291844.80000000005]
[null,null,null,3119,93.600000000000009,291938.40000000002]
[null,null,null,3120,93.600000000000009,292032]
[null,null,null,3121,93.600000000000009,292125.60000000003]
[null,null,null,3122,93.600000000000009,292219.2]
[null,null,null,3123,93.600000000000009,292312.80000000005]
[null,null,null,3124,93.600000000000009,292406.40000000002]
[null,null,null,3125,93.600000000000009,292500]
[null,null,null,3126,93.600000000000009,292593.60000000003]
[null,null,null,3127,93.600000000000009,292687.2]
[null,null,null,3128,93.600000000000009,292780.80000000005]
[null,null,null,3129,93.600000000000009,292874.40000000002]
[null,null,null,3130,93.600000000000009,292968]
[null,null,null,3131,93.600000000000009,293061.60000000003]
[null,null,null,3132,93.600000000000009,293155.20000000001]
[null,null,null,3133,93.600000000000009,293248.80000000005]
[null,null,null,3134,93.600000000000009,293342.40000000002]
[null,null,null,3135,93.600000000000009,293436]
[null,null,null,3136,93.600000000000009,293529.60000000003]
[null,null,null,3137,93.600000000000009,293623.2]
[null,null,null,3138,93.600000000000009,293716.80000000005]
[null,null,null,3139,93.600000000000009,293810.40000000002]
[null,null,null,3140,93.600000000000009,293904]
[null,null,null,3141,93.600000000000009,293997.60000000003]
[null,null,null,3142,93.600000000000009,294091.2]
[null,null,null,3143,93.600000000000009,294184.80000000005]
[null,null,null,3144,93.600000000000009,294278.40000000002]
[null,null,null,3145,93.600000000000009,294372]
[null,null,null,3146,93.600000000000009,294465.60000000003]
[null,null,null,3147,93.600000000000009,294559.2]
[null,null,null,3148,93.600000000000009,294652.80000000005]
[null,null,null,3149,93.600000000000009,294746.40000000002]
[null,null,null,3150,93.600000000000009,294840]
[null,null,null,3151,93.600000000000009,294933.60000000003]
[null,null,null,3152,93.600000000000009,295027.20000000001]
[null,null,null,3153,93.600000000000009,295120.80000000005]
[null,null,null,3154,{"$f":"$E$13","v":93.600000000000009},295214.40000000002]
[null,null,null,3155,93.600000000000009,295308]
[null,null,null,3156,93.600000000000009,295401.60000000003]
[null,null,null,3157,93.600000000000009,295495.2]
[null,null,null,3158,93.600000000000009,295588.80000000005]
[null,null,null,3159,93.600000000000009,295682.40000000002]
[null,null,null,3160,93.600000000000009,295776]
[null,null,null,3161,93.600000000000009,295869.60000000003]
[null,null,null,3162,93.600000000000009,295963.2]
[null,null,null,3163,93.600000000000009,296056.80000000005]
[null,null,null,3164,93.600000000000009,296150.40000000002]
[null,null,null,3165,93.600000000000009,296244]
[null,null,null,3166,93.600000000000009,296337.60000000003]
[null,null,null,3167,93.600000000000009,296431.2]
[null,null,null,3168,93.600000000000009,296524.80000000005]
[null,null,null,3169,93.600000000000009,296618.40000000002]
[null,null,null,3170,93.600000000000009,296712]
[null,null,null,3171,93.600000000000009,296805.60000000003]
[null,null,null,3172,93.600000000000009,296899.20000000001]
[null,null,null,3173,93.600000000000009,{"$f":"E3190*D3190","v":296992.80000000005}]
[null,null,null,3174,93.600000000000009,297086.40000000002]
[null,null,null,3175,93.600000000000009,297180]
[null,null,null,3176,93.600000000000009,297273.60000000003]
[null,null,null,3177,93.600000000000009,297367.2]
[null,null,null,3178,93.600000000000009,297460.80000000005]
[null,null,null,3179,93.600000000000009,297554.40000000002]
[null,null,null,3180,93.600000000000009,297648]
[null,null,null,3181,93.600000000000009,297741.60000000003]
[null,null,null,3182,93.600000000000009,297835.2]
[null,null,null,3183,93.600000000000009,297928.80000000005]
[null,null,null,3184,93.600000000000009,298022.40000000002]
[null,null,null,3185,93.600000000000009,298116]
[null,null,null,3186,93.600000000000009,298209.60000000003]
[null,null,null,3187,93.600000000000009,298303.2]
[null,null,null,3188,93.600000000000009,298396.80000000005]
[null,null,null,3189,93.600000000000009,298490.40000000002]
[null,null,null,3190,93.600000000000009,298584]
[null,null,null,3191,93.600000000000009,298677.60000000003]
[null,null,null,3192,93.600000000000009,298771.20000000001]
[null,null,null,3193,93.600000000000009,298864.80000000005]
[null,null,null,3194,93.600000000000009,298958.40000000002]
[null,null,null,3195,93.600000000000009,299052]
[null,null,null,3196,93.600000000000009,299145.60000000003]
[null,null,null,3197,93.600000000000009,299239.2]
[null,null,null,3198,93.600000000000009,299332.80000000005]
[null,null,null,3199,93.600000000000009,299426.40000000002]
[null,null,null,3200,93.600000000000009,299520]
[null,null,null,3201,93.600000000000009,299613.60000000003]
[null,null,null,3202,93.600000000000009,299707.2]
[null,null,null,3203,93.600000000000009,299800.80000000005]
[null,null,null,3204,93.600000000000009,299894.40000000002]
[null,null,null,3205,93.600000000000009,299988]
[null,null,null,3206,93.600000000000009,300081.60000000003]
[null,null,null,3207,93.600000000000009,300175.2]
[null,null,null,3208,93.600000000000009,300268.80000000005]
[null,null,null,3209,93.600000000000009,300362.40000000002]
[null,null,null,3210,93.600000000000009,300456]
[null,null,null,3211,93.600000000000009,300549.60000000003]
[null,null,null,3212,93.600000000000009,300643.20000000001]
[null,null,null,3213,93.600000000000009,300736.80000000005]
[null,null,null,3214,93.600000000000009,300830.40000000002]
[null,null,null,3215,93.600000000000009,300924]
[null,null,null,3216,93.600000000000009,301017.60000000003]
[null,null,null,3217,93.600000000000009,301111.2]
[null,null,null,3218,{"$f":"$E$13","v":93.600000000000009},301204.80000000005]
[null,null,null,3219,93.600000000000009,301298.40000000002]
[null,null,null,3220,93.600000000000009,301392]
[null,null,null,3221,93.600000000000009,301485.60000000003]
[null,null,null,3222,93.600000000000009,301579.2]
[null,null,null,3223,93.600000000000009,301672.80000000005]
[null,null,null,3224,93.600000000000009,301766.40000000002]
[null,null,null,3225,93.600000000000009,301860]
[null,null,null,3226,93.600000000000009,301953.60000000003]
[null,null,null,3227,93.600000000000009,302047.2]
[null,null,null,3228,93.600000000000009,302140.80000000005]
[null,null,null,3229,93.600000000000009,302234.40000000002]
[null,null,null,3230,93.600000000000009,302328]
[null,null,null,3231,93.600000000000009,302421.60000000003]
[null,null,null,3232,93.600000000000009,302515.20000000001]
[null,null,null,3233,93.600000000000009,302608.80000000005]
[null,null,null,3234,93.600000000000009,302702.40000000002]
[null,null,null,3235,93.600000000000009,302796]
[null,null,null,3236,93.600000000000009,302889.60000000003]
[null,null,null,3237,93.600000000000009,{"$f":"E3254*D3254","v":302983.2}]
[null,null,null,3238,93.600000000000009,303076.80000000005]
[null,null,null,3239,93.600000000000009,303170.40000000002]
[null,null,null,3240,93.600000000000009,303264]
[null,null,null,3241,93.600000000000009,303357.60000000003]
[null,null,null,3242,93.600000000000009,303451.2]
[null,null,null,3243,93.600000000000009,303544.80000000005]
[null,null,null,3244,93.600000000000009,303638.40000000002]
[null,null,null,3245,93.600000000000009,303732]
[null,null,null,3246,93.600000000000009,303825.60000000003]
[null,null,null,3247,93.600000000000009,303919.2]
[null,null,null,3248,93.600000000000009,304012.80000000005]
[null,null,null,3249,93.600000000000009,304106.40000000002]
[null,null,null,3250,93.600000000000009,304200]
[null,null,null,3251,93.600000000000009,304293.60000000003]
[null,null,null,3252,93.600000000000009,304387.20000000001]
[null,null,null,3253,93.600000000000009,304480.80000000005]
[null,null,null,3254,93.600000000000009,304574.40000000002]
[null,null,null,3255,93.600000000000009,304668]
[null,null,null,3256,93.600000000000009,304761.60000000003]
[null,null,null,3257,93.600000000000009,304855.2]
[null,null,null,3258,93.600000000000009,304948.80000000005]
[null,null,null,3259,93.600000000000009,305042.40000000002]
[null,null,null,3260,93.600000000000009,305136]
[null,null,null,3261,93.600000000000009,305229.60000000003]
[null,null,null,3262,93.600000000000009,305323.2]
[null,null,null,3263,93.600000000000009,305416.80000000005]
[null,null,null,3264,93.600000000000009,305510.40000000002]
[null,null,null,3265,93.600000000000009,305604]
[null,null,null,3266,93.600000000000009,305697.60000000003]
[null,null,null,3267,93.600000000000009,305791.2]
[null,null,null,3268,93.600000000000009,305884.80000000005]
[null,null,null,3269,93.600000000000009,305978.40000000002]
[null,null,null,3270,93.600000000000009,306072]
[null,null,null,3271,93.600000000000009,306165.60000000003]
[null,null,null,3272,93.600000000000009,306259.20000000001]
[null,null,null,3273,93.600000000000009,306352.80000000005]
[null,null,null,3274,93.600000000000009,306446.40000000002]
[null,null,null,3275,93.600000000000009,306540]
[null,null,null,3276,93.600000000000009,306633.60000000003]
[null,null,null,3277,93.600000000000009,306727.2]
[null,null,null,3278,93.600000000000009,306820.80000000005]
[null,null,null,3279,93.600000000000009,306914.40000000002]
[null,null,null,3280,93.600000000000009,307008]
[null,null,null,3281,93.600000000000009,307101.60000000003]
[null,null,null,3282,{"$f":"$E$13","v":93.600000000000009},307195.2]
[null,null,null,3283,93.600000000000009,307288.80000000005]
[null,null,null,3284,93.600000000000009,307382.40000000002]
[null,null,null,3285,93.600000000000009,307476]
[null,null,null,3286,93.600000000000009,307569.60000000003]
[null,null,null,3287,93.600000000000009,307663.2]
[null,null,null,3288,93.600000000000009,307756.80000000005]
[null,null,null,3289,93.600000000000009,307850.40000000002]
[null,null,null,3290,93.600000000000009,307944]
[null,null,null,3291,93.600000000000009,308037.60000000003]
[null,null,null,3292,93.600000000000009,308131.20000000001]
[null,null,null,3293,93.600000000000009,308224.80000000005]
[null,null,null,3294,93.600000000000009,308318.40000000002]
[null,null,null,3295,93.600000000000009,308412]
[null,null,null,3296,93.600000000000009,308505.60000000003]
[null,null,null,3297,93.600000000000009,308599.2]
[null,null,null,3298,93.600000000000009,308692.80000000005]
[null,null,null,3299,93.600000000000009,308786.40000000002]
[null,null,null,3300,93.600000000000009,308880]
[null,null,null,3301,93.600000000000009,{"$f":"E3318*D3318","v":308973.60000000003}]
[null,null,null,3302,93.600000000000009,309067.2]
[null,null,null,3303,93.600000000000009,309160.80000000005]
[null,null,null,3304,93.600000000000009,309254.40000000002]
[null,null,null,3305,93.600000000000009,309348]
[null,null,null,3306,93.600000000000009,309441.60000000003]
[null,null,null,3307,93.600000000000009,309535.2]
[null,null,null,3308,93.600000000000009,309628.80000000005]
[null,null,null,3309,93.600000000000009,309722.40000000002]
[null,null,null,3310,93.600000000000009,309816]
[null,null,null,3311,93.600000000000009,309909.60000000003]
[null,null,null,3312,93.600000000000009,310003.20000000001]
[null,null,null,3313,93.600000000000009,310096.80000000005]
[null,null,null,3314,93.600000000000009,310190.40000000002]
[null,null,null,3315,93.600000000000009,310284]
[null,null,null,3316,93.600000000000009,310377.60000000003]
[null,null,null,3317,93.600000000000009,310471.2]
[null,null,null,3318,93.600000000000009,310564.80000000005]
[null,null,null,3319,93.600000000000009,310658.40000000002]
[null,null,null,3320,93.600000000000009,310752]
[null,null,null,3321,93.600000000000009,310845.60000000003]
[null,null,null,3322,93.600000000000009,310939.2]
[null,null,null,3323,93.600000000000009,311032.80000000005]
[null,null,null,3324,93.600000000000009,311126.40000000002]
[null,null,null,3325,93.600000000000009,311220]
[null,null,null,3326,93.600000000000009,311313.60000000003]
[null,null,null,3327,93.600000000000009,311407.2]
[null,null,null,3328,93.600000000000009,311500.80000000005]
[null,null,null,3329,93.600000000000009,311594.40000000002]
[null,null,null,3330,93.600000000000009,311688]
[null,null,null,3331,93.600000000000009,311781.60000000003]
[null,null,null,3332,93.600000000000009,311875.20000000001]
[null,null,null,3333,93.600000000000009,311968.80000000005]
[null,null,null,3334,93.600000000000009,312062.40000000002]
[null,null,null,3335,93.600000000000009,312156]
[null,null,null,3336,93.600000000000009,312249.60000000003]
[null,null,null,3337,93.600000000000009,312343.2]
[null,null,null,3338,93.600000000000009,312436.80000000005]
[null,null,null,3339,93.600000000000009,312530.40000000002]
[null,null,null,3340,93.600000000000009,312624]
[null,null,null,3341,93.600000000000009,312717.60000000003]
[null,null,null,3342,93.600000000000009,312811.2]
[null,null,null,3343,93.600000000000009,312904.80000000005]
[null,null,null,3344,93.600000000000009,312998.40000000002]
[null,null,null,3345,93.600000000000009,313092]
[null,null,null,3346,{"$f":"$E$13","v":93.600000000000009},313185.60000000003]
[null,null,null,3347,93.600000000000009,313279.2]
[null,null,null,3348,93.600000000000009,313372.80000000005]
[null,null,null,3349,93.600000000000009,313466.40000000002]
[null,null,null,3350,93.600000000000009,313560]
[null,null,null,3351,93.600000000000009,313653.60000000003]
[null,null,null,3352,93.600000000000009,313747.20000000001]
[null,null,null,3353,93.600000000000009,313840.80000000005]
[null,null,null,3354,93.600000000000009,313934.40000000002]
[null,null,null,3355,93.600000000000009,314028]
[null,null,null,3356,93.600000000000009,314121.60000000003]
[null,null,null,3357,93.600000000000009,314215.2]
[null,null,null,3358,93.600000000000009,314308.80000000005]
[null,null,null,3359,93.600000000000009,314402.40000000002]
[null,null,null,3360,93.600000000000009,314496]
[null,null,null,3361,93.600000000000009,314589.60000000003]
[null,null,null,3362,93.600000000000009,314683.2]
[null,null,null,3363,93.600000000000009,314776.80000000005]
[null,null,null,3364,93.600000000000009,314870.40000000002]
[null,null,null,3365,93.600000000000009,{"$f":"E3382*D3382","v":314964}]
[null,null,null,3366,93.600000000000009,315057.60000000003]
[null,null,null,3367,93.600000000000009,315151.2]
[null,null,null,3368,93.600000000000009,315244.80000000005]
[null,null,null,3369,93.600000000000009,315338.40000000002]
[null,null,null,3370,93.600000000000009,315432]
[null,null,null,3371,93.600000000000009,315525.60000000003]
[null,null,null,3372,93.600000000000009,315619.20000000001]
[null,null,null,3373,93.600000000000009,315712.80000000005]
[null,null,null,3374,93.600000000000009,315806.40000000002]
[null,null,null,3375,93.600000000000009,315900]
[null,null,null,3376,93.600000000000009,315993.60000000003]
[null,null,null,3377,93.600000000000009,316087.2]
[null,null,null,3378,93.600000000000009,316180.80000000005]
[null,null,null,3379,93.600000000000009,316274.40000000002]
[null,null,null,3380,93.600000000000009,316368]
[null,null,null,3381,93.600000000000009,316461.60000000003]
[null,null,null,3382,93.600000000000009,316555.2]
[null,null,null,3383,93.600000000000009,316648.80000000005]
[null,null,null,3384,93.600000000000009,316742.40000000002]
[null,null,null,3385,93.600000000000009,316836]
[null,null,null,3386,93.600000000000009,316929.60000000003]
[null,null,null,3387,93.600000000000009,317023.2]
[null,null,null,3388,93.600000000000009,317116.80000000005]
[null,null,null,3389,93.600000000000009,317210.40000000002]
[null,null,null,3390,93.600000000000009,317304]
[null,null,null,3391,93.600000000000009,317397.60000000003]
[null,null,null,3392,93.600000000000009,317491.20000000001]
[null,null,null,3393,93.600000000000009,317584.80000000005]
[null,null,null,3394,93.600000000000009,317678.40000000002]
[null,null,null,3395,93.600000000000009,317772]
[null,null,null,3396,93.600000000000009,317865.60000000003]
[null,null,null,3397,93.600000000000009,317959.2]
[null,null,null,3398,93.600000000000009,318052.80000000005]
[null,null,null,3399,93.600000000000009,318146.40000000002]
[null,null,null,3400,93.600000000000009,318240]
[null,null,null,3401,93.600000000000009,318333.60000000003]
[null,null,null,3402,93.600000000000009,318427.2]
[null,null,null,3403,93.600000000000009,318520.80000000005]
[null,null,null,3404,93.600000000000009,318614.40000000002]
[null,null,null,3405,93.600000000000009,318708]
[null,null,null,3406,93.600000000000009,318801.60000000003]
[null,null,null,3407,93.600000000000009,318895.2]
[null,null,null,3408,93.600000000000009,318988.80000000005]
[null,null,null,3409,93.600000000000009,319082.40000000002]
[null,null,null,3410,{"$f":"$E$13","v":93.600000000000009},319176]
[null,null,null,3411,93.600000000000009,319269.60000000003]
[null,null,null,3412,93.600000000000009,319363.20000000001]
[null,null,null,3413,93.600000000000009,319456.80000000005]
[null,null,null,3414,93.600000000000009,319550.40000000002]
[null,null,null,3415,93.600000000000009,319644]
[null,null,null,3416,93.600000000000009,319737.60000000003]
[null,null,null,3417,93.600000000000009,319831.2]
[null,null,null,3418,93.600000000000009,319924.80000000005]
[null,null,null,3419,93.600000000000009,320018.40000000002]
[null,null,null,3420,93.600000000000009,320112.00000000006]
[null,null,null,3421,93.600000000000009,320205.60000000003]
[null,null,null,3422,93.600000000000009,320299.2]
[null,null,null,3423,93.600000000000009,320392.80000000005]
[null,null,null,3424,93.600000000000009,320486.40000000002]
[null,null,null,3425,93.600000000000009,320580.00000000006]
[null,null,null,3426,93.600000000000009,320673.60000000003]
[null,null,null,3427,93.600000000000009,320767.2]
[null,null,null,3428,93.600000000000009,320860.80000000005]
[null,null,null,3429,93.600000000000009,{"$f":"E3446*D3446","v":320954.40000000002}]
[null,null,null,3430,93.600000000000009,321048.00000000006]
[null,null,null,3431,93.600000000000009,321141.60000000003]
[null,null,null,3432,93.600000000000009,321235.20000000001]
[null,null,null,3433,93.600000000000009,321328.80000000005]
[null,null,null,3434,93.600000000000009,321422.40000000002]
[null,null,null,3435,93.600000000000009,321516.00000000006]
[null,null,null,3436,93.600000000000009,321609.60000000003]
[null,null,null,3437,93.600000000000009,321703.2]
[null,null,null,3438,93.600000000000009,321796.80000000005]
[null,null,null,3439,93.600000000000009,321890.40000000002]
[null,null,null,3440,93.600000000000009,321984.00000000006]
[null,null,null,3441,93.600000000000009,322077.60000000003]
[null,null,null,3442,93.600000000000009,322171.2]
[null,null,null,3443,93.600000000000009,322264.80000000005]
[null,null,null,3444,93.600000000000009,322358.40000000002]
[null,null,null,3445,93.600000000000009,322452.00000000006]
[null,null,null,3446,93.600000000000009,322545.60000000003]
[null,null,null,3447,93.600000000000009,322639.2]
[null,null,null,3448,93.600000000000009,322732.80000000005]
[null,null,null,3449,93.600000000000009,322826.40000000002]
[null,null,null,3450,93.600000000000009,322920.00000000006]
[null,null,null,3451,93.600000000000009,323013.60000000003]
[null,null,null,3452,93.600000000000009,323107.20000000001]
[null,null,null,3453,93.600000000000009,323200.80000000005]
[null,null,null,3454,93.600000000000009,323294.40000000002]
[null,null,null,3455,93.600000000000009,323388.00000000006]
[null,null,null,3456,93.600000000000009,323481.60000000003]
[null,null,null,3457,93.600000000000009,323575.2]
[null,null,null,3458,93.600000000000009,323668.80000000005]
[null,null,null,3459,93.600000000000009,323762.40000000002]
[null,null,null,3460,93.600000000000009,323856.00000000006]
[null,null,null,3461,93.600000000000009,323949.60000000003]
[null,null,null,3462,93.600000000000009,324043.2]
[null,null,null,3463,93.600000000000009,324136.80000000005]
[null,null,null,3464,93.600000000000009,324230.40000000002]
[null,null,null,3465,93.600000000000009,324324.00000000006]
[null,null,null,3466,93.600000000000009,324417.60000000003]
[null,null,null,3467,93.600000000000009,324511.2]
[null,null,null,3468,93.600000000000009,324604.80000000005]
[null,null,null,3469,93.600000000000009,324698.40000000002]
[null,null,null,3470,93.600000000000009,324792.00000000006]
[null,null,null,3471,93.600000000000009,324885.60000000003]
[null,null,null,3472,93.600000000000009,324979.20000000001]
[null,null,null,3473,93.600000000000009,325072.80000000005]
[null,null,null,3474,{"$f":"$E$13","v":93.600000000000009},325166.40000000002]
[null,null,null,3475,93.600000000000009,325260.00000000006]
[null,null,null,3476,93.600000000000009,325353.60000000003]
[null,null,null,3477,93.600000000000009,325447.2]
[null,null,null,3478,93.600000000000009,325540.80000000005]
[null,null,null,3479,93.600000000000009,325634.40000000002]
[null,null,null,3480,93.600000000000009,325728.00000000006]
[null,null,null,3481,93.600000000000009,325821.60000000003]
[null,null,null,3482,93.600000000000009,325915.2]
[null,null,null,3483,93.600000000000009,326008.80000000005]
[null,null,null,3484,93.600000000000009,326102.40000000002]
[null,null,null,3485,93.600000000000009,326196.00000000006]
[null,null,null,3486,93.600000000000009,326289.60000000003]
[null,null,null,3487,93.600000000000009,326383.2]
[null,null,null,3488,93.600000000000009,326476.80000000005]
[null,null,null,3489,93.600000000000009,326570.40000000002]
[null,null,null,3490,93.600000000000009,326664.00000000006]
[null,null,null,3491,93.600000000000009,326757.60000000003]
[null,null,null,3492,93.600000000000009,326851.20000000001]
[null,null,null,3493,93.600000000000009,{"$f":"E3510*D3510","v":326944.80000000005}]
[null,null,null,3494,93.600000000000009,327038.40000000002]
[null,null,null,3495,93.600000000000009,327132.00000000006]
[null,null,null,3496,93.600000000000009,327225.60000000003]
[null,null,null,3497,93.600000000000009,327319.2]
[null,null,null,3498,93.600000000000009,327412.80000000005]
[null,null,null,3499,93.600000000000009,327506.40000000002]
[null,null,null,3500,93.600000000000009,327600.00000000006]
[null,null,null,3501,93.600000000000009,327693.60000000003]
[null,null,null,3502,93.600000000000009,327787.2]
[null,null,null,3503,93.600000000000009,327880.80000000005]
[null,null,null,3504,93.600000000000009,327974.40000000002]
[null,null,null,3505,93.600000000000009,328068.00000000006]
[null,null,null,3506,93.600000000000009,328161.60000000003]
[null,null,null,3507,93.600000000000009,328255.2]
[null,null,null,3508,93.600000000000009,328348.80000000005]
[null,null,null,3509,93.600000000000009,328442.40000000002]
[null,null,null,3510,93.600000000000009,328536.00000000006]
[null,null,null,3511,93.600000000000009,328629.60000000003]
[null,null,null,3512,93.600000000000009,328723.20000000001]
[null,null,null,3513,93.600000000000009,328816.80000000005]
[null,null,null,3514,93.600000000000009,328910.40000000002]
[null,null,null,3515,93.600000000000009,329004.00000000006]
[null,null,null,3516,93.600000000000009,329097.60000000003]
[null,null,null,3517,93.600000000000009,329191.2]
[null,null,null,3518,93.600000000000009,329284.80000000005]
[null,null,null,3519,93.600000000000009,329378.40000000002]
[null,null,null,3520,93.600000000000009,329472.00000000006]
[null,null,null,3521,93.600000000000009,329565.60000000003]
[null,null,null,3522,93.600000000000009,329659.2]
[null,null,null,3523,93.600000000000009,329752.80000000005]
[null,null,null,3524,93.600000000000009,329846.40000000002]
[null,null,null,3525,93.600000000000009,329940.00000000006]
[null,null,null,3526,93.600000000000009,330033.60000000003]
[null,null,null,3527,93.600000000000009,330127.2]
[null,null,null,3528,93.600000000000009,330220.80000000005]
[null,null,null,3529,93.600000000000009,330314.40000000002]
[null,null,null,3530,93.600000000000009,330408.00000000006]
[null,null,null,3531,93.600000000000009,330501.60000000003]
[null,null,null,3532,93.600000000000009,330595.20000000001]
[null,null,null,3533,93.600000000000009,330688.80000000005]
[null,null,null,3534,93.600000000000009,330782.40000000002]
[null,null,null,3535,93.600000000000009,330876.00000000006]
[null,null,null,3536,93.600000000000009,330969.60000000003]
[null,null,null,3537,93.600000000000009,331063.2]
[null,null,null,3538,{"$f":"$E$13","v":93.600000000000009},331156.80000000005]
[null,null,null,3539,93.600000000000009,331250.40000000002]
[null,null,null,3540,93.600000000000009,331344.00000000006]
[null,null,null,3541,93.600000000000009,331437.60000000003]
[null,null,null,3542,93.600000000000009,331531.2]
[null,null,null,3543,93.600000000000009,331624.80000000005]
[null,null,null,3544,93.600000000000009,331718.40000000002]
[null,null,null,3545,93.600000000000009,331812.00000000006]
[null,null,null,3546,93.600000000000009,331905.60000000003]
[null,null,null,3547,93.600000000000009,331999.2]
[null,null,null,3548,93.600000000000009,332092.80000000005]
[null,null,null,3549,93.600000000000009,332186.40000000002]
[null,null,null,3550,93.600000000000009,332280.00000000006]
[null,null,null,3551,93.600000000000009,332373.60000000003]
[null,null,null,3552,93.600000000000009,332467.20000000001]
[null,null,null,3553,93.600000000000009,332560.80000000005]
[null,null,null,3554,93.600000000000009,332654.40000000002]
[null,null,null,3555,93.600000000000009,332748.00000000006]
[null,null,null,3556,93.600000000000009,332841.60000000003]
[null,null,null,3557,93.600000000000009,{"$f":"E3574*D3574","v":332935.2}]
[null,null,null,3558,93.600000000000009,333028.80000000005]
[null,null,null,3559,93.600000000000009,333122.40000000002]
[null,null,null,3560,93.600000000000009,333216.00000000006]
[null,null,null,3561,93.600000000000009,333309.60000000003]
[null,null,null,3562,93.600000000000009,333403.2]
[null,null,null,3563,93.600000000000009,333496.80000000005]
[null,null,null,3564,93.600000000000009,333590.40000000002]
[null,null,null,3565,93.600000000000009,333684.00000000006]
[null,null,null,3566,93.600000000000009,333777.60000000003]
[null,null,null,3567,93.600000000000009,333871.2]
[null,null,null,3568,93.600000000000009,333964.80000000005]
[null,null,null,3569,93.600000000000009,334058.40000000002]
[null,null,null,3570,93.600000000000009,334152.00000000006]
[null,null,null,3571,93.600000000000009,334245.60000000003]
[null,null,null,3572,93.600000000000009,334339.20000000001]
[null,null,null,3573,93.600000000000009,334432.80000000005]
[null,null,null,3574,93.600000000000009,334526.40000000002]
[null,null,null,3575,93.600000000000009,334620.00000000006]
[null,null,null,3576,93.600000000000009,334713.60000000003]
[null,null,null,3577,93.600000000000009,334807.2]
[null,null,null,3578,93.600000000000009,334900.80000000005]
[null,null,null,3579,93.600000000000009,334994.40000000002]
[null,null,null,3580,93.600000000000009,335088.00000000006]
[null,null,null,3581,93.600000000000009,335181.60000000003]
[null,null,null,3582,93.600000000000009,335275.2]
[null,null,null,3583,93.600000000000009,335368.80000000005]
[null,null,null,3584,93.600000000000009,335462.40000000002]
[null,null,null,3585,93.600000000000009,335556.00000000006]
[null,null,null,3586,93.600000000000009,335649.60000000003]
[null,null,null,3587,93.600000000000009,335743.2]
[null,null,null,3588,93.600000000000009,335836.80000000005]
[null,null,null,3589,93.600000000000009,335930.4]
[null,null,null,3590,93.600000000000009,336024.00000000006]
[null,null,null,3591,93.600000000000009,336117.60000000003]
[null,null,null,3592,93.600000000000009,336211.20000000001]
[null,null,null,3593,93.600000000000009,336304.80000000005]
[null,null,null,3594,93.600000000000009,336398.4]
[null,null,null,3595,93.600000000000009,336492.00000000006]
[null,null,null,3596,93.600000000000009,336585.60000000003]
[null,null,null,3597,93.600000000000009,336679.2]
[null,null,null,3598,93.600000000000009,336772.80000000005]
[null,null,null,3599,93.600000000000009,336866.4]
[null,null,null,3600,93.600000000000009,336960.00000000006]
[null,null,null,3601,93.600000000000009,337053.60000000003]
[null,null,null,3602,{"$f":"$E$13","v":93.600000000000009},337147.2]
[null,null,null,3603,93.600000000000009,337240.80000000005]
[null,null,null,3604,93.600000000000009,337334.4]
[null,null,null,3605,93.600000000000009,337428.00000000006]
[null,null,null,3606,93.600000000000009,337521.60000000003]
[null,null,null,3607,93.600000000000009,337615.2]
[null,null,null,3608,93.600000000000009,337708.80000000005]
[null,null,null,3609,93.600000000000009,337802.4]
[null,null,null,3610,93.600000000000009,337896.00000000006]
[null,null,null,3611,93.600000000000009,337989.60000000003]
[null,null,null,3612,93.600000000000009,338083.2]
[null,null,null,3613,93.600000000000009,338176.80000000005]
[null,null,null,3614,93.600000000000009,338270.4]
[null,null,null,3615,93.600000000000009,338364.00000000006]
[null,null,null,3616,93.600000000000009,338457.60000000003]
[null,null,null,3617,93.600000000000009,338551.2]
[null,null,null,3618,93.600000000000009,338644.80000000005]
[null,null,null,3619,93.600000000000009,338738.4]
[null,null,null,3620,93.600000000000009,338832.00000000006]
[null,null,null,3621,93.600000000000009,{"$f":"E3638*D3638","v":338925.60000000003}]
[null,null,null,3622,93.600000000000009,339019.2]
[null,null,null,3623,93.600000000000009,339112.80000000005]
[null,null,null,3624,93.600000000000009,339206.40000000002]
[null,null,null,3625,93.600000000000009,339300.00000000006]
[null,null,null,3626,93.600000000000009,339393.60000000003]
[null,null,null,3627,93.600000000000009,339487.2]
[null,null,null,3628,93.600000000000009,339580.80000000005]
[null,null,null,3629,93.600000000000009,339674.4]
[null,null,null,3630,93.600000000000009,339768.00000000006]
[null,null,null,3631,93.600000000000009,339861.60000000003]
[null,null,null,3632,93.600000000000009,339955.20000000001]
[null,null,null,3633,93.600000000000009,340048.80000000005]
[null,null,null,3634,93.600000000000009,340142.4]
[null,null,null,3635,93.600000000000009,340236.00000000006]
[null,null,null,3636,93.600000000000009,340329.60000000003]
[null,null,null,3637,93.600000000000009,340423.2]
[null,null,null,3638,93.600000000000009,340516.80000000005]
[null,null,null,3639,93.600000000000009,340610.4]
[null,null,null,3640,93.600000000000009,340704.00000000006]
[null,null,null,3641,93.600000000000009,340797.60000000003]
[null,null,null,3642,93.600000000000009,340891.2]
[null,null,null,3643,93.600000000000009,340984.80000000005]
[null,null,null,3644,93.600000000000009,341078.4]
[null,null,null,3645,93.600000000000009,341172.00000000006]
[null,null,null,3646,93.600000000000009,341265.60000000003]
[null,null,null,3647,93.600000000000009,341359.2]
[null,null,null,3648,93.600000000000009,341452.80000000005]
[null,null,null,3649,93.600000000000009,341546.4]
[null,null,null,3650,93.600000000000009,341640.00000000006]
[null,null,null,3651,93.600000000000009,341733.60000000003]
[null,null,null,3652,93.600000000000009,341827.2]
[null,null,null,3653,93.600000000000009,341920.80000000005]
[null,null,null,3654,93.600000000000009,342014.4]
[null,null,null,3655,93.600000000000009,342108.00000000006]
[null,null,null,3656,93.600000000000009,342201.60000000003]
[null,null,null,3657,93.600000000000009,342295.2]
[null,null,null,3658,93.600000000000009,342388.80000000005]
[null,null,null,3659,93.600000000000009,342482.4]
[null,null,null,3660,93.600000000000009,342576.00000000006]
[null,null,null,3661,93.600000000000009,342669.60000000003]
[null,null,null,3662,93.600000000000009,342763.2]
[null,null,null,3663,93.600000000000009,342856.80000000005]
[null,null,null,3664,93.600000000000009,342950.40000000002]
[null,null,null,3665,93.600000000000009,343044.00000000006]
[null,null,null,3666,{"$f":"$E$13","v":93.600000000000009},343137.60000000003]
[null,null,null,3667,93.600000000000009,343231.2]
[null,null,null,3668,93.600000000000009,343324.80000000005]
[null,null,null,3669,93.600000000000009,343418.4]
[null,null,null,3670,93.600000000000009,343512.00000000006]
[null,null,null,3671,93.600000000000009,343605.60000000003]
[null,null,null,3672,93.600000000000009,343699.20000000001]
[null,null,null,3673,93.600000000000009,343792.80000000005]
[null,null,null,3674,93.600000000000009,343886.4]
[null,null,null,3675,93.600000000000009,343980.00000000006]
[null,null,null,3676,93.600000000000009,344073.60000000003]
[null,null,null,3677,93.600000000000009,344167.2]
[null,null,null,3678,93.600000000000009,344260.80000000005]
[null,null,null,3679,93.600000000000009,344354.4]
[null,null,null,3680,93.600000000000009,344448.00000000006]
[null,null,null,3681,93.600000000000009,344541.60000000003]
[null,null,null,3682,93.600000000000009,344635.2]
[null,null,null,3683,93.600000000000009,344728.80000000005]
[null,null,null,3684,93.600000000000009,344822.4]
[null,null,null,3685,93.600000000000009,{"$f":"E3702*D3702","v":344916.00000000006}]
[null,null,null,3686,93.600000000000009,345009.60000000003]
[null,null,null,3687,93.600000000000009,345103.2]
[null,null,null,3688,93.600000000000009,345196.80000000005]
[null,null,null,3689,93.600000000000009,345290.4]
[null,null,null,3690,93.600000000000009,345384.00000000006]
[null,null,null,3691,93.600000000000009,345477.60000000003]
[null,null,null,3692,93.600000000000009,345571.2]
[null,null,null,3693,93.600000000000009,345664.80000000005]
[null,null,null,3694,93.600000000000009,345758.4]
[null,null,null,3695,93.600000000000009,345852.00000000006]
[null,null,null,3696,93.600000000000009,345945.60000000003]
[null,null,null,3697,93.600000000000009,346039.2]
[null,null,null,3698,93.600000000000009,346132.80000000005]
[null,null,null,3699,93.600000000000009,346226.4]
[null,null,null,3700,93.600000000000009,346320.00000000006]
[null,null,null,3701,93.600000000000009,346413.60000000003]
[null,null,null,3702,93.600000000000009,346507.2]
[null,null,null,3703,93.600000000000009,346600.80000000005]
[null,null,null,3704,93.600000000000009,346694.40000000002]
[null,null,null,3705,93.600000000000009,346788.00000000006]
[null,null,null,3706,93.600000000000009,346881.60000000003]
[null,null,null,3707,93.600000000000009,346975.2]
[null,null,null,3708,93.600000000000009,347068.80000000005]
[null,null,null,3709,93.600000000000009,347162.4]
[null,null,null,3710,93.600000000000009,347256.00000000006]
[null,null,null,3711,93.600000000000009,347349.60000000003]
[null,null,null,3712,93.600000000000009,347443.20000000001]
[null,null,null,3713,93.600000000000009,347536.80000000005]
[null,null,null,3714,93.600000000000009,347630.4]
[null,null,null,3715,93.600000000000009,347724.00000000006]
[null,null,null,3716,93.600000000000009,347817.60000000003]
[null,null,null,3717,93.600000000000009,347911.2]
[null,null,null,3718,93.600000000000009,348004.80000000005]
[null,null,null,3719,93.600000000000009,348098.4]
[null,null,null,3720,93.600000000000009,348192.00000000006]
[null,null,null,3721,93.600000000000009,348285.60000000003]
[null,null,null,3722,93.600000000000009,348379.2]
[null,null,null,3723,93.600000000000009,348472.80000000005]
[null,null,null,3724,93.600000000000009,348566.4]
[null,null,null,3725,93.600000000000009,348660.00000000006]
[null,null,null,3726,93.600000000000009,348753.60000000003]
[null,null,null,3727,93.600000000000009,348847.2]
[null,null,null,3728,93.600000000000009,348940.80000000005]
[null,null,null,3729,93.600000000000009,349034.4]
[null,null,null,3730,{"$f":"$E$13","v":93.600000000000009},349128.00000000006]
[null,null,null,3731,93.600000000000009,349221.60000000003]
[null,null,null,3732,93.600000000000009,349315.2]
[null,null,null,3733,93.600000000000009,349408.80000000005]
[null,null,null,3734,93.600000000000009,349502.4]
[null,null,null,3735,93.600000000000009,349596.00000000006]
[null,null,null,3736,93.600000000000009,349689.60000000003]
[null,null,null,3737,93.600000000000009,349783.2]
[null,null,null,3738,93.600000000000009,349876.80000000005]
[null,null,null,3739,93.600000000000009,349970.4]
[null,null,null,3740,93.600000000000009,350064.00000000006]
[null,null,null,3741,93.600000000000009,350157.60000000003]
[null,null,null,3742,93.600000000000009,350251.2]
[null,null,null,3743,93.600000000000009,350344.80000000005]
[null,null,null,3744,93.600000000000009,350438.40000000002]
[null,null,null,3745,93.600000000000009,350532.00000000006]
[null,null,null,3746,93.600000000000009,350625.60000000003]
[null,null,null,3747,93.600000000000009,350719.2]
[null,null,null,3748,93.600000000000009,350812.80000000005]
[null,null,null,3749,93.600000000000009,{"$f":"E3766*D3766","v":350906.4}]
[null,null,null,3750,93.600000000000009,351000.00000000006]
[null,null,null,3751,93.600000000000009,351093.60000000003]
[null,null,null,3752,93.600000000000009,351187.20000000001]
[null,null,null,3753,93.600000000000009,351280.80000000005]
[null,null,null,3754,93.600000000000009,351374.4]
[null,null,null,3755,93.600000000000009,351468.00000000006]
[null,null,null,3756,93.600000000000009,351561.60000000003]
[null,null,null,3757,93.600000000000009,351655.2]
[null,null,null,3758,93.600000000000009,351748.80000000005]
[null,null,null,3759,93.600000000000009,351842.4]
[null,null,null,3760,93.600000000000009,351936.00000000006]
[null,null,null,3761,93.600000000000009,352029.60000000003]
[null,null,null,3762,93.600000000000009,352123.2]
[null,null,null,3763,93.600000000000009,352216.80000000005]
[null,null,null,3764,93.600000000000009,352310.4]
[null,null,null,3765,93.600000000000009,352404.00000000006]
[null,null,null,3766,93.600000000000009,352497.60000000003]
[null,null,null,3767,93.600000000000009,352591.2]
[null,null,null,3768,93.600000000000009,352684.80000000005]
[null,null,null,3769,93.600000000000009,352778.4]
[null,null,null,3770,93.600000000000009,352872.00000000006]
[null,null,null,3771,93.600000000000009,352965.60000000003]
[null,null,null,3772,93.600000000000009,353059.2]
[null,null,null,3773,93.600000000000009,353152.80000000005]
[null,null,null,3774,93.600000000000009,353246.4]
[null,null,null,3775,93.600000000000009,353340.00000000006]
[null,null,null,3776,93.600000000000009,353433.60000000003]
[null,null,null,3777,93.600000000000009,353527.2]
[null,null,null,3778,93.600000000000009,353620.80000000005]
[null,null,null,3779,93.600000000000009,353714.4]
[null,null,null,3780,93.600000000000009,353808.00000000006]
[null,null,null,3781,93.600000000000009,353901.60000000003]
[null,null,null,3782,93.600000000000009,353995.2]
[null,null,null,3783,93.600000000000009,354088.80000000005]
[null,null,null,3784,93.600000000000009,354182.40000000002]
[null,null,null,3785,93.600000000000009,354276.00000000006]
[null,null,null,3786,93.600000000000009,354369.60000000003]
[null,null,null,3787,93.600000000000009,354463.2]
[null,null,null,3788,93.600000000000009,354556.80000000005]
[null,null,null,3789,93.600000000000009,354650.4]
[null,null,null,3790,93.600000000000009,354744.00000000006]
[null,null,null,3791,93.600000000000009,354837.60000000003]
[null,null,null,3792,93.600000000000009,354931.20000000001]
[null,null,null,3793,93.600000000000009,355024.80000000005]
[null,null,null,3794,{"$f":"$E$13","v":93.600000000000009},355118.4]
[null,null,null,3795,93.600000000000009,355212.00000000006]
[null,null,null,3796,93.600000000000009,355305.60000000003]
[null,null,null,3797,93.600000000000009,355399.2]
[null,null,null,3798,93.600000000000009,355492.80000000005]
[null,null,null,3799,93.600000000000009,355586.4]
[null,null,null,3800,93.600000000000009,355680.00000000006]
[null,null,null,3801,93.600000000000009,355773.60000000003]
[null,null,null,3802,93.600000000000009,355867.2]
[null,null,null,3803,93.600000000000009,355960.80000000005]
[null,null,null,3804,93.600000000000009,356054.4]
[null,null,null,3805,93.600000000000009,356148.00000000006]
[null,null,null,3806,93.600000000000009,356241.60000000003]
[null,null,null,3807,93.600000000000009,356335.2]
[null,null,null,3808,93.600000000000009,356428.80000000005]
[null,null,null,3809,93.600000000000009,356522.4]
[null,null,null,3810,93.600000000000009,356616.00000000006]
[null,null,null,3811,93.600000000000009,356709.60000000003]
[null,null,null,3812,93.600000000000009,356803.2]
[null,null,null,3813,93.600000000000009,{"$f":"E3830*D3830","v":356896.80000000005}]
[null,null,null,3814,93.600000000000009,356990.4]
[null,null,null,3815,93.600000000000009,357084.00000000006]
[null,null,null,3816,93.600000000000009,357177.60000000003]
[null,null,null,3817,93.600000000000009,357271.2]
[null,null,null,3818,93.600000000000009,357364.80000000005]
[null,null,null,3819,93.600000000000009,357458.4]
[null,null,null,3820,93.600000000000009,357552.00000000006]
[null,null,null,3821,93.600000000000009,357645.60000000003]
[null,null,null,3822,93.600000000000009,357739.2]
[null,null,null,3823,93.600000000000009,357832.80000000005]
[null,null,null,3824,93.600000000000009,357926.40000000002]
[null,null,null,3825,93.600000000000009,358020.00000000006]
[null,null,null,3826,93.600000000000009,358113.60000000003]
[null,null,null,3827,93.600000000000009,358207.2]
[null,null,null,3828,93.600000000000009,358300.80000000005]
[null,null,null,3829,93.600000000000009,358394.4]
[null,null,null,3830,93.600000000000009,358488.00000000006]
[null,null,null,3831,93.600000000000009,358581.60000000003]
[null,null,null,3832,93.600000000000009,358675.20000000001]
[null,null,null,3833,93.600000000000009,358768.80000000005]
[null,null,null,3834,93.600000000000009,358862.4]
[null,null,null,3835,93.600000000000009,358956.00000000006]
[null,null,null,3836,93.600000000000009,359049.60000000003]
[null,null,null,3837,93.600000000000009,359143.2]
[null,null,null,3838,93.600000000000009,359236.80000000005]
[null,null,null,3839,93.600000000000009,359330.4]
[null,null,null,3840,93.600000000000009,359424.00000000006]
[null,null,null,3841,93.600000000000009,359517.60000000003]
[null,null,null,3842,93.600000000000009,359611.2]
[null,null,null,3843,93.600000000000009,359704.80000000005]
[null,null,null,3844,93.600000000000009,359798.4]
[null,null,null,3845,93.600000000000009,359892.00000000006]
[null,null,null,3846,93.600000000000009,359985.60000000003]
[null,null,null,3847,93.600000000000009,360079.2]
[null,null,null,3848,93.600000000000009,360172.80000000005]
[null,null,null,3849,93.600000000000009,360266.4]
[null,null,null,3850,93.600000000000009,360360.00000000006]
[null,null,null,3851,93.600000000000009,360453.60000000003]
[null,null,null,3852,93.600000000000009,360547.2]
[null,null,null,3853,93.600000000000009,360640.80000000005]
[null,null,null,3854,93.600000000000009,360734.4]
[null,null,null,3855,93.600000000000009,360828.00000000006]
[null,null,null,3856,93.600000000000009,360921.60000000003]
[null,null,null,3857,93.600000000000009,361015.2]
[null,null,null,3858,{"$f":"$E$13","v":93.600000000000009},361108.80000000005]
[null,null,null,3859,93.600000000000009,361202.4]
[null,null,null,3860,93.600000000000009,361296.00000000006]
[null,null,null,3861,93.600000000000009,361389.60000000003]
[null,null,null,3862,93.600000000000009,361483.2]
[null,null,null,3863,93.600000000000009,361576.80000000005]
[null,null,null,3864,93.600000000000009,361670.40000000002]
[null,null,null,3865,93.600000000000009,361764.00000000006]
[null,null,null,3866,93.600000000000009,361857.60000000003]
[null,null,null,3867,93.600000000000009,361951.2]
[null,null,null,3868,93.600000000000009,362044.80000000005]
[null,null,null,3869,93.600000000000009,362138.4]
[null,null,null,3870,93.600000000000009,362232.00000000006]
[null,null,null,3871,93.600000000000009,362325.60000000003]
[null,null,null,3872,93.600000000000009,362419.20000000001]
[null,null,null,3873,93.600000000000009,362512.80000000005]
[null,null,null,3874,93.600000000000009,362606.4]
[null,null,null,3875,93.600000000000009,362700.00000000006]
[null,null,null,3876,93.600000000000009,362793.60000000003]
[null,null,null,3877,93.600000000000009,{"$f":"E3894*D3894","v":362887.2}]
[null,null,null,3878,93.600000000000009,362980.80000000005]
[null,null,null,3879,93.600000000000009,363074.4]
[null,null,null,3880,93.600000000000009,363168.00000000006]
[null,null,null,3881,93.600000000000009,363261.60000000003]
[null,null,null,3882,93.600000000000009,363355.2]
[null,null,null,3883,93.600000000000009,363448.80000000005]
[null,null,null,3884,93.600000000000009,363542.4]
[null,null,null,3885,93.600000000000009,363636.00000000006]
[null,null,null,3886,93.600000000000009,363729.60000000003]
[null,null,null,3887,93.600000000000009,363823.2]
[null,null,null,3888,93.600000000000009,363916.80000000005]
[null,null,null,3889,93.600000000000009,364010.4]
[null,null,null,3890,93.600000000000009,364104.00000000006]
[null,null,null,3891,93.600000000000009,364197.60000000003]
[null,null,null,3892,93.600000000000009,364291.2]
[null,null,null,3893,93.600000000000009,364384.80000000005]
[null,null,null,3894,93.600000000000009,364478.4]
[null,null,null,3895,93.600000000000009,364572.00000000006]
[null,null,null,3896,93.600000000000009,364665.60000000003]
[null,null,null,3897,93.600000000000009,364759.2]
[null,null,null,3898,93.600000000000009,364852.80000000005]
[null,null,null,3899,93.600000000000009,364946.4]
[null,null,null,3900,93.600000000000009,365040.00000000006]
[null,null,null,3901,93.600000000000009,365133.60000000003]
[null,null,null,3902,93.600000000000009,365227.2]
[null,null,null,3903,93.600000000000009,365320.80000000005]
[null,null,null,3904,93.600000000000009,365414.40000000002]
[null,null,null,3905,93.600000000000009,365508.00000000006]
[null,null,null,3906,93.600000000000009,365601.60000000003]
[null,null,null,3907,93.600000000000009,365695.2]
[null,null,null,3908,93.600000000000009,365788.80000000005]
[null,null,null,3909,93.600000000000009,365882.4]
[null,null,null,3910,93.600000000000009,365976.00000000006]
[null,null,null,3911,93.600000000000009,366069.60000000003]
[null,null,null,3912,93.600000000000009,366163.20000000001]
[null,null,null,3913,93.600000000000009,366256.80000000005]
[null,null,null,3914,93.600000000000009,366350.4]
[null,null,null,3915,93.600000000000009,366444.00000000006]
[null,null,null,3916,93.600000000000009,366537.60000000003]
[null,null,null,3917,93.600000000000009,366631.2]
[null,null,null,3918,93.600000000000009,366724.80000000005]
[null,null,null,3919,93.600000000000009,366818.4]
[null,null,null,3920,93.600000000000009,366912.00000000006]
[null,null,null,3921,93.600000000000009,367005.60000000003]
[null,null,null,3922,{"$f":"$E$13","v":93.600000000000009},367099.2]
[null,null,null,3923,93.600000000000009,367192.80000000005]
[null,null,null,3924,93.600000000000009,367286.4]
[null,null,null,3925,93.600000000000009,367380.00000000006]
[null,null,null,3926,93.600000000000009,367473.60000000003]
[null,null,null,3927,93.600000000000009,367567.2]
[null,null,null,3928,93.600000000000009,367660.80000000005]
[null,null,null,3929,93.600000000000009,367754.4]
[null,null,null,3930,93.600000000000009,367848.00000000006]
[null,null,null,3931,93.600000000000009,367941.60000000003]
[null,null,null,3932,93.600000000000009,368035.2]
[null,null,null,3933,93.600000000000009,368128.80000000005]
[null,null,null,3934,93.600000000000009,368222.4]
[null,null,null,3935,93.600000000000009,368316.00000000006]
[null,null,null,3936,93.600000000000009,368409.60000000003]
[null,null,null,3937,93.600000000000009,368503.2]
[null,null,null,3938,93.600000000000009,368596.80000000005]
[null,null,null,3939,93.600000000000009,368690.4]
[null,null,null,3940,93.600000000000009,368784.00000000006]
[null,null,null,3941,93.600000000000009,{"$f":"E3958*D3958","v":368877.60000000003}]
[null,null,null,3942,93.600000000000009,368971.2]
[null,null,null,3943,93.600000000000009,369064.80000000005]
[null,null,null,3944,93.600000000000009,369158.40000000002]
[null,null,null,3945,93.600000000000009,369252.00000000006]
[null,null,null,3946,93.600000000000009,369345.60000000003]
[null,null,null,3947,93.600000000000009,369439.2]
[null,null,null,3948,93.600000000000009,369532.80000000005]
[null,null,null,3949,93.600000000000009,369626.4]
[null,null,null,3950,93.600000000000009,369720.00000000006]
[null,null,null,3951,93.600000000000009,369813.60000000003]
[null,null,null,3952,93.600000000000009,369907.20000000001]
[null,null,null,3953,93.600000000000009,370000.80000000005]
[null,null,null,3954,93.600000000000009,370094.4]
[null,null,null,3955,93.600000000000009,370188.00000000006]
[null,null,null,3956,93.600000000000009,370281.60000000003]
[null,null,null,3957,93.600000000000009,370375.2]
[null,null,null,3958,93.600000000000009,370468.80000000005]
[null,null,null,3959,93.600000000000009,370562.4]
[null,null,null,3960,93.600000000000009,370656.00000000006]
[null,null,null,3961,93.600000000000009,370749.60000000003]
[null,null,null,3962,93.600000000000009,370843.2]
[null,null,null,3963,93.600000000000009,370936.80000000005]
[null,null,null,3964,93.600000000000009,371030.4]
[null,null,null,3965,93.600000000000009,371124.00000000006]
[null,null,null,3966,93.600000000000009,371217.60000000003]
[null,null,null,3967,93.600000000000009,371311.2]
[null,null,null,3968,93.600000000000009,371404.80000000005]
[null,null,null,3969,93.600000000000009,371498.4]
[null,null,null,3970,93.600000000000009,371592.00000000006]
[null,null,null,3971,93.600000000000009,371685.60000000003]
[null,null,null,3972,93.600000000000009,371779.2]
[null,null,null,3973,93.600000000000009,371872.80000000005]
[null,null,null,3974,93.600000000000009,371966.4]
[null,null,null,3975,93.600000000000009,372060.00000000006]
[null,null,null,3976,93.600000000000009,372153.60000000003]
[null,null,null,3977,93.600000000000009,372247.2]
[null,null,null,3978,93.600000000000009,372340.80000000005]
[null,null,null,3979,93.600000000000009,372434.4]
[null,null,null,3980,93.600000000000009,372528.00000000006]
[null,null,null,3981,93.600000000000009,372621.60000000003]
[null,null,null,3982,93.600000000000009,372715.2]
[null,null,null,3983,93.600000000000009,372808.80000000005]
[null,null,null,3984,93.600000000000009,372902.40000000002]
[null,null,null,3985,93.600000000000009,372996.00000000006]
[null,null,null,3986,{"$f":"$E$13","v":93.600000000000009},373089.60000000003]
[null,null,null,3987,93.600000000000009,373183.2]
[null,null,null,3988,93.600000000000009,373276.80000000005]
[null,null,null,3989,93.600000000000009,373370.4]
[null,null,null,3990,93.600000000000009,373464.00000000006]
[null,null,null,3991,93.600000000000009,373557.60000000003]
[null,null,null,3992,93.600000000000009,373651.20000000001]
[null,null,null,3993,93.600000000000009,373744.80000000005]
[null,null,null,3994,93.600000000000009,373838.4]
[null,null,null,3995,93.600000000000009,373932.00000000006]
[null,null,null,3996,93.600000000000009,374025.60000000003]
[null,null,null,3997,93.600000000000009,374119.2]
[null,null,null,3998,93.600000000000009,374212.80000000005]
[null,null,null,3999,93.600000000000009,374306.4]
[null,null,null,4000,93.600000000000009,374400.00000000006]
[null,null,null,4001,93.600000000000009,374493.60000000003]
[null,null,null,4002,93.600000000000009,374587.2]
[null,null,null,4003,93.600000000000009,374680.80000000005]
[null,null,null,4004,93.600000000000009,374774.4]
[null,null,null,4005,93.600000000000009,{"$f":"E4022*D4022","v":374868.00000000006}]
[null,null,null,4006,93.600000000000009,374961.60000000003]
[null,null,null,4007,93.600000000000009,375055.2]
[null,null,null,4008,93.600000000000009,375148.80000000005]
[null,null,null,4009,93.600000000000009,375242.4]
[null,null,null,4010,93.600000000000009,375336.00000000006]
[null,null,null,4011,93.600000000000009,375429.60000000003]
[null,null,null,4012,93.600000000000009,375523.2]
[null,null,null,4013,93.600000000000009,375616.80000000005]
[null,null,null,4014,93.600000000000009,375710.4]
[null,null,null,4015,93.600000000000009,375804.00000000006]
[null,null,null,4016,93.600000000000009,375897.60000000003]
[null,null,null,4017,93.600000000000009,375991.2]
[null,null,null,4018,93.600000000000009,376084.80000000005]
[null,null,null,4019,93.600000000000009,376178.4]
[null,null,null,4020,93.600000000000009,376272.00000000006]
[null,null,null,4021,93.600000000000009,376365.60000000003]
[null,null,null,4022,93.600000000000009,376459.2]
[null,null,null,4023,93.600000000000009,376552.80000000005]
[null,null,null,4024,93.600000000000009,376646.40000000002]
[null,null,null,4025,93.600000000000009,376740.00000000006]
[null,null,null,4026,93.600000000000009,376833.60000000003]
[null,null,null,4027,93.600000000000009,376927.2]
[null,null,null,4028,93.600000000000009,377020.80000000005]
[null,null,null,4029,93.600000000000009,377114.4]
[null,null,null,4030,93.600000000000009,377208.00000000006]
[null,null,null,4031,93.600000000000009,377301.60000000003]
[null,null,null,4032,93.600000000000009,377395.20000000001]
[null,null,null,4033,93.600000000000009,377488.80000000005]
[null,null,null,4034,93.600000000000009,377582.4]
[null,null,null,4035,93.600000000000009,377676.00000000006]
[null,null,null,4036,93.600000000000009,377769.60000000003]
[null,null,null,4037,93.600000000000009,377863.2]
[null,null,null,4038,93.600000000000009,377956.80000000005]
[null,null,null,4039,93.600000000000009,378050.4]
[null,null,null,4040,93.600000000000009,378144.00000000006]
[null,null,null,4041,93.600000000000009,378237.60000000003]
[null,null,null,4042,93.600000000000009,378331.2]
[null,null,null,4043,93.600000000000009,378424.80000000005]
[null,null,null,4044,93.600000000000009,378518.4]
[null,null,null,4045,93.600000000000009,378612.00000000006]
[null,null,null,4046,93.600000000000009,378705.60000000003]
[null,null,null,4047,93.600000000000009,378799.2]
[null,null,null,4048,93.600000000000009,378892.80000000005]
[null,null,null,4049,93.600000000000009,378986.4]
[null,null,null,4050,{"$f":"$E$13","v":93.600000000000009},379080.00000000006]
[null,null,null,4051,93.600000000000009,379173.60000000003]
[null,null,null,4052,93.600000000000009,379267.2]
[null,null,null,4053,93.600000000000009,379360.80000000005]
[null,null,null,4054,93.600000000000009,379454.4]
[null,null,null,4055,93.600000000000009,379548.00000000006]
[null,null,null,4056,93.600000000000009,379641.60000000003]
[null,null,null,4057,93.600000000000009,379735.2]
[null,null,null,4058,93.600000000000009,379828.80000000005]
[null,null,null,4059,93.600000000000009,379922.4]
[null,null,null,4060,93.600000000000009,380016.00000000006]
[null,null,null,4061,93.600000000000009,380109.60000000003]
[null,null,null,4062,93.600000000000009,380203.2]
[null,null,null,4063,93.600000000000009,380296.80000000005]
[null,null,null,4064,93.600000000000009,380390.40000000002]
[null,null,null,4065,93.600000000000009,380484.00000000006]
[null,null,null,4066,93.600000000000009,380577.60000000003]
[null,null,null,4067,93.600000000000009,380671.2]
[null,null,null,4068,93.600000000000009,380764.80000000005]
[null,null,null,4069,93.600000000000009,{"$f":"E4086*D4086","v":380858.4}]
[null,null,null,4070,93.600000000000009,380952.00000000006]
[null,null,null,4071,93.600000000000009,381045.60000000003]
[null,null,null,4072,93.600000000000009,381139.20000000001]
[null,null,null,4073,93.600000000000009,381232.80000000005]
[null,null,null,4074,93.600000000000009,381326.4]
[null,null,null,4075,93.600000000000009,381420.00000000006]
[null,null,null,4076,93.600000000000009,381513.60000000003]
[null,null,null,4077,93.600000000000009,381607.2]
[null,null,null,4078,93.600000000000009,381700.80000000005]
[null,null,null,4079,93.600000000000009,381794.4]
[null,null,null,4080,93.600000000000009,381888.00000000006]
[null,null,null,4081,93.600000000000009,381981.60000000003]
[null,null,null,4082,93.600000000000009,382075.2]
[null,null,null,4083,93.600000000000009,382168.80000000005]
[null,null,null,4084,93.600000000000009,382262.4]
[null,null,null,4085,93.600000000000009,382356.00000000006]
[null,null,null,4086,93.600000000000009,382449.60000000003]
[null,null,null,4087,93.600000000000009,382543.2]
[null,null,null,4088,93.600000000000009,382636.80000000005]
[null,null,null,4089,93.600000000000009,382730.4]
[null,null,null,4090,93.600000000000009,382824.00000000006]
[null,null,null,4091,93.600000000000009,382917.60000000003]
[null,null,null,4092,93.600000000000009,383011.2]
[null,null,null,4093,93.600000000000009,383104.80000000005]
[null,null,null,4094,93.600000000000009,383198.4]
[null,null,null,4095,93.600000000000009,383292.00000000006]
[null,null,null,4096,93.600000000000009,383385.60000000003]
[null,null,null,4097,93.600000000000009,383479.2]
[null,null,null,4098,93.600000000000009,383572.80000000005]
[null,null,null,4099,93.600000000000009,383666.4]
[null,null,null,4100,93.600000000000009,383760.00000000006]
[null,null,null,4101,93.600000000000009,383853.60000000003]
[null,null,null,4102,93.600000000000009,383947.2]
[null,null,null,4103,93.600000000000009,384040.80000000005]
[null,null,null,4104,93.600000000000009,384134.40000000002]
[null,null,null,4105,93.600000000000009,384228.00000000006]
[null,null,null,4106,93.600000000000009,384321.60000000003]
[null,null,null,4107,93.600000000000009,384415.2]
[null,null,null,4108,93.600000000000009,384508.80000000005]
[null,null,null,4109,93.600000000000009,384602.4]
[null,null,null,4110,93.600000000000009,384696.00000000006]
[null,null,null,4111,93.600000000000009,384789.60000000003]
[null,null,null,4112,93.600000000000009,384883.20000000001]
[null,null,null,4113,93.600000000000009,384976.80000000005]
[null,null,null,4114,{"$f":"$E$13","v":93.600000000000009},385070.4]
[null,null,null,4115,93.600000000000009,385164.00000000006]
[null,null,null,4116,93.600000000000009,385257.60000000003]
[null,null,null,4117,93.600000000000009,385351.2]
[null,null,null,4118,93.600000000000009,385444.80000000005]
[null,null,null,4119,93.600000000000009,385538.4]
[null,null,null,4120,93.600000000000009,385632.00000000006]
[null,null,null,4121,93.600000000000009,385725.60000000003]
[null,null,null,4122,93.600000000000009,385819.2]
[null,null,null,4123,93.600000000000009,385912.80000000005]
[null,null,null,4124,93.600000000000009,386006.4]
[null,null,null,4125,93.600000000000009,386100.00000000006]
[null,null,null,4126,93.600000000000009,386193.60000000003]
[null,null,null,4127,93.600000000000009,386287.2]
[null,null,null,4128,93.600000000000009,386380.80000000005]
[null,null,null,4129,93.600000000000009,386474.4]
[null,null,null,4130,93.600000000000009,386568.00000000006]
[null,null,null,4131,93.600000000000009,386661.60000000003]
[null,null,null,4132,93.600000000000009,386755.2]
[null,null,null,4133,93.600000000000009,{"$f":"E4150*D4150","v":386848.80000000005}]
[null,null,null,4134,93.600000000000009,386942.4]
[null,null,null,4135,93.600000000000009,387036.00000000006]
[null,null,null,4136,93.600000000000009,387129.60000000003]
[null,null,null,4137,93.600000000000009,387223.2]
[null,null,null,4138,93.600000000000009,387316.80000000005]
[null,null,null,4139,93.600000000000009,387410.4]
[null,null,null,4140,93.600000000000009,387504.00000000006]
[null,null,null,4141,93.600000000000009,387597.60000000003]
[null,null,null,4142,93.600000000000009,387691.2]
[null,null,null,4143,93.600000000000009,387784.80000000005]
[null,null,null,4144,93.600000000000009,387878.40000000002]
[null,null,null,4145,93.600000000000009,387972.00000000006]
[null,null,null,4146,93.600000000000009,388065.60000000003]
[null,null,null,4147,93.600000000000009,388159.2]
[null,null,null,4148,93.600000000000009,388252.80000000005]
[null,null,null,4149,93.600000000000009,388346.4]
[null,null,null,4150,93.600000000000009,388440.00000000006]
[null,null,null,4151,93.600000000000009,388533.60000000003]
[null,null,null,4152,93.600000000000009,388627.20000000001]
[null,null,null,4153,93.600000000000009,388720.80000000005]
[null,null,null,4154,93.600000000000009,388814.4]
[null,null,null,4155,93.600000000000009,388908.00000000006]
[null,null,null,4156,93.600000000000009,389001.60000000003]
[null,null,null,4157,93.600000000000009,389095.2]
[null,null,null,4158,93.600000000000009,389188.80000000005]
[null,null,null,4159,93.600000000000009,389282.4]
[null,null,null,4160,93.600000000000009,389376.00000000006]
[null,null,null,4161,93.600000000000009,389469.60000000003]
[null,null,null,4162,93.600000000000009,389563.2]
[null,null,null,4163,93.600000000000009,389656.80000000005]
[null,null,null,4164,93.600000000000009,389750.4]
[null,null,null,4165,93.600000000000009,389844.00000000006]
[null,null,null,4166,93.600000000000009,389937.60000000003]
[null,null,null,4167,93.600000000000009,390031.2]
[null,null,null,4168,93.600000000000009,390124.80000000005]
[null,null,null,4169,93.600000000000009,390218.4]
[null,null,null,4170,93.600000000000009,390312.00000000006]
[null,null,null,4171,93.600000000000009,390405.60000000003]
[null,null,null,4172,93.600000000000009,390499.2]
[null,null,null,4173,93.600000000000009,390592.80000000005]
[null,null,null,4174,93.600000000000009,390686.4]
[null,null,null,4175,93.600000000000009,390780.00000000006]
[null,null,null,4176,93.600000000000009,390873.60000000003]
[null,null,null,4177,93.600000000000009,390967.2]
[null,null,null,4178,{"$f":"$E$13","v":93.600000000000009},391060.80000000005]
[null,null,null,4179,93.600000000000009,391154.4]
[null,null,null,4180,93.600000000000009,391248.00000000006]
[null,null,null,4181,93.600000000000009,391341.60000000003]
[null,null,null,4182,93.600000000000009,391435.2]
[null,null,null,4183,93.600000000000009,391528.80000000005]
[null,null,null,4184,93.600000000000009,391622.40000000002]
[null,null,null,4185,93.600000000000009,391716.00000000006]
[null,null,null,4186,93.600000000000009,391809.60000000003]
[null,null,null,4187,93.600000000000009,391903.2]
[null,null,null,4188,93.600000000000009,391996.80000000005]
[null,null,null,4189,93.600000000000009,392090.4]
[null,null,null,4190,93.600000000000009,392184.00000000006]
[null,null,null,4191,93.600000000000009,392277.60000000003]
[null,null,null,4192,93.600000000000009,392371.20000000001]
[null,null,null,4193,93.600000000000009,392464.80000000005]
[null,null,null,4194,93.600000000000009,392558.4]
[null,null,null,4195,93.600000000000009,392652.00000000006]
[null,null,null,4196,93.600000000000009,392745.60000000003]
[null,null,null,4197,93.600000000000009,{"$f":"E4214*D4214","v":392839.2}]
[null,null,null,4198,93.600000000000009,392932.80000000005]
[null,null,null,4199,93.600000000000009,393026.4]
[null,null,null,4200,93.600000000000009,393120.00000000006]
[null,null,null,4201,93.600000000000009,393213.60000000003]
[null,null,null,4202,93.600000000000009,393307.2]
[null,null,null,4203,93.600000000000009,393400.80000000005]
[null,null,null,4204,93.600000000000009,393494.4]
[null,null,null,4205,93.600000000000009,393588.00000000006]
[null,null,null,4206,93.600000000000009,393681.60000000003]
[null,null,null,4207,93.600000000000009,393775.2]
[null,null,null,4208,93.600000000000009,393868.80000000005]
[null,null,null,4209,93.600000000000009,393962.4]
[null,null,null,4210,93.600000000000009,394056.00000000006]
[null,null,null,4211,93.600000000000009,394149.60000000003]
[null,null,null,4212,93.600000000000009,394243.2]
[null,null,null,4213,93.600000000000009,394336.80000000005]
[null,null,null,4214,93.600000000000009,394430.4]
[null,null,null,4215,93.600000000000009,394524.00000000006]
[null,null,null,4216,93.600000000000009,394617.60000000003]
[null,null,null,4217,93.600000000000009,394711.2]
[null,null,null,4218,93.600000000000009,394804.80000000005]
[null,null,null,4219,93.600000000000009,394898.4]
[null,null,null,4220,93.600000000000009,394992.00000000006]
[null,null,null,4221,93.600000000000009,395085.60000000003]
[null,null,null,4222,93.600000000000009,395179.2]
[null,null,null,4223,93.600000000000009,395272.80000000005]
[null,null,null,4224,93.600000000000009,395366.40000000002]
[null,null,null,4225,93.600000000000009,395460.00000000006]
[null,null,null,4226,93.600000000000009,395553.60000000003]
[null,null,null,4227,93.600000000000009,395647.2]
[null,null,null,4228,93.600000000000009,395740.80000000005]
[null,null,null,4229,93.600000000000009,395834.4]
[null,null,null,4230,93.600000000000009,395928.00000000006]
[null,null,null,4231,93.600000000000009,396021.60000000003]
[null,null,null,4232,93.600000000000009,396115.20000000001]
[null,null,null,4233,93.600000000000009,396208.80000000005]
[null,null,null,4234,93.600000000000009,396302.4]
[null,null,null,4235,93.600000000000009,396396.00000000006]
[null,null,null,4236,93.600000000000009,396489.60000000003]
[null,null,null,4237,93.600000000000009,396583.2]
[null,null,null,4238,93.600000000000009,396676.80000000005]
[null,null,null,4239,93.600000000000009,396770.4]
[null,null,null,4240,93.600000000000009,396864.00000000006]
[null,null,null,4241,93.600000000000009,396957.60000000003]
[null,null,null,4242,{"$f":"$E$13","v":93.600000000000009},397051.2]
[null,null,null,4243,93.600000000000009,397144.80000000005]
[null,null,null,4244,93.600000000000009,397238.4]
[null,null,null,4245,93.600000000000009,397332.00000000006]
[null,null,null,4246,93.600000000000009,397425.60000000003]
[null,null,null,4247,93.600000000000009,397519.2]
[null,null,null,4248,93.600000000000009,397612.80000000005]
[null,null,null,4249,93.600000000000009,397706.4]
[null,null,null,4250,93.600000000000009,397800.00000000006]
[null,null,null,4251,93.600000000000009,397893.60000000003]
[null,null,null,4252,93.600000000000009,397987.2]
[null,null,null,4253,93.600000000000009,398080.80000000005]
[null,null,null,4254,93.600000000000009,398174.4]
[null,null,null,4255,93.600000000000009,398268.00000000006]
[null,null,null,4256,93.600000000000009,398361.60000000003]
[null,null,null,4257,93.600000000000009,398455.2]
[null,null,null,4258,93.600000000000009,398548.80000000005]
[null,null,null,4259,93.600000000000009,398642.4]
[null,null,null,4260,93.600000000000009,398736.00000000006]
[null,null,null,4261,93.600000000000009,{"$f":"E4278*D4278","v":398829.60000000003}]
[null,null,null,4262,93.600000000000009,398923.2]
[null,null,null,4263,93.600000000000009,399016.80000000005]
[null,null,null,4264,93.600000000000009,399110.40000000002]
[null,null,null,4265,93.600000000000009,399204.00000000006]
[null,null,null,4266,93.600000000000009,399297.60000000003]
[null,null,null,4267,93.600000000000009,399391.2]
[null,null,null,4268,93.600000000000009,399484.80000000005]
[null,null,null,4269,93.600000000000009,399578.4]
[null,null,null,4270,93.600000000000009,399672.00000000006]
[null,null,null,4271,93.600000000000009,399765.60000000003]
[null,null,null,4272,93.600000000000009,399859.20000000001]
[null,null,null,4273,93.600000000000009,399952.80000000005]
[null,null,null,4274,93.600000000000009,400046.4]
[null,null,null,4275,93.600000000000009,400140.00000000006]
[null,null,null,4276,93.600000000000009,400233.60000000003]
[null,null,null,4277,93.600000000000009,400327.2]
[null,null,null,4278,93.600000000000009,400420.80000000005]
[null,null,null,4279,93.600000000000009,400514.4]
[null,null,null,4280,93.600000000000009,400608.00000000006]
[null,null,null,4281,93.600000000000009,400701.60000000003]
[null,null,null,4282,93.600000000000009,400795.2]
[null,null,null,4283,93.600000000000009,400888.80000000005]
[null,null,null,4284,93.600000000000009,400982.4]
[null,null,null,4285,93.600000000000009,401076.00000000006]
[null,null,null,4286,93.600000000000009,401169.60000000003]
[null,null,null,4287,93.600000000000009,401263.2]
[null,null,null,4288,93.600000000000009,401356.80000000005]
[null,null,null,4289,93.600000000000009,401450.4]
[null,null,null,4290,93.600000000000009,401544.00000000006]
[null,null,null,4291,93.600000000000009,401637.60000000003]
[null,null,null,4292,93.600000000000009,401731.2]
[null,null,null,4293,93.600000000000009,401824.80000000005]
[null,null,null,4294,93.600000000000009,401918.4]
[null,null,null,4295,93.600000000000009,402012.00000000006]
[null,null,null,4296,93.600000000000009,402105.60000000003]
[null,null,null,4297,93.600000000000009,402199.2]
[null,null,null,4298,93.600000000000009,402292.80000000005]
[null,null,null,4299,93.600000000000009,402386.4]
[null,null,null,4300,93.600000000000009,402480.00000000006]
[null,null,null,4301,93.600000000000009,402573.60000000003]
[null,null,null,4302,93.600000000000009,402667.2]
[null,null,null,4303,93.600000000000009,402760.80000000005]
[null,null,null,4304,93.600000000000009,402854.40000000002]
[null,null,null,4305,93.600000000000009,402948.00000000006]
[null,null,null,4306,{"$f":"$E$13","v":93.600000000000009},403041.60000000003]
[null,null,null,4307,93.600000000000009,403135.2]
[null,null,null,4308,93.600000000000009,403228.80000000005]
[null,null,null,4309,93.600000000000009,403322.4]
[null,null,null,4310,93.600000000000009,403416.00000000006]
[null,null,null,4311,93.600000000000009,403509.60000000003]
[null,null,null,4312,93.600000000000009,403603.20000000001]
[null,null,null,4313,93.600000000000009,403696.80000000005]
[null,null,null,4314,93.600000000000009,403790.4]
[null,null,null,4315,93.600000000000009,403884.00000000006]
[null,null,null,4316,93.600000000000009,403977.60000000003]
[null,null,null,4317,93.600000000000009,404071.2]
[null,null,null,4318,93.600000000000009,404164.80000000005]
[null,null,null,4319,93.600000000000009,404258.4]
[null,null,null,4320,93.600000000000009,404352.00000000006]
[null,null,null,4321,93.600000000000009,404445.60000000003]
[null,null,null,4322,93.600000000000009,404539.2]
[null,null,null,4323,93.600000000000009,404632.80000000005]
[null,null,null,4324,93.600000000000009,404726.4]
[null,null,null,4325,93.600000000000009,{"$f":"E4342*D4342","v":404820.00000000006}]
[null,null,null,4326,93.600000000000009,404913.60000000003]
[null,null,null,4327,93.600000000000009,405007.2]
[null,null,null,4328,93.600000000000009,405100.80000000005]
[null,null,null,4329,93.600000000000009,405194.4]
[null,null,null,4330,93.600000000000009,405288.00000000006]
[null,null,null,4331,93.600000000000009,405381.60000000003]
[null,null,null,4332,93.600000000000009,405475.2]
[null,null,null,4333,93.600000000000009,405568.80000000005]
[null,null,null,4334,93.600000000000009,405662.4]
[null,null,null,4335,93.600000000000009,405756.00000000006]
[null,null,null,4336,93.600000000000009,405849.60000000003]
[null,null,null,4337,93.600000000000009,405943.2]
[null,null,null,4338,93.600000000000009,406036.80000000005]
[null,null,null,4339,93.600000000000009,406130.4]
[null,null,null,4340,93.600000000000009,406224.00000000006]
[null,null,null,4341,93.600000000000009,406317.60000000003]
[null,null,null,4342,93.600000000000009,406411.2]
[null,null,null,4343,93.600000000000009,406504.80000000005]
[null,null,null,4344,93.600000000000009,406598.40000000002]
[null,null,null,4345,93.600000000000009,406692.00000000006]
[null,null,null,4346,93.600000000000009,406785.60000000003]
[null,null,null,4347,93.600000000000009,406879.2]
[null,null,null,4348,93.600000000000009,406972.80000000005]
[null,null,null,4349,93.600000000000009,407066.4]
[null,null,null,4350,93.600000000000009,407160.00000000006]
[null,null,null,4351,93.600000000000009,407253.60000000003]
[null,null,null,4352,93.600000000000009,407347.20000000001]
[null,null,null,4353,93.600000000000009,407440.80000000005]
[null,null,null,4354,93.600000000000009,407534.4]
[null,null,null,4355,93.600000000000009,407628.00000000006]
[null,null,null,4356,93.600000000000009,407721.60000000003]
[null,null,null,4357,93.600000000000009,407815.2]
[null,null,null,4358,93.600000000000009,407908.80000000005]
[null,null,null,4359,93.600000000000009,408002.4]
[null,null,null,4360,93.600000000000009,408096.00000000006]
[null,null,null,4361,93.600000000000009,408189.60000000003]
[null,null,null,4362,93.600000000000009,408283.2]
[null,null,null,4363,93.600000000000009,408376.80000000005]
[null,null,null,4364,93.600000000000009,408470.4]
[null,null,null,4365,93.600000000000009,408564.00000000006]
[null,null,null,4366,93.600000000000009,408657.60000000003]
[null,null,null,4367,93.600000000000009,408751.2]
[null,null,null,4368,93.600000000000009,408844.80000000005]
[null,null,null,4369,93.600000000000009,408938.4]
[null,null,null,4370,{"$f":"$E$13","v":93.600000000000009},409032.00000000006]
[null,null,null,4371,93.600000000000009,409125.60000000003]
[null,null,null,4372,93.600000000000009,409219.2]
[null,null,null,4373,93.600000000000009,409312.80000000005]
[null,null,null,4374,93.600000000000009,409406.4]
[null,null,null,4375,93.600000000000009,409500.00000000006]
[null,null,null,4376,93.600000000000009,409593.60000000003]
[null,null,null,4377,93.600000000000009,409687.2]
[null,null,null,4378,93.600000000000009,409780.80000000005]
[null,null,null,4379,93.600000000000009,409874.4]
[null,null,null,4380,93.600000000000009,409968.00000000006]
[null,null,null,4381,93.600000000000009,410061.60000000003]
[null,null,null,4382,93.600000000000009,410155.2]
[null,null,null,4383,93.600000000000009,410248.80000000005]
[null,null,null,4384,93.600000000000009,410342.40000000002]
[null,null,null,4385,93.600000000000009,410436.00000000006]
[null,null,null,4386,93.600000000000009,410529.60000000003]
[null,null,null,4387,93.600000000000009,410623.2]
[null,null,null,4388,93.600000000000009,410716.80000000005]
[null,null,null,4389,93.600000000000009,{"$f":"E4406*D4406","v":410810.4}]
[null,null,null,4390,93.600000000000009,410904.00000000006]
[null,null,null,4391,93.600000000000009,410997.60000000003]
[null,null,null,4392,93.600000000000009,411091.20000000001]
[null,null,null,4393,93.600000000000009,411184.80000000005]
[null,null,null,4394,93.600000000000009,411278.4]
[null,null,null,4395,93.600000000000009,411372.00000000006]
[null,null,null,4396,93.600000000000009,411465.60000000003]
[null,null,null,4397,93.600000000000009,411559.2]
[null,null,null,4398,93.600000000000009,411652.80000000005]
[null,null,null,4399,93.600000000000009,411746.4]
[null,null,null,4400,93.600000000000009,411840.00000000006]
[null,null,null,4401,93.600000000000009,411933.60000000003]
[null,null,null,4402,93.600000000000009,412027.2]
[null,null,null,4403,93.600000000000009,412120.80000000005]
[null,null,null,4404,93.600000000000009,412214.4]
[null,null,null,4405,93.600000000000009,412308.00000000006]
[null,null,null,4406,93.600000000000009,412401.60000000003]
[null,null,null,4407,93.600000000000009,412495.2]
[null,null,null,4408,93.600000000000009,412588.80000000005]
[null,null,null,4409,93.600000000000009,412682.4]
[null,null,null,4410,93.600000000000009,412776.00000000006]
[null,null,null,4411,93.600000000000009,412869.60000000003]
[null,null,null,4412,93.600000000000009,412963.2]
[null,null,null,4413,93.600000000000009,413056.80000000005]
[null,null,null,4414,93.600000000000009,413150.4]
[null,null,null,4415,93.600000000000009,413244.00000000006]
[null,null,null,4416,93.600000000000009,413337.60000000003]
[null,null,null,4417,93.600000000000009,413431.2]
[null,null,null,4418,93.600000000000009,413524.80000000005]
[null,null,null,4419,93.600000000000009,413618.4]
[null,null,null,4420,93.600000000000009,413712.00000000006]
[null,null,null,4421,93.600000000000009,413805.60000000003]
[null,null,null,4422,93.600000000000009,413899.2]
[null,null,null,4423,93.600000000000009,413992.80000000005]
[null,null,null,4424,93.600000000000009,414086.40000000002]
[null,null,null,4425,93.600000000000009,414180.00000000006]
[null,null,null,4426,93.600000000000009,414273.60000000003]
[null,null,null,4427,93.600000000000009,414367.2]
[null,null,null,4428,93.600000000000009,414460.80000000005]
[null,null,null,4429,93.600000000000009,414554.4]
[null,null,null,4430,93.600000000000009,414648.00000000006]
[null,null,null,4431,93.600000000000009,414741.60000000003]
[null,null,null,4432,93.600000000000009,414835.20000000001]
[null,null,null,4433,93.600000000000009,414928.80000000005]
[null,null,null,4434,{"$f":"$E$13","v":93.600000000000009},415022.4]
[null,null,null,4435,93.600000000000009,415116.00000000006]
[null,null,null,4436,93.600000000000009,415209.60000000003]
[null,null,null,4437,93.600000000000009,415303.2]
[null,null,null,4438,93.600000000000009,415396.80000000005]
[null,null,null,4439,93.600000000000009,415490.4]
[null,null,null,4440,93.600000000000009,415584.00000000006]
[null,null,null,4441,93.600000000000009,415677.60000000003]
[null,null,null,4442,93.600000000000009,415771.2]
[null,null,null,4443,93.600000000000009,415864.80000000005]
[null,null,null,4444,93.600000000000009,415958.4]
[null,null,null,4445,93.600000000000009,416052.00000000006]
[null,null,null,4446,93.600000000000009,416145.60000000003]
[null,null,null,4447,93.600000000000009,416239.2]
[null,null,null,4448,93.600000000000009,416332.80000000005]
[null,null,null,4449,93.600000000000009,416426.4]
[null,null,null,4450,93.600000000000009,416520.00000000006]
[null,null,null,4451,93.600000000000009,416613.60000000003]
[null,null,null,4452,93.600000000000009,416707.2]
[null,null,null,4453,93.600000000000009,{"$f":"E4470*D4470","v":416800.80000000005}]
[null,null,null,4454,93.600000000000009,416894.4]
[null,null,null,4455,93.600000000000009,416988.00000000006]
[null,null,null,4456,93.600000000000009,417081.60000000003]
[null,null,null,4457,93.600000000000009,417175.2]
[null,null,null,4458,93.600000000000009,417268.80000000005]
[null,null,null,4459,93.600000000000009,417362.4]
[null,null,null,4460,93.600000000000009,417456.00000000006]
[null,null,null,4461,93.600000000000009,417549.60000000003]
[null,null,null,4462,93.600000000000009,417643.2]
[null,null,null,4463,93.600000000000009,417736.80000000005]
[null,null,null,4464,93.600000000000009,417830.40000000002]
[null,null,null,4465,93.600000000000009,417924.00000000006]
[null,null,null,4466,93.600000000000009,418017.60000000003]
[null,null,null,4467,93.600000000000009,418111.2]
[null,null,null,4468,93.600000000000009,418204.80000000005]
[null,null,null,4469,93.600000000000009,418298.4]
[null,null,null,4470,93.600000000000009,418392.00000000006]
[null,null,null,4471,93.600000000000009,418485.60000000003]
[null,null,null,4472,93.600000000000009,418579.20000000001]
[null,null,null,4473,93.600000000000009,418672.80000000005]
[null,null,null,4474,93.600000000000009,418766.4]
[null,null,null,4475,93.600000000000009,418860.00000000006]
[null,null,null,4476,93.600000000000009,418953.60000000003]
[null,null,null,4477,93.600000000000009,419047.2]
[null,null,null,4478,93.600000000000009,419140.80000000005]
[null,null,null,4479,93.600000000000009,419234.4]
[null,null,null,4480,93.600000000000009,419328.00000000006]
[null,null,null,4481,93.600000000000009,419421.60000000003]
[null,null,null,4482,93.600000000000009,419515.2]
[null,null,null,4483,93.600000000000009,419608.80000000005]
[null,null,null,4484,93.600000000000009,419702.4]
[null,null,null,4485,93.600000000000009,419796.00000000006]
[null,null,null,4486,93.600000000000009,419889.60000000003]
[null,null,null,4487,93.600000000000009,419983.2]
[null,null,null,4488,93.600000000000009,420076.80000000005]
[null,null,null,4489,93.600000000000009,420170.4]
[null,null,null,4490,93.600000000000009,420264.00000000006]
[null,null,null,4491,93.600000000000009,420357.60000000003]
[null,null,null,4492,93.600000000000009,420451.2]
[null,null,null,4493,93.600000000000009,420544.80000000005]
[null,null,null,4494,93.600000000000009,420638.4]
[null,null,null,4495,93.600000000000009,420732.00000000006]
[null,null,null,4496,93.600000000000009,420825.60000000003]
[null,null,null,4497,93.600000000000009,420919.2]
[null,null,null,4498,{"$f":"$E$13","v":93.600000000000009},421012.80000000005]
[null,null,null,4499,93.600000000000009,421106.4]
[null,null,null,4500,93.600000000000009,421200.00000000006]
[null,null,null,4501,93.600000000000009,421293.60000000003]
[null,null,null,4502,93.600000000000009,421387.2]
[null,null,null,4503,93.600000000000009,421480.80000000005]
[null,null,null,4504,93.600000000000009,421574.40000000002]
[null,null,null,4505,93.600000000000009,421668.00000000006]
[null,null,null,4506,93.600000000000009,421761.60000000003]
[null,null,null,4507,93.600000000000009,421855.2]
[null,null,null,4508,93.600000000000009,421948.80000000005]
[null,null,null,4509,93.600000000000009,422042.4]
[null,null,null,4510,93.600000000000009,422136.00000000006]
[null,null,null,4511,93.600000000000009,422229.60000000003]
[null,null,null,4512,93.600000000000009,422323.20000000001]
[null,null,null,4513,93.600000000000009,422416.80000000005]
[null,null,null,4514,93.600000000000009,422510.4]
[null,null,null,4515,93.600000000000009,422604.00000000006]
[null,null,null,4516,93.600000000000009,422697.60000000003]
[null,null,null,4517,93.600000000000009,{"$f":"E4534*D4534","v":422791.2}]
[null,null,null,4518,93.600000000000009,422884.80000000005]
[null,null,null,4519,93.600000000000009,422978.4]
[null,null,null,4520,93.600000000000009,423072.00000000006]
[null,null,null,4521,93.600000000000009,423165.60000000003]
[null,null,null,4522,93.600000000000009,423259.2]
[null,null,null,4523,93.600000000000009,423352.80000000005]
[null,null,null,4524,93.600000000000009,423446.4]
[null,null,null,4525,93.600000000000009,423540.00000000006]
[null,null,null,4526,93.600000000000009,423633.60000000003]
[null,null,null,4527,93.600000000000009,423727.2]
[null,null,null,4528,93.600000000000009,423820.80000000005]
[null,null,null,4529,93.600000000000009,423914.4]
[null,null,null,4530,93.600000000000009,424008.00000000006]
[null,null,null,4531,93.600000000000009,424101.60000000003]
[null,null,null,4532,93.600000000000009,424195.2]
[null,null,null,4533,93.600000000000009,424288.80000000005]
[null,null,null,4534,93.600000000000009,424382.4]
[null,null,null,4535,93.600000000000009,424476.00000000006]
[null,null,null,4536,93.600000000000009,424569.60000000003]
[null,null,null,4537,93.600000000000009,424663.2]
[null,null,null,4538,93.600000000000009,424756.80000000005]
[null,null,null,4539,93.600000000000009,424850.4]
[null,null,null,4540,93.600000000000009,424944.00000000006]
[null,null,null,4541,93.600000000000009,425037.60000000003]
[null,null,null,4542,93.600000000000009,425131.2]
[null,null,null,4543,93.600000000000009,425224.80000000005]
[null,null,null,4544,93.600000000000009,425318.40000000002]
[null,null,null,4545,93.600000000000009,425412.00000000006]
[null,null,null,4546,93.600000000000009,425505.60000000003]
[null,null,null,4547,93.600000000000009,425599.2]
[null,null,null,4548,93.600000000000009,425692.80000000005]
[null,null,null,4549,93.600000000000009,425786.4]
[null,null,null,4550,93.600000000000009,425880.00000000006]
[null,null,null,4551,93.600000000000009,425973.60000000003]
[null,null,null,4552,93.600000000000009,426067.20000000001]
[null,null,null,4553,93.600000000000009,426160.80000000005]
[null,null,null,4554,93.600000000000009,426254.4]
[null,null,null,4555,93.600000000000009,426348.00000000006]
[null,null,null,4556,93.600000000000009,426441.60000000003]
[null,null,null,4557,93.600000000000009,426535.2]
[null,null,null,4558,93.600000000000009,426628.80000000005]
[null,null,null,4559,93.600000000000009,426722.4]
[null,null,null,4560,93.600000000000009,426816.00000000006]
[null,null,null,4561,93.600000000000009,426909.60000000003]
[null,null,null,4562,{"$f":"$E$13","v":93.600000000000009},427003.2]
[null,null,null,4563,93.600000000000009,427096.80000000005]
[null,null,null,4564,93.600000000000009,427190.4]
[null,null,null,4565,93.600000000000009,427284.00000000006]
[null,null,null,4566,93.600000000000009,427377.60000000003]
[null,null,null,4567,93.600000000000009,427471.2]
[null,null,null,4568,93.600000000000009,427564.80000000005]
[null,null,null,4569,93.600000000000009,427658.4]
[null,null,null,4570,93.600000000000009,427752.00000000006]
[null,null,null,4571,93.600000000000009,427845.60000000003]
[null,null,null,4572,93.600000000000009,427939.2]
[null,null,null,4573,93.600000000000009,428032.80000000005]
[null,null,null,4574,93.600000000000009,428126.4]
[null,null,null,4575,93.600000000000009,428220.00000000006]
[null,null,null,4576,93.600000000000009,428313.60000000003]
[null,null,null,4577,93.600000000000009,428407.2]
[null,null,null,4578,93.600000000000009,428500.80000000005]
[null,null,null,4579,93.600000000000009,428594.4]
[null,null,null,4580,93.600000000000009,428688.00000000006]
[null,null,null,4581,93.600000000000009,{"$f":"E4598*D4598","v":428781.60000000003}]
[null,null,null,4582,93.600000000000009,428875.2]
[null,null,null,4583,93.600000000000009,428968.80000000005]
[null,null,null,4584,93.600000000000009,429062.40000000002]
[null,null,null,4585,93.600000000000009,429156.00000000006]
[null,null,null,4586,93.600000000000009,429249.60000000003]
[null,null,null,4587,93.600000000000009,429343.2]
[null,null,null,4588,93.600000000000009,429436.80000000005]
[null,null,null,4589,93.600000000000009,429530.4]
[null,null,null,4590,93.600000000000009,429624.00000000006]
[null,null,null,4591,93.600000000000009,429717.60000000003]
[null,null,null,4592,93.600000000000009,429811.20000000001]
[null,null,null,4593,93.600000000000009,429904.80000000005]
[null,null,null,4594,93.600000000000009,429998.4]
[null,null,null,4595,93.600000000000009,430092.00000000006]
[null,null,null,4596,93.600000000000009,430185.60000000003]
[null,null,null,4597,93.600000000000009,430279.2]
[null,null,null,4598,93.600000000000009,430372.80000000005]
[null,null,null,4599,93.600000000000009,430466.4]
[null,null,null,4600,93.600000000000009,430560.00000000006]
[null,null,null,4601,93.600000000000009,430653.60000000003]
[null,null,null,4602,93.600000000000009,430747.2]
[null,null,null,4603,93.600000000000009,430840.80000000005]
[null,null,null,4604,93.600000000000009,430934.4]
[null,null,null,4605,93.600000000000009,431028.00000000006]
[null,null,null,4606,93.600000000000009,431121.60000000003]
[null,null,null,4607,93.600000000000009,431215.2]
[null,null,null,4608,93.600000000000009,431308.80000000005]
[null,null,null,4609,93.600000000000009,431402.4]
[null,null,null,4610,93.600000000000009,431496.00000000006]
[null,null,null,4611,93.600000000000009,431589.60000000003]
[null,null,null,4612,93.600000000000009,431683.2]
[null,null,null,4613,93.600000000000009,431776.80000000005]
[null,null,null,4614,93.600000000000009,431870.4]
[null,null,null,4615,93.600000000000009,431964.00000000006]
[null,null,null,4616,93.600000000000009,432057.60000000003]
[null,null,null,4617,93.600000000000009,432151.2]
[null,null,null,4618,93.600000000000009,432244.80000000005]
[null,null,null,4619,93.600000000000009,432338.4]
[null,null,null,4620,93.600000000000009,432432.00000000006]
[null,null,null,4621,93.600000000000009,432525.60000000003]
[null,null,null,4622,93.600000000000009,432619.2]
[null,null,null,4623,93.600000000000009,432712.80000000005]
[null,null,null,4624,93.600000000000009,432806.40000000002]
[null,null,null,4625,93.600000000000009,432900.00000000006]
[null,null,null,4626,{"$f":"$E$13","v":93.600000000000009},432993.60000000003]
[null,null,null,4627,93.600000000000009,433087.2]
[null,null,null,4628,93.600000000000009,433180.80000000005]
[null,null,null,4629,93.600000000000009,433274.4]
[null,null,null,4630,93.600000000000009,433368.00000000006]
[null,null,null,4631,93.600000000000009,433461.60000000003]
[null,null,null,4632,93.600000000000009,433555.20000000001]
[null,null,null,4633,93.600000000000009,433648.80000000005]
[null,null,null,4634,93.600000000000009,433742.4]
[null,null,null,4635,93.600000000000009,433836.00000000006]
[null,null,null,4636,93.600000000000009,433929.60000000003]
[null,null,null,4637,93.600000000000009,434023.2]
[null,null,null,4638,93.600000000000009,434116.80000000005]
[null,null,null,4639,93.600000000000009,434210.4]
[null,null,null,4640,93.600000000000009,434304.00000000006]
[null,null,null,4641,93.600000000000009,434397.60000000003]
[null,null,null,4642,93.600000000000009,434491.2]
[null,null,null,4643,93.600000000000009,434584.80000000005]
[null,null,null,4644,93.600000000000009,434678.4]
[null,null,null,4645,93.600000000000009,{"$f":"E4662*D4662","v":434772.00000000006}]
[null,null,null,4646,93.600000000000009,434865.60000000003]
[null,null,null,4647,93.600000000000009,434959.2]
[null,null,null,4648,93.600000000000009,435052.80000000005]
[null,null,null,4649,93.600000000000009,435146.4]
[null,null,null,4650,93.600000000000009,435240.00000000006]
[null,null,null,4651,93.600000000000009,435333.60000000003]
[null,null,null,4652,93.600000000000009,435427.2]
[null,null,null,4653,93.600000000000009,435520.80000000005]
[null,null,null,4654,93.600000000000009,435614.4]
[null,null,null,4655,93.600000000000009,435708.00000000006]
[null,null,null,4656,93.600000000000009,435801.60000000003]
[null,null,null,4657,93.600000000000009,435895.2]
[null,null,null,4658,93.600000000000009,435988.80000000005]
[null,null,null,4659,93.600000000000009,436082.4]
[null,null,null,4660,93.600000000000009,436176.00000000006]
[null,null,null,4661,93.600000000000009,436269.60000000003]
[null,null,null,4662,93.600000000000009,436363.2]
[null,null,null,4663,93.600000000000009,436456.80000000005]
[null,null,null,4664,93.600000000000009,436550.40000000002]
[null,null,null,4665,93.600000000000009,436644.00000000006]
[null,null,null,4666,93.600000000000009,436737.60000000003]
[null,null,null,4667,93.600000000000009,436831.2]
[null,null,null,4668,93.600000000000009,436924.80000000005]
[null,null,null,4669,93.600000000000009,437018.4]
[null,null,null,4670,93.600000000000009,437112.00000000006]
[null,null,null,4671,93.600000000000009,437205.60000000003]
[null,null,null,4672,93.600000000000009,437299.20000000001]
[null,null,null,4673,93.600000000000009,437392.80000000005]
[null,null,null,4674,93.600000000000009,437486.4]
[null,null,null,4675,93.600000000000009,437580.00000000006]
[null,null,null,4676,93.600000000000009,437673.60000000003]
[null,null,null,4677,93.600000000000009,437767.2]
[null,null,null,4678,93.600000000000009,437860.80000000005]
[null,null,null,4679,93.600000000000009,437954.4]
[null,null,null,4680,93.600000000000009,438048.00000000006]
[null,null,null,4681,93.600000000000009,438141.60000000003]
[null,null,null,4682,93.600000000000009,438235.2]
[null,null,null,4683,93.600000000000009,438328.80000000005]
[null,null,null,4684,93.600000000000009,438422.4]
[null,null,null,4685,93.600000000000009,438516.00000000006]
[null,null,null,4686,93.600000000000009,438609.60000000003]
[null,null,null,4687,93.600000000000009,438703.2]
[null,null,null,4688,93.600000000000009,438796.80000000005]
[null,null,null,4689,93.600000000000009,438890.4]
[null,null,null,4690,{"$f":"$E$13","v":93.600000000000009},438984.00000000006]
[null,null,null,4691,93.600000000000009,439077.60000000003]
[null,null,null,4692,93.600000000000009,439171.2]
[null,null,null,4693,93.600000000000009,439264.80000000005]
[null,null,null,4694,93.600000000000009,439358.4]
[null,null,null,4695,93.600000000000009,439452.00000000006]
[null,null,null,4696,93.600000000000009,439545.60000000003]
[null,null,null,4697,93.600000000000009,439639.2]
[null,null,null,4698,93.600000000000009,439732.80000000005]
[null,null,null,4699,93.600000000000009,439826.4]
[null,null,null,4700,93.600000000000009,439920.00000000006]
[null,null,null,4701,93.600000000000009,440013.60000000003]
[null,null,null,4702,93.600000000000009,440107.2]
[null,null,null,4703,93.600000000000009,440200.80000000005]
[null,null,null,4704,93.600000000000009,440294.40000000002]
[null,null,null,4705,93.600000000000009,440388.00000000006]
[null,null,null,4706,93.600000000000009,440481.60000000003]
[null,null,null,4707,93.600000000000009,440575.2]
[null,null,null,4708,93.600000000000009,440668.80000000005]
[null,null,null,4709,93.600000000000009,{"$f":"E4726*D4726","v":440762.4}]
[null,null,null,4710,93.600000000000009,440856.00000000006]
[null,null,null,4711,93.600000000000009,440949.60000000003]
[null,null,null,4712,93.600000000000009,441043.20000000001]
[null,null,null,4713,93.600000000000009,441136.80000000005]
[null,null,null,4714,93.600000000000009,441230.4]
[null,null,null,4715,93.600000000000009,441324.00000000006]
[null,null,null,4716,93.600000000000009,441417.60000000003]
[null,null,null,4717,93.600000000000009,441511.2]
[null,null,null,4718,93.600000000000009,441604.80000000005]
[null,null,null,4719,93.600000000000009,441698.4]
[null,null,null,4720,93.600000000000009,441792.00000000006]
[null,null,null,4721,93.600000000000009,441885.60000000003]
[null,null,null,4722,93.600000000000009,441979.2]
[null,null,null,4723,93.600000000000009,442072.80000000005]
[null,null,null,4724,93.600000000000009,442166.4]
[null,null,null,4725,93.600000000000009,442260.00000000006]
[null,null,null,4726,93.600000000000009,442353.60000000003]
[null,null,null,4727,93.600000000000009,442447.2]
[null,null,null,4728,93.600000000000009,442540.80000000005]
[null,null,null,4729,93.600000000000009,442634.4]
[null,null,null,4730,93.600000000000009,442728.00000000006]
[null,null,null,4731,93.600000000000009,442821.60000000003]
[null,null,null,4732,93.600000000000009,442915.2]
[null,null,null,4733,93.600000000000009,443008.80000000005]
[null,null,null,4734,93.600000000000009,443102.4]
[null,null,null,4735,93.600000000000009,443196.00000000006]
[null,null,null,4736,93.600000000000009,443289.60000000003]
[null,null,null,4737,93.600000000000009,443383.2]
[null,null,null,4738,93.600000000000009,443476.80000000005]
[null,null,null,4739,93.600000000000009,443570.4]
[null,null,null,4740,93.600000000000009,443664.00000000006]
[null,null,null,4741,93.600000000000009,443757.60000000003]
[null,null,null,4742,93.600000000000009,443851.2]
[null,null,null,4743,93.600000000000009,443944.80000000005]
[null,null,null,4744,93.600000000000009,444038.40000000002]
[null,null,null,4745,93.600000000000009,444132.00000000006]
[null,null,null,4746,93.600000000000009,444225.60000000003]
[null,null,null,4747,93.600000000000009,444319.2]
[null,null,null,4748,93.600000000000009,444412.80000000005]
[null,null,null,4749,93.600000000000009,444506.4]
[null,null,null,4750,93.600000000000009,444600.00000000006]
[null,null,null,4751,93.600000000000009,444693.60000000003]
[null,null,null,4752,93.600000000000009,444787.20000000001]
[null,null,null,4753,93.600000000000009,444880.80000000005]
[null,null,null,4754,{"$f":"$E$13","v":93.600000000000009},444974.4]
[null,null,null,4755,93.600000000000009,445068.00000000006]
[null,null,null,4756,93.600000000000009,445161.60000000003]
[null,null,null,4757,93.600000000000009,445255.2]
[null,null,null,4758,93.600000000000009,445348.80000000005]
[null,null,null,4759,93.600000000000009,445442.4]
[null,null,null,4760,93.600000000000009,445536.00000000006]
[null,null,null,4761,93.600000000000009,445629.60000000003]
[null,null,null,4762,93.600000000000009,445723.2]
[null,null,null,4763,93.600000000000009,445816.80000000005]
[null,null,null,4764,93.600000000000009,445910.4]
[null,null,null,4765,93.600000000000009,446004.00000000006]
[null,null,null,4766,93.600000000000009,446097.60000000003]
[null,null,null,4767,93.600000000000009,446191.2]
[null,null,null,4768,93.600000000000009,446284.80000000005]
[null,null,null,4769,93.600000000000009,446378.4]
[null,null,null,4770,93.600000000000009,446472.00000000006]
[null,null,null,4771,93.600000000000009,446565.60000000003]
[null,null,null,4772,93.600000000000009,446659.2]
[null,null,null,4773,93.600000000000009,{"$f":"E4790*D4790","v":446752.80000000005}]
[null,null,null,4774,93.600000000000009,446846.4]
[null,null,null,4775,93.600000000000009,446940.00000000006]
[null,null,null,4776,93.600000000000009,447033.60000000003]
[null,null,null,4777,93.600000000000009,447127.20000000007]
[null,null,null,4778,93.600000000000009,447220.80000000005]
[null,null,null,4779,93.600000000000009,447314.4]
[null,null,null,4780,93.600000000000009,447408.00000000006]
[null,null,null,4781,93.600000000000009,447501.60000000003]
[null,null,null,4782,93.600000000000009,447595.20000000007]
[null,null,null,4783,93.600000000000009,447688.80000000005]
[null,null,null,4784,93.600000000000009,447782.40000000002]
[null,null,null,4785,93.600000000000009,447876.00000000006]
[null,null,null,4786,93.600000000000009,447969.60000000003]
[null,null,null,4787,93.600000000000009,448063.20000000007]
[null,null,null,4788,93.600000000000009,448156.80000000005]
[null,null,null,4789,93.600000000000009,448250.4]
[null,null,null,4790,93.600000000000009,448344.00000000006]
[null,null,null,4791,93.600000000000009,448437.60000000003]
[null,null,null,4792,93.600000000000009,448531.20000000007]
[null,null,null,4793,93.600000000000009,448624.80000000005]
[null,null,null,4794,93.600000000000009,448718.4]
[null,null,null,4795,93.600000000000009,448812.00000000006]
[null,null,null,4796,93.600000000000009,448905.60000000003]
[null,null,null,4797,93.600000000000009,448999.20000000007]
[null,null,null,4798,93.600000000000009,449092.80000000005]
[null,null,null,4799,93.600000000000009,449186.4]
[null,null,null,4800,93.600000000000009,449280.00000000006]
[null,null,null,4801,93.600000000000009,449373.60000000003]
[null,null,null,4802,93.600000000000009,449467.20000000007]
[null,null,null,4803,93.600000000000009,449560.80000000005]
[null,null,null,4804,93.600000000000009,449654.4]
[null,null,null,4805,93.600000000000009,449748.00000000006]
[null,null,null,4806,93.600000000000009,449841.60000000003]
[null,null,null,4807,93.600000000000009,449935.20000000007]
[null,null,null,4808,93.600000000000009,450028.80000000005]
[null,null,null,4809,93.600000000000009,450122.4]
[null,null,null,4810,93.600000000000009,450216.00000000006]
[null,null,null,4811,93.600000000000009,450309.60000000003]
[null,null,null,4812,93.600000000000009,450403.20000000007]
[null,null,null,4813,93.600000000000009,450496.80000000005]
[null,null,null,4814,93.600000000000009,450590.4]
[null,null,null,4815,93.600000000000009,450684.00000000006]
[null,null,null,4816,93.600000000000009,450777.60000000003]
[null,null,null,4817,93.600000000000009,450871.20000000007]
[null,null,null,4818,{"$f":"$E$13","v":93.600000000000009},450964.80000000005]
[null,null,null,4819,93.600000000000009,451058.4]
[null,null,null,4820,93.600000000000009,451152.00000000006]
[null,null,null,4821,93.600000000000009,451245.60000000003]
[null,null,null,4822,93.600000000000009,451339.20000000007]
[null,null,null,4823,93.600000000000009,451432.80000000005]
[null,null,null,4824,93.600000000000009,451526.40000000002]
[null,null,null,4825,93.600000000000009,451620.00000000006]
[null,null,null,4826,93.600000000000009,451713.60000000003]
[null,null,null,4827,93.600000000000009,451807.20000000007]
[null,null,null,4828,93.600000000000009,451900.80000000005]
[null,null,null,4829,93.600000000000009,451994.4]
[null,null,null,4830,93.600000000000009,452088.00000000006]
[null,null,null,4831,93.600000000000009,452181.60000000003]
[null,null,null,4832,93.600000000000009,452275.20000000007]
[null,null,null,4833,93.600000000000009,452368.80000000005]
[null,null,null,4834,93.600000000000009,452462.4]
[null,null,null,4835,93.600000000000009,452556.00000000006]
[null,null,null,4836,93.600000000000009,452649.60000000003]
[null,null,null,4837,93.600000000000009,{"$f":"E4854*D4854","v":452743.20000000007}]
[null,null,null,4838,93.600000000000009,452836.80000000005]
[null,null,null,4839,93.600000000000009,452930.4]
[null,null,null,4840,93.600000000000009,453024.00000000006]
[null,null,null,4841,93.600000000000009,453117.60000000003]
[null,null,null,4842,93.600000000000009,453211.20000000007]
[null,null,null,4843,93.600000000000009,453304.80000000005]
[null,null,null,4844,93.600000000000009,453398.4]
[null,null,null,4845,93.600000000000009,453492.00000000006]
[null,null,null,4846,93.600000000000009,453585.60000000003]
[null,null,null,4847,93.600000000000009,453679.20000000007]
[null,null,null,4848,93.600000000000009,453772.80000000005]
[null,null,null,4849,93.600000000000009,453866.4]
[null,null,null,4850,93.600000000000009,453960.00000000006]
[null,null,null,4851,93.600000000000009,454053.60000000003]
[null,null,null,4852,93.600000000000009,454147.20000000007]
[null,null,null,4853,93.600000000000009,454240.80000000005]
[null,null,null,4854,93.600000000000009,454334.4]
[null,null,null,4855,93.600000000000009,454428.00000000006]
[null,null,null,4856,93.600000000000009,454521.60000000003]
[null,null,null,4857,93.600000000000009,454615.20000000007]
[null,null,null,4858,93.600000000000009,454708.80000000005]
[null,null,null,4859,93.600000000000009,454802.4]
[null,null,null,4860,93.600000000000009,454896.00000000006]
[null,null,null,4861,93.600000000000009,454989.60000000003]
[null,null,null,4862,93.600000000000009,455083.20000000007]
[null,null,null,4863,93.600000000000009,455176.80000000005]
[null,null,null,4864,93.600000000000009,455270.40000000002]
[null,null,null,4865,93.600000000000009,455364.00000000006]
[null,null,null,4866,93.600000000000009,455457.60000000003]
[null,null,null,4867,93.600000000000009,455551.20000000007]
[null,null,null,4868,93.600000000000009,455644.80000000005]
[null,null,null,4869,93.600000000000009,455738.4]
[null,null,null,4870,93.600000000000009,455832.00000000006]
[null,null,null,4871,93.600000000000009,455925.60000000003]
[null,null,null,4872,93.600000000000009,456019.20000000007]
[null,null,null,4873,93.600000000000009,456112.80000000005]
[null,null,null,4874,93.600000000000009,456206.4]
[null,null,null,4875,93.600000000000009,456300.00000000006]
[null,null,null,4876,93.600000000000009,456393.60000000003]
[null,null,null,4877,93.600000000000009,456487.20000000007]
[null,null,null,4878,93.600000000000009,456580.80000000005]
[null,null,null,4879,93.600000000000009,456674.4]
[null,null,null,4880,93.600000000000009,456768.00000000006]
[null,null,null,4881,93.600000000000009,456861.60000000003]
[null,null,null,4882,{"$f":"$E$13","v":93.600000000000009},456955.20000000007]
[null,null,null,4883,93.600000000000009,457048.80000000005]
[null,null,null,4884,93.600000000000009,457142.4]
[null,null,null,4885,93.600000000000009,457236.00000000006]
[null,null,null,4886,93.600000000000009,457329.60000000003]
[null,null,null,4887,93.600000000000009,457423.20000000007]
[null,null,null,4888,93.600000000000009,457516.80000000005]
[null,null,null,4889,93.600000000000009,457610.4]
[null,null,null,4890,93.600000000000009,457704.00000000006]
[null,null,null,4891,93.600000000000009,457797.60000000003]
[null,null,null,4892,93.600000000000009,457891.20000000007]
[null,null,null,4893,93.600000000000009,457984.80000000005]
[null,null,null,4894,93.600000000000009,458078.4]
[null,null,null,4895,93.600000000000009,458172.00000000006]
[null,null,null,4896,93.600000000000009,458265.60000000003]
[null,null,null,4897,93.600000000000009,458359.20000000007]
[null,null,null,4898,93.600000000000009,458452.80000000005]
[null,null,null,4899,93.600000000000009,458546.4]
[null,null,null,4900,93.600000000000009,458640.00000000006]
[null,null,null,4901,93.600000000000009,{"$f":"E4918*D4918","v":458733.60000000003}]
[null,null,null,4902,93.600000000000009,458827.20000000007]
[null,null,null,4903,93.600000000000009,458920.80000000005]
[null,null,null,4904,93.600000000000009,459014.40000000002]
[null,null,null,4905,93.600000000000009,459108.00000000006]
[null,null,null,4906,93.600000000000009,459201.60000000003]
[null,null,null,4907,93.600000000000009,459295.20000000007]
[null,null,null,4908,93.600000000000009,459388.80000000005]
[null,null,null,4909,93.600000000000009,459482.4]
[null,null,null,4910,93.600000000000009,459576.00000000006]
[null,null,null,4911,93.600000000000009,459669.60000000003]
[null,null,null,4912,93.600000000000009,459763.20000000007]
[null,null,null,4913,93.600000000000009,459856.80000000005]
[null,null,null,4914,93.600000000000009,459950.4]
[null,null,null,4915,93.600000000000009,460044.00000000006]
[null,null,null,4916,93.600000000000009,460137.60000000003]
[null,null,null,4917,93.600000000000009,460231.20000000007]
[null,null,null,4918,93.600000000000009,460324.80000000005]
[null,null,null,4919,93.600000000000009,460418.4]
[null,null,null,4920,93.600000000000009,460512.00000000006]
[null,null,null,4921,93.600000000000009,460605.60000000003]
[null,null,null,4922,93.600000000000009,460699.20000000007]
[null,null,null,4923,93.600000000000009,460792.80000000005]
[null,null,null,4924,93.600000000000009,460886.4]
[null,null,null,4925,93.600000000000009,460980.00000000006]
[null,null,null,4926,93.600000000000009,461073.60000000003]
[null,null,null,4927,93.600000000000009,461167.20000000007]
[null,null,null,4928,93.600000000000009,461260.80000000005]
[null,null,null,4929,93.600000000000009,461354.4]
[null,null,null,4930,93.600000000000009,461448.00000000006]
[null,null,null,4931,93.600000000000009,461541.60000000003]
[null,null,null,4932,93.600000000000009,461635.20000000007]
[null,null,null,4933,93.600000000000009,461728.80000000005]
[null,null,null,4934,93.600000000000009,461822.4]
[null,null,null,4935,93.600000000000009,461916.00000000006]
[null,null,null,4936,93.600000000000009,462009.60000000003]
[null,null,null,4937,93.600000000000009,462103.20000000007]
[null,null,null,4938,93.600000000000009,462196.80000000005]
[null,null,null,4939,93.600000000000009,462290.4]
[null,null,null,4940,93.600000000000009,462384.00000000006]
[null,null,null,4941,93.600000000000009,462477.60000000003]
[null,null,null,4942,93.600000000000009,462571.20000000007]
[null,null,null,4943,93.600000000000009,462664.80000000005]
[null,null,null,4944,93.600000000000009,462758.40000000002]
[null,null,null,4945,93.600000000000009,462852.00000000006]
[null,null,null,4946,{"$f":"$E$13","v":93.600000000000009},462945.60000000003]
[null,null,null,4947,93.600000000000009,463039.20000000007]
[null,null,null,4948,93.600000000000009,463132.80000000005]
[null,null,null,4949,93.600000000000009,463226.4]
[null,null,null,4950,93.600000000000009,463320.00000000006]
[null,null,null,4951,93.600000000000009,463413.60000000003]
[null,null,null,4952,93.600000000000009,463507.20000000007]
[null,null,null,4953,93.600000000000009,463600.80000000005]
[null,null,null,4954,93.600000000000009,463694.4]
[null,null,null,4955,93.600000000000009,463788.00000000006]
[null,null,null,4956,93.600000000000009,463881.60000000003]
[null,null,null,4957,93.600000000000009,463975.20000000007]
[null,null,null,4958,93.600000000000009,464068.80000000005]
[null,null,null,4959,93.600000000000009,464162.4]
[null,null,null,4960,93.600000000000009,464256.00000000006]
[null,null,null,4961,93.600000000000009,464349.60000000003]
[null,null,null,4962,93.600000000000009,464443.20000000007]
[null,null,null,4963,93.600000000000009,464536.80000000005]
[null,null,null,4964,93.600000000000009,464630.4]
[null,null,null,4965,93.600000000000009,{"$f":"E4982*D4982","v":464724.00000000006}]
[null,null,null,4966,93.600000000000009,464817.60000000003]
[null,null,null,4967,93.600000000000009,464911.20000000007]
[null,null,null,4968,93.600000000000009,465004.80000000005]
[null,null,null,4969,93.600000000000009,465098.4]
[null,null,null,4970,93.600000000000009,465192.00000000006]
[null,null,null,4971,93.600000000000009,465285.60000000003]
[null,null,null,4972,93.600000000000009,465379.20000000007]
[null,null,null,4973,93.600000000000009,465472.80000000005]
[null,null,null,4974,93.600000000000009,465566.4]
[null,null,null,4975,93.600000000000009,465660.00000000006]
[null,null,null,4976,93.600000000000009,465753.60000000003]
[null,null,null,4977,93.600000000000009,465847.20000000007]
[null,null,null,4978,93.600000000000009,465940.80000000005]
[null,null,null,4979,93.600000000000009,466034.4]
[null,null,null,4980,93.600000000000009,466128.00000000006]
[null,null,null,4981,93.600000000000009,466221.60000000003]
[null,null,null,4982,93.600000000000009,466315.20000000007]
[null,null,null,4983,93.600000000000009,466408.80000000005]
[null,null,null,4984,93.600000000000009,466502.40000000002]
[null,null,null,4985,93.600000000000009,466596.00000000006]
[null,null,null,4986,93.600000000000009,466689.60000000003]
[null,null,null,4987,93.600000000000009,466783.20000000007]
[null,null,null,4988,93.600000000000009,466876.80000000005]
[null,null,null,4989,93.600000000000009,466970.4]
[null,null,null,4990,93.600000000000009,467064.00000000006]
[null,null,null,4991,93.600000000000009,467157.60000000003]
[null,null,null,4992,93.600000000000009,467251.20000000007]
[null,null,null,4993,93.600000000000009,467344.80000000005]
[null,null,null,4994,93.600000000000009,467438.4]
[null,null,null,4995,93.600000000000009,467532.00000000006]
[null,null,null,4996,93.600000000000009,467625.60000000003]
[null,null,null,4997,93.600000000000009,467719.20000000007]
[null,null,null,4998,93.600000000000009,467812.80000000005]
[null,null,null,4999,93.600000000000009,467906.4]
[null,null,null,5000,93.600000000000009,468000.00000000006]
[]
[null,null,null,null,{"$f":"AVERAGE(E117:E5017)","v":101.72148541112931}]

{"sheet":"Equipment Rent - Purchase","index":9,"n_rows":171,"n_cols":24,"rows_kept":171,"cut":false,"hidden":false,"merged":[[49,23,49,24],[127,0,127,8],[129,0,129,8],[92,0,92,8],[93,0,93,8],[97,0,97,8],[98,0,98,8],[99,0,99,8],[125,0,125,7],[126,0,126,7],[94,0,94,8],[95,0,95,8],[96,0,96,8],[120,0,120,8],[91,0,91,8],[82,0,82,7],[132,0,132,8],[133,0,133,8],[134,0,134,8],[135,0,135,8],[130,0,130,8],[131,0,131,8],[136,0,136,8],[170,0,170,8],[142,0,142,8],[168,0,168,7],[169,0,169,7],[137,0,137,8],[138,0,138,8],[139,0,139,8],[140,0,140,8],[141,0,141,8],[163,0,163,8],[88,0,88,8],[90,0,90,8],[89,0,89,8],[77,0,77,8],[51,0,51,8],[52,0,52,8],[53,0,53,8],[54,0,54,8],[55,0,55,8],[83,0,83,7],[86,0,86,8],[87,0,87,8],[84,0,84,8],[56,0,56,8],[50,0,50,8],[34,0,34,8],[43,0,43,8],[44,0,44,8],[45,0,45,8],[46,0,46,8],[47,0,47,8],[48,0,48,8],[49,0,49,8],[41,0,41,8],[0,0,0,8],[1,0,1,8],[2,0,2,8],[40,0,40,7],[39,0,39,7],[3,0,3,8],[11,0,11,8],[13,0,13,8],[5,0,5,8],[6,0,6,8],[7,0,7,8],[8,0,8,8],[10,0,10,8],[4,0,4,8],[9,0,9,8],[12,0,12,8]]}
["PART 5.C"]
["EQUIPMENT RENTAL/PURCHASE SUPPLEMENTARY SHEET"]
["Check Event:"]
["1.    This form should include all charges for outside rentals, contractor-owned rental equipment, and purchased equipment."]
["2.    Treatment Units – Must provide a completed Treatment System Tracking Form (Part 7) & Purchase Agreement Form (Part 8)."]
["3.    Claims for rental of vehicles are not reimbursable."]
["4.    Do not address the RAC markup on this page.  Indicate the markup on the Miscellaneous Supplementary Sheet."]
["5.    (No. of Units) X (Rental Rate) X (Hours Used At Site) = Total"]
["6.   Weekly rate goes into effect when equipment is used at a site for more than three days in a week (Monday – Sunday) .  Daily "]
["      rates are based on an 8-hour day.  Equipment rental costs for more or less than an 8-hour day must be prorated."]
["7.   Equipment charges for work activities included in unit pricing should not be included on this form."]
["8.   Rental rates for contractor owned equipment are addressed in Appendix B, Table 2 of the Cost Control Guidance Document."]
["9.   The rating of the following equipment must be provided:  air compressor – cfm, backhoe – bucket size, dump truck – yard "]
["      capacity, trackhoe – horsepower, vacuum truck - horsepower."]
["ITEM\nDESCRIPTION","EQUIPMENT\nRATING \n(See note 9)","RAC\nINVOICE\nNO.","OUTSIDE\nINVOICE\nNO.","DATES\nEQUIPMENT \nUSED","RENTAL \nRATES","UNITS","TIME USED ","TOTAL",null,null,null,"Total",null,"Sheet total"]
[null,null,null,null,null,{"$f":"(IF(A16>0,INDEX($U$17:$W$62,MATCH(A16&\" \"&B16,$T$17:$T$62,0),MATCH(G16,$U$16:$W$16,0)),\"\"))","v":""},null,null,{"$f":"ROUND((SUM(F16)*H16),2)","v":0},null,"Emergency/Initial Work   ",false,{"$f":"IF(L16=TRUE,$I$40,\"\")","v":""},"Emergency/Initial Work   ",{"$f":"SUM(M16,M59,M102,M145)","v":0},null,null,null,null,"Equipment","Hr","Day","Wky"]
[null,null,null,null,null,{"$f":"(IF(A17>0,INDEX($U$17:$W$62,MATCH(A17&\" \"&B17,$T$17:$T$62,0),MATCH(G17,$U$16:$W$16,0)),\"\"))","v":""},null,null,{"$f":"ROUND((SUM(F17)*H17),2)","v":0},null,"Investigation Work      ",false,{"$f":"IF(L17=TRUE,$I$40,\"\")","v":""},"Investigation Work      ",{"$f":"SUM(M17,M60,M103,M146)","v":0},"Air Compressor","100 cfm - 249 cfm","250 cfm - 375 cfm",null,"Air Compressor 100 cfm - 249 cfm",6.5,52,156]
[null,null,null,null,null,"",null,null,0,null,"Monitoring/Interim Work    ",false,"","Monitoring/Interim Work    ",{"$f":"SUM(M18,M61,M104,M147)","v":0},"BackHoe","Up to 36\" Bucket","36\"&above Bucket",null,"Air Compressor 250 cfm - 375 cfm",9.75,78,234]
[null,null,null,null,null,"",null,null,0,null,"Corrective Action Plan Work",false,"","Corrective Action Plan Work",{"$f":"SUM(M19,M62,M105,M148)","v":0},"Bobcat Skid Steer Loader",null,null,null,"BackHoe Up to 36\" Bucket",35.75,286,858]
[null,null,null,null,null,"",null,null,0,null,null,null,null,null,null,"Bobcat Front Endloader w/ Breaker",null,null,null,"BackHoe 36\"&above Bucket",45.94,367.5,1102.5]
[null,null,null,null,null,"",null,null,0,null,"Emergency/Initial Work   ",{"$f":"IF(L16=TRUE,1,\"\")","v":""},null,null,null,"Bulldozer",null,null,null,{"$f":"P19&\" \"&Q19","v":"Bobcat Skid Steer Loader "},23.4,187.2,561.6]
[null,null,null,null,null,"",null,null,0,null,"Investigation Work      ",{"$f":"IF(L17=TRUE,2,\"\")","v":""},null,null,null,"Combustible Gas Indicator",null,null,null,"Bobcat Front Endloader w/ Breaker ",23.4,187.2,561.6]
[null,null,null,null,null,"",null,null,0,null,"Monitoring/Interim Work    ",{"$f":"IF(L18=TRUE,3,\"\")","v":""},null,null,null,"Compactor",null,null,null,"Bulldozer ",85.16,681.2,2043.6]
[null,null,null,null,null,"",null,null,0,null,"Corrective Action Plan Work",{"$f":"IF(L19=TRUE,4,\"\")","v":""},null,null,null,"Concrete Core Drill",null,null,null,"Combustible Gas Indicator ",3.9,31.2,93.6]
[null,null,null,null,null,"",null,null,0,null,null,null,null,null,null,"Crane Truck",null,null,null,"Compactor ",29.26,234,702]
[null,null,null,null,null,"",null,null,0,null,null,null,null,null,null,"Data Logger",null,null,null,"Concrete Core Drill ",7,56.16,168.5]
[null,null,null,null,null,"",null,null,0,null,null,null,null,null,null,"Digital Manometer",null,null,null,"Crane Truck ",46.8,374.4,1123.2]
[null,null,null,null,null,"",null,null,0,null,null,null,null,null,null,"Dissolved Oxygen Meter",null,null,null,"Data Logger ",19.5,156,468]
[null,null,null,null,null,"",null,null,0,null,null,null,null,null,null,"Dump Truck","7-10 yards","11-20 yards","over 20 yards","Digital Manometer ",1.96,15.6,46.8]
[null,null,null,null,null,"",null,null,0,null,null,null,null,null,null,"Electric Generator",null,null,null,"Dissolved Oxygen Meter ",3.26,26,78]
[null,null,null,null,null,"",null,null,0,null,null,null,null,null,null,"Excavators",null,null,null,"Dump Truck 7-10 yards",31.2,0,0]
[null,null,null,null,null,"",null,null,0,null,null,null,null,null,null,"Explosimeter*",null,null,null,"Dump Truck 11-20 yards",41.6,0,0]
[null,null,null,null,null,"",null,null,0,null,null,null,null,null,null,"Gas Detector*",null,null,null,"Dump Truck over 20 yards",52,0,0]
[null,null,null,null,null,"",null,null,0,null,null,null,null,null,null,"Gooseneck Trailer",null,null,null,{"$f":"P30&\" \"&Q30","v":"Electric Generator "},6.5,52,156]
["USE SPACE BELOW FOR EQUIPMENT NOT LISTED ABOVE",null,null,null,null,null,null,null,null,null,null,null,null,null,null,"Hydrocarbon Analyser FID",null,null,null,"Excavators ",78,624,1872]
[null,null,null,null,null,null,null,null,{"$f":"ROUND((SUM(F36)*H36),2)","v":0},null,null,null,null,null,null,"Hydrocarbon Analyser PID",null,null,null,"Explosimeter* ",3.9,31.2,93.6]
[null,null,null,null,null,null,null,null,0,null,null,null,null,null,null,"Hydrocarbon Analyser HNU",null,null,null,"Gas Detector* ",3.26,26,78]
[null,null,null,null,null,null,null,null,0,null,null,null,null,null,null,"Hydrocarbon Analyser OVA",null,null,null,"Gooseneck Trailer ",13,104,312]
[null,null,null,null,null,null,null,null,0,null,{"$f":"IF(L16=TRUE,$O$16,IF(L17=TRUE,$O$17,IF(L18=TRUE,$O$18,IF(L19=TRUE,$O$19,0))))","v":0},null,null,null,null,"Hydrocarbon Analyser TVA",null,null,null,"Hydrocarbon Analyser FID ",9.76,78,234]
["SUBTOTAL OF THIS PAGE",null,null,null,null,null,null,null,{"$f":"SUM(I16:I39)","v":0},null,null,null,null,null,null,"Jackhammer",null,null,null,"Hydrocarbon Analyser PID ",9.76,78,234]
["TOTAL EQUIPMENT COSTS",null,null,null,null,null,null,null,{"$f":"SUM(I40)","v":0},null,{"$f":"IF(I41>0,1,0)","v":0},null,null,null,null,"Lowboy Trailer (includes Truck)",null,null,null,"Hydrocarbon Analyser HNU ",9.76,78,234]
["Page          of           (Equipment Rental/Purchase Supplementary Sheet)",null,null,null,null,null,null,null,null,null,null,null,null,null,null,"Oil/Water Interface Probe*",null,null,null,"Hydrocarbon Analyser OVA ",9.76,78,234]
[null,null,null,null,null,null,null,null,null,null,null,null,null,null,null,"pH Conductivity Meter*",null,null,null,"Hydrocarbon Analyser TVA ",9.76,78,234]
["PART 5.C",null,null,null,null,null,null,null,null,null,null,null,null,null,null,"Portable Gas Chromatography",null,null,null,"Jackhammer ",3.9,31.2,93.6]
["EQUIPMENT RENTAL/PURCHASE SUPPLEMENTARY SHEET",null,null,null,null,null,null,null,null,null,null,null,null,null,null,"Pumps",null,null,null,"Lowboy Trailer (includes Truck) ",23.4,187.2,561.6]
["Check Event:",null,null,null,null,null,null,null,null,null,null,null,null,null,null,"Soil/Water holding container",null,null,null,"Oil/Water Interface Probe* ",4.5599999999999996,36.4,109.2]
["1.    This form should include all charges for outside rentals, contractor-owned rental equipment, and purchased equipment.",null,null,null,null,null,null,null,null,null,null,null,null,null,null,"Temperature Probe*",null,null,null,"pH Conductivity Meter* ",3.26,26,78]
["2.    Treatment Units – Must provide a completed Treatment System Tracking Form (Part 7) & Purchase Agreement Form (Part 8).",null,null,null,null,null,null,null,null,null,null,null,null,null,null,"Thermal Anemometer*",null,null,null,"Portable Gas Chromatography ",19.5,156,468]
["3.    Claims for rental of vehicles are not reimbursable.",null,null,null,null,null,null,null,null,null,null,null,null,null,null,"Tiller (hand)",null,null,null,{"$f":"P45&\" \"&Q45","v":"Pumps "},3.9,31.2,93.6]
["4.    Do not address the RAC markup on this page.  Indicate the markup on the Miscellaneous Supplementary Sheet.",null,null,null,null,null,null,null,null,null,null,null,null,null,null,"Tiller (Rotary w/ Slip Clutch)",null,null,null,{"$f":"P46&\" \"&Q46","v":"Soil/Water holding container "},8.4600000000000009,67.599999999999994,291.2,"out of order"]
["5.    (No. of Units) X (Rental Rate) X (Hours Used At Site) = Total",null,null,null,null,null,null,null,null,null,null,null,null,null,null,"Trackhoe","0-200HP","over 200HP",null,{"$f":"P47&\" \"&Q47","v":"Temperature Probe* "},1.96,15.6,46.8]
["6.   Weekly rate goes into effect when equipment is used at a site for more than three days in a week (Monday – Sunday) .  Daily ",null,null,null,null,null,null,null,null,null,null,null,null,null,null,"Tractor With Trailer",null,null,null,"Thermal Anemometer* ",1.96,15.6,46.8]
["      rates are based on an 8-hour day.  Equipment rental costs for more or less than an 8-hour day must be prorated.",null,null,null,null,null,null,null,null,null,null,null,null,null,null,"Transducer",null,null,null,"Tiller (hand) ",3.26,26,78]
["7.   Equipment charges for work activities included in unit pricing should not be included on this form.",null,null,null,null,null,null,null,null,null,null,null,null,null,null,"Vacuum Truck","0-39HP","40-150HP","over 150HP","Tiller (Rotary w/ Slip Clutch) ",9.76,78,234]
["8.   Rental rates for contractor owned equipment are addressed in Appendix B, Table 2 of the Cost Control Guidance Document.",null,null,null,null,null,null,null,null,null,null,null,null,null,null,"Water Level Indicator*",null,null,null,"Trackhoe 0-200HP",66.3,530.4,1591.2]
["9.   The rating of the following equipment must be provided:  air Compressor – cfm, backhoe – bucket size, dump truck – yard ",null,null,null,null,null,null,null,null,null,null,null,null,null,null,null,null,null,null,"Trackhoe over 200HP",132.6,1060.8,3182.4]
["      capacity, trackhoe – horsepower, vacuum truck - horsepower.",null,null,null,null,null,null,null,null,null,null,null,null,null,null,null,null,null,null,{"$f":"P52&\" \"&Q52","v":"Tractor With Trailer "},33.159999999999997,265.2,795.6]
["ITEM\nDESCRIPTION","EQUIPMENT\nRATING \n(See note 9)","RAC\nINVOICE\nNO.","OUTSIDE\nINVOICE\nNO.","DATES\nEQUIPMENT \nUSED","RENTAL \nRATES","UNITS","TIME USED ","TOTAL",null,null,null,"Total",null,null,null,null,null,null,{"$f":"P53&\" \"&Q53","v":"Transducer "},26,208,624]
[null,null,null,null,null,{"$f":"(IF(A59>0,INDEX($U$17:$W$62,MATCH(A59&\" \"&B59,$T$17:$T$62,0),MATCH(G59,$U$16:$W$16,0)),\"\"))","v":""},null,null,{"$f":"ROUND((SUM(F59)*H59),2)","v":0},null,"Emergency/Initial Work   ",false,{"$f":"IF(L59=TRUE,$I$83,\"\")","v":""},null,null,null,null,null,null,"Vacuum Truck 0-39HP",88.4,707.2,2121.6]
[null,null,null,null,null,{"$f":"(IF(A60>0,INDEX($U$17:$W$62,MATCH(A60&\" \"&B60,$T$17:$T$62,0),MATCH(G60,$U$16:$W$16,0)),\"\"))","v":""},null,null,0,null,"Investigation Work      ",false,{"$f":"IF(L60=TRUE,$I$83,\"\")","v":""},null,null,null,null,null,null,"Vacuum Truck 40-150HP",114.4,915.2,2745.6]
[null,null,null,null,null,"",null,null,0,null,"Monitoring/Interim Work    ",false,"",null,null,null,null,null,null,"Vacuum Truck over 150HP",159.9,1279.2,3837.6]
[null,null,null,null,null,"",null,null,0,null,"Corrective Action Plan Work",false,"",null,null,null,null,null,null,{"$f":"P55&\" \"&Q55","v":"Water Level Indicator* "},1.96,15.6,46.8]
[null,null,null,null,null,"",null,null,0]
[null,null,null,null,null,"",null,null,0,null,"Emergency/Initial Work   ",{"$f":"IF(L59=TRUE,1,\"\")","v":""}]
[null,null,null,null,null,"",null,null,0,null,"Investigation Work      ",{"$f":"IF(L60=TRUE,2,\"\")","v":""}]
[null,null,null,null,null,"",null,null,0,null,"Monitoring/Interim Work    ",{"$f":"IF(L61=TRUE,3,\"\")","v":""}]
[null,null,null,null,null,"",null,null,0,null,"Corrective Action Plan Work",{"$f":"IF(L62=TRUE,4,\"\")","v":""}]
[null,null,null,null,null,"",null,null,0]
[null,null,null,null,null,"",null,null,0]
[null,null,null,null,null,"",null,null,0]
[null,null,null,null,null,"",null,null,0]
[null,null,null,null,null,"",null,null,0]
[null,null,null,null,null,"",null,null,0]
[null,null,null,null,null,"",null,null,0]
[null,null,null,null,null,"",null,null,0]
[null,null,null,null,null,"",null,null,0]
[null,null,null,null,null,"",null,null,0]
["USE SPACE BELOW FOR EQUIPMENT NOT LISTED ABOVE"]
[null,null,null,null,null,null,null,null,{"$f":"ROUND((SUM(F79)*H79),2)","v":0}]
[null,null,null,null,null,null,null,null,0]
[null,null,null,null,null,null,null,null,0]
[null,null,null,null,null,null,null,null,0,null,{"$f":"IF(L59=TRUE,$O$16,IF(L60=TRUE,$O$17,IF(L61=TRUE,$O$18,IF(L62=TRUE,$O$19,0))))","v":0}]
["SUBTOTAL OF THIS PAGE",null,null,null,null,null,null,null,{"$f":"SUM(I59:I82)","v":0}]
["TOTAL EQUIPMENT COSTS",null,null,null,null,null,null,null,{"$f":"SUM(I83)","v":0},null,{"$f":"IF(I84>0,1,0)","v":0}]
["Page          of           (Equipment Rental/Purchase Supplementary Sheet)"]
[]
["PART 5.C"]
["EQUIPMENT RENTAL/PURCHASE SUPPLEMENTARY SHEET"]
["Check Event:"]
["1.    This form should include all charges for outside rentals, contractor-owned rental equipment, and purchased equipment."]
["2.    Treatment Units – Must provide a completed Treatment System Tracking Form (Part 7) & Purchase Agreement Form (Part 8)."]
["3.    Claims for rental of vehicles are not reimbursable."]
["4.    Do not address the RAC markup on this page.  Indicate the markup on the Miscellaneous Supplementary Sheet."]
["5.    (No. of Units) X (Rental Rate) X (Hours Used At Site) = Total"]
["6.   Weekly rate goes into effect when equipment is used at a site for more than three days in a week (Monday – Sunday) .  Daily "]
["      rates are based on an 8-hour day.  Equipment rental costs for more or less than an 8-hour day must be prorated."]
["7.   Equipment charges for work activities included in unit pricing should not be included on this form."]
["8.   Rental rates for contractor owned equipment are addressed in Appendix B, Table 2 of the Cost Control Guidance Document."]
["9.   The rating of the following equipment must be provided:  air Compressor – cfm, backhoe – bucket size, dump truck – yard "]
["      capacity, trackhoe – horsepower, vacuum truck - horsepower."]
["ITEM\nDESCRIPTION","EQUIPMENT\nRATING \n(See note 9)","RAC\nINVOICE\nNO.","OUTSIDE\nINVOICE\nNO.","DATES\nEQUIPMENT \nUSED","RENTAL \nRATES","UNITS","TIME USED ","TOTAL",null,null,null,"Total"]
[null,null,null,null,null,{"$f":"(IF(A102>0,INDEX($U$17:$W$62,MATCH(A102&\" \"&B102,$T$17:$T$62,0),MATCH(G102,$U$16:$W$16,0)),\"\"))","v":""},null,null,{"$f":"ROUND((SUM(F102)*H102),2)","v":0},null,"Emergency/Initial Work   ",false,{"$f":"IF(L102=TRUE,$I$126,\"\")","v":""}]
[null,null,null,null,null,{"$f":"(IF(A103>0,INDEX($U$17:$W$62,MATCH(A103&\" \"&B103,$T$17:$T$62,0),MATCH(G103,$U$16:$W$16,0)),\"\"))","v":""},null,null,0,null,"Investigation Work      ",false,{"$f":"IF(L103=TRUE,$I$126,\"\")","v":""}]
[null,null,null,null,null,"",null,null,0,null,"Monitoring/Interim Work    ",false,""]
[null,null,null,null,null,"",null,null,0,null,"Corrective Action Plan Work",false,""]
[null,null,null,null,null,"",null,null,0]
[null,null,null,null,null,"",null,null,0,null,"Emergency/Initial Work   ",{"$f":"IF(L102=TRUE,1,\"\")","v":""}]
[null,null,null,null,null,"",null,null,0,null,"Investigation Work      ",{"$f":"IF(L103=TRUE,2,\"\")","v":""}]
[null,null,null,null,null,"",null,null,0,null,"Monitoring/Interim Work    ",{"$f":"IF(L104=TRUE,3,\"\")","v":""}]
[null,null,null,null,null,"",null,null,0,null,"Corrective Action Plan Work",{"$f":"IF(L105=TRUE,4,\"\")","v":""}]
[null,null,null,null,null,"",null,null,0]
[null,null,null,null,null,"",null,null,0]
[null,null,null,null,null,"",null,null,0]
[null,null,null,null,null,"",null,null,0]
[null,null,null,null,null,"",null,null,0]
[null,null,null,null,null,"",null,null,0]
[null,null,null,null,null,"",null,null,0]
[null,null,null,null,null,"",null,null,0]
[null,null,null,null,null,"",null,null,0]
[null,null,null,null,null,"",null,null,0]
["USE SPACE BELOW FOR EQUIPMENT NOT LISTED ABOVE"]
[null,null,null,null,null,null,null,null,{"$f":"ROUND((SUM(F122)*H122),2)","v":0}]
[null,null,null,null,null,null,null,null,0]
[null,null,null,null,null,null,null,null,0]
[null,null,null,null,null,null,null,null,0,null,{"$f":"IF(L102=TRUE,$O$16,IF(L103=TRUE,$O$17,IF(L104=TRUE,$O$18,IF(L105=TRUE,$O$19,0))))","v":0}]
["SUBTOTAL OF THIS PAGE",null,null,null,null,null,null,null,{"$f":"SUM(I102:I125)","v":0}]
["TOTAL EQUIPMENT COSTS",null,null,null,null,null,null,null,{"$f":"SUM(I126)","v":0},null,{"$f":"IF(I127>0,1,0)","v":0}]
["Page          of           (Equipment Rental/Purchase Supplementary Sheet)"]
[]
["PART 5.C"]
["EQUIPMENT RENTAL/PURCHASE SUPPLEMENTARY SHEET"]
["Check Event:"]
["1.    This form should include all charges for outside rentals, contractor-owned rental equipment, and purchased equipment."]
["2.    Treatment Units – Must provide a completed Treatment System Tracking Form (Part 7) & Purchase Agreement Form (Part 8)."]
["3.    Claims for rental of vehicles are not reimbursable."]
["4.    Do not address the RAC markup on this page.  Indicate the markup on the Miscellaneous Supplementary Sheet."]
["5.    (No. of Units) X (Rental Rate) X (Hours Used At Site) = Total"]
["6.   Weekly rate goes into effect when equipment is used at a site for more than three days in a week (Monday – Sunday) .  Daily "]
["      rates are based on an 8-hour day.  Equipment rental costs for more or less than an 8-hour day must be prorated."]
["7.   Equipment charges for work activities included in unit pricing should not be included on this form."]
["8.   Rental rates for contractor owned equipment are addressed in Appendix B, Table 2 of the Cost Control Guidance Document."]
["9.   The rating of the following equipment must be provided:  air Compressor – cfm, backhoe – bucket size, dump truck – yard "]
["      capacity, trackhoe – horsepower, vacuum truck - horsepower."]
["ITEM\nDESCRIPTION","EQUIPMENT\nRATING \n(See note 9)","RAC\nINVOICE\nNO.","OUTSIDE\nINVOICE\nNO.","DATES\nEQUIPMENT \nUSED","RENTAL \nRATES","UNITS","TIME USED ","TOTAL",null,null,null,"Total"]
[null,null,null,null,null,{"$f":"(IF(A145>0,INDEX($U$17:$W$62,MATCH(A145&\" \"&B145,$T$17:$T$62,0),MATCH(G145,$U$16:$W$16,0)),\"\"))","v":""},null,null,{"$f":"ROUND((SUM(F145)*H145),2)","v":0},null,"Emergency/Initial Work   ",false,{"$f":"IF(L145=TRUE,$I$169,\"\")","v":""}]
[null,null,null,null,null,{"$f":"(IF(A146>0,INDEX($U$17:$W$62,MATCH(A146&\" \"&B146,$T$17:$T$62,0),MATCH(G146,$U$16:$W$16,0)),\"\"))","v":""},null,null,0,null,"Investigation Work      ",false,{"$f":"IF(L146=TRUE,$I$169,\"\")","v":""}]
[null,null,null,null,null,"",null,null,0,null,"Monitoring/Interim Work    ",false,""]
[null,null,null,null,null,"",null,null,0,null,"Corrective Action Plan Work",false,""]
[null,null,null,null,null,"",null,null,0]
[null,null,null,null,null,"",null,null,0,null,"Emergency/Initial Work   ",{"$f":"IF(L145=TRUE,1,\"\")","v":""}]
[null,null,null,null,null,"",null,null,0,null,"Investigation Work      ",{"$f":"IF(L146=TRUE,2,\"\")","v":""}]
[null,null,null,null,null,"",null,null,0,null,"Monitoring/Interim Work    ",{"$f":"IF(L147=TRUE,3,\"\")","v":""}]
[null,null,null,null,null,"",null,null,0,null,"Corrective Action Plan Work",{"$f":"IF(L148=TRUE,4,\"\")","v":""}]
[null,null,null,null,null,"",null,null,0]
[null,null,null,null,null,"",null,null,0]
[null,null,null,null,null,"",null,null,0]
[null,null,null,null,null,"",null,null,0]
[null,null,null,null,null,"",null,null,0]
[null,null,null,null,null,"",null,null,0]
[null,null,null,null,null,"",null,null,0]
[null,null,null,null,null,"",null,null,0]
[null,null,null,null,null,"",null,null,0]
[null,null,null,null,null,"",null,null,0]
["USE SPACE BELOW FOR EQUIPMENT NOT LISTED ABOVE"]
[null,null,null,null,null,null,null,null,{"$f":"ROUND((SUM(F165)*H165),2)","v":0}]
[null,null,null,null,null,null,null,null,0]
[null,null,null,null,null,null,null,null,0]
[null,null,null,null,null,null,null,null,0,null,{"$f":"IF(L145=TRUE,$O$16,IF(L146=TRUE,$O$17,IF(L147=TRUE,$O$18,IF(L148=TRUE,$O$19,0))))","v":0}]
["SUBTOTAL OF THIS PAGE",null,null,null,null,null,null,null,{"$f":"SUM(I145:I168)","v":0}]
["TOTAL EQUIPMENT COSTS",null,null,null,null,null,null,null,{"$f":"SUM(I169)","v":0},null,{"$f":"IF(I170>0,1,0)","v":0}]
["Page          of           (Equipment Rental/Purchase Supplementary Sheet)"]

{"sheet":"Hotel & Food","index":10,"n_rows":223,"n_cols":13,"rows_kept":223,"cut":false,"hidden":false,"merged":[[222,0,222,3],[196,0,196,6],[197,0,197,6],[198,0,198,1],[198,2,198,6],[199,0,199,1],[199,2,199,6],[191,0,191,6],[192,0,192,6],[193,0,193,6],[194,0,194,6],[195,0,195,6],[203,0,203,6],[204,0,204,6],[205,0,205,6],[206,0,206,6],[221,0,221,5],[200,0,200,1],[200,2,200,6],[201,0,201,1],[201,2,201,6],[202,0,202,1],[202,2,202,6],[186,0,186,6],[187,0,187,6],[188,0,188,6],[189,0,189,6],[190,0,190,6],[180,0,180,6],[181,0,181,6],[182,0,182,6],[183,0,183,6],[184,0,184,6],[177,0,177,3],[153,0,153,1],[153,2,153,6],[154,0,154,1],[154,2,154,6],[155,0,155,1],[155,2,155,6],[148,0,148,6],[149,0,149,6],[150,0,150,6],[151,0,151,6],[152,0,152,6],[159,0,159,6],[160,0,160,6],[161,0,161,6],[176,0,176,5],[156,0,156,1],[156,2,156,6],[157,0,157,1],[157,2,157,6],[158,0,158,6],[143,0,143,6],[144,0,144,6],[145,0,145,6],[146,0,146,6],[147,0,147,6],[137,0,137,6],[138,0,138,6],[139,0,139,6],[141,0,141,6],[142,0,142,6],[116,0,116,6],[131,0,131,5],[135,0,135,6],[136,0,136,6],[112,0,112,1],[112,2,112,6],[113,0,113,6],[114,0,114,6],[115,0,115,6],[132,0,132,3],[109,0,109,1],[109,2,109,6],[110,0,110,1],[110,2,110,6],[111,0,111,1],[111,2,111,6],[105,0,105,6],[106,0,106,6],[107,0,107,6],[108,0,108,1],[108,2,108,6],[100,0,100,6],[101,0,101,6],[102,0,102,6],[103,0,103,6],[104,0,104,6],[94,0,94,6],[96,0,96,6],[97,0,97,6],[98,0,98,6],[99,0,99,6],[90,0,90,6],[91,0,91,6],[92,0,92,6],[93,0,93,6],[68,0,68,6],[69,0,69,6],[70,0,70,6],[71,0,71,6],[86,0,86,5],[87,0,87,3],[65,0,65,1],[65,2,65,6],[66,0,66,1],[66,2,66,6],[67,0,67,1],[67,2,67,6],[61,0,61,6],[62,0,62,6],[63,0,63,1],[63,2,63,6],[64,0,64,1],[64,2,64,6],[56,0,56,6],[57,0,57,6],[58,0,58,6],[59,0,59,6],[60,0,60,6],[51,0,51,6],[52,0,52,6],[53,0,53,6],[54,0,54,6],[55,0,55,6],[45,0,45,6],[46,0,46,6],[47,0,47,6],[48,0,48,6],[49,0,49,6],[23,0,23,6],[25,0,25,6],[24,0,24,6],[26,0,26,6],[41,0,41,5],[42,0,42,3],[22,0,22,1],[20,2,20,6],[21,2,21,6],[22,2,22,6],[18,0,18,1],[19,0,19,1],[18,2,18,6],[19,2,19,6],[4,0,4,6],[8,0,8,6],[10,0,10,6],[11,0,11,6],[13,0,13,6],[14,0,14,6],[15,0,15,6],[6,0,6,6],[20,0,20,1],[17,0,17,6],[0,0,0,6],[1,0,1,6],[2,0,2,6],[16,0,16,6],[7,0,7,6],[9,0,9,6],[12,0,12,6],[3,0,3,6],[21,0,21,1]]}
["PART 5.D (1)"]
["TRAVEL SUPPLEMENTARY SHEET"]
["Check Event:"]
[]
["LODGING/MEALS"]
[]
["1.    Overnight stay is allowed for any continuous site work such as multiple site visits, treatment system installation, drilling/P&A "]
["       wells, geoprobe work, over-excavation, soil treatment or multiple vacuum events of at least 6 hour."]
["2.   Prior approval from the Trust Fund Management should be obtained for overnight stay for work other than that "]
["      specifically identified in #1, above."]
["3.   Meals are only reimbursable when overnight stay is required."]
["4.   Claims for hotel charges must be accompanied by legible receipts indicating names of persons staying in a room.  Do not "]
["      provide charge card receipts.  Names can not be added after the receipt is generated."]
["5.   No RAC markup allowed"]
["6.   Single site visits:  (Hotel Charges) + (Meal Charges) = Total"]
["7.   Multiple site visits:  [(Hotel Charges) + (Meal Charges)] ÷ (No. Of Sites Visited) = Total"]
["8.   Airfares, toll charges, and taxi charges are not reimbursable."]
["9.  Travel charge for work activities addressed in unit pricing should not be addressed on this form."]
["RATES",null,"CURRENT MAXIMUM RATES"]
["Meals - Statewide",null,"$30/day "]
["Meals - New Orleans",null,"$35/day"]
["Hotel - Statewide",null,"$100/night (plus tax)"]
["Hotel - New Orleans",null,"$150/night (plus tax)"]
["Required Information- Check below the reason charges for overnight stay or meals are being requested:"]
[]
[]
["                                                                                                                                                                                              ."]
["LAST\nNAME OF\nPERSON","RAC\nINVOICE\nNO.","DATE(S)\nTRAVELED","HOTEL\nCHARGES","MEAL\nCHARGES","NO. OF\nSITES\nVISITED","TOTAL",null,null,null,"total",null,"Sheet total"]
[null,null,null,null,null,null,{"$f":"ROUND(IF(F29=0,SUM(D29+E29),((D29+E29)/F29)),2)","v":0},null,"Emergency/Initial Work   ",false,{"$f":"IF(J29=TRUE,$G$42,\"\")","v":""},"Emergency/Initial Work   ",{"$f":"SUM(K29,K74,K119,K164,K209)","v":0}]
[null,null,null,null,null,null,{"$f":"ROUND(IF(F30=0,SUM(D30+E30),((D30+E30)/F30)),2)","v":0},null,"Investigation Work      ",false,{"$f":"IF(J30=TRUE,$G$42,\"\")","v":""},"Investigation Work      ",{"$f":"SUM(K30,K75,K120,K165,K210)","v":0}]
[null,null,null,null,null,null,0,null,"Monitoring/Interim Work        ",false,"","Monitoring/Interim Work        ",{"$f":"SUM(K31,K76,K121,K166,K211)","v":0}]
[null,null,null,null,null,null,0,null,"Corrective Action Plan Work",false,"","Corrective Action Plan Work",{"$f":"SUM(K32,K77,K122,K167,K212)","v":0}]
[null,null,null,null,null,null,0,null,"Report Preparation ",false,"","Report Preparation ",{"$f":"SUM(K33,K78,K123,K168,K213)","v":0}]
[null,null,null,null,null,null,0,null,"Emergency/Initial Work   ",{"$f":"IF(J29=TRUE,1,\"\")","v":""}]
[null,null,null,null,null,null,0,null,"Investigation Work      ",{"$f":"IF(J30=TRUE,2,\"\")","v":""}]
[null,null,null,null,null,null,0,null,"Monitoring/Interim Work        ",{"$f":"IF(J31=TRUE,3,\"\")","v":""}]
[null,null,null,null,null,null,0,null,"Corrective Action Plan Work",{"$f":"IF(J32=TRUE,4,\"\")","v":""}]
[null,null,null,null,null,null,0,null,"Report Preparation ",{"$f":"IF(J33=TRUE,5,\"\")","v":""}]
[null,null,null,null,null,null,0]
[null,null,null,null,null,null,0]
[null,null,null,null,null,null,0,null,{"$f":"IF(J29=TRUE,$M$29,IF(J30=TRUE,$M$30,IF(J31=TRUE,$M$31,IF(J32=TRUE,$M$32,IF(J33=TRUE,$M$33,0)))))","v":0}]
["SUBTOTAL OF THIS PAGE",null,null,null,null,null,{"$f":"SUM(G29:G41)","v":0},null,{"$f":"SUM(I41)","v":0},{"$f":"IF(I42>1,1,0)","v":0}]
["Page              of               (Travel Supplementary Sheet)"]
[]
[]
["PART 5.D (1)"]
["TRAVEL SUPPLEMENTARY SHEET"]
["Check Event:"]
[]
["LODGING/MEALS"]
[]
["1.    Overnight stay is allowed for any continuous site work such as multiple site visits, treatment system installation, drilling/P&A "]
["       wells, geoprobe work, over-excavation, soil treatment or at least 6 hour vacuum events."]
["2.   Prior approval from the Trust Fund Management should be obtained for overnight stay for work other than that "]
["      specifically identified in #1, above."]
["3.   Meals are only reimbursable when overnight stay is required."]
["4.   Claims for hotel charges must be accompanied by legible receipts indicating names of persons staying in a room.  Do not "]
["      provide charge card receipts.  Names can not be added after the receipt is generated."]
["5.   No RAC markup allowed"]
["6.   Single site visits:  (Hotel Charges) + (Meal Charges) = Total"]
["7.   Multiple site visits:  [(Hotel Charges) + (Meal Charges)] ÷ (No. Of Sites Visited) = Total"]
["8.   Airfares, toll charges, and taxi charges are not reimbursable."]
["9.  Travel charge for work activities addressed in unit pricing should not be addressed on this form."]
["RATES",null,"4/1/2012 MAXIMUM RATES"]
["Meals - Statewide",null,"$30/day "]
["Meals - New Orleans",null,"$35/day"]
["Hotel - Statewide",null,"$100/night (plus tax)"]
["Hotel - New Orleans",null,"$150/night (plus tax)"]
["Required Information- Check below the reason charges for overnight stay or meals are being requested:"]
[]
[]
["                                                                                                                                                                                              ."]
["LAST\nNAME OF\nPERSON","RAC\nINVOICE\nNO.","DATE(S)\nTRAVELED","HOTEL\nCHARGES","TOTAL\nMEAL\nCHARGES","NO. OF\nSITES\nVISITED","TOTAL",null,null,null,"total"]
[null,null,null,null,null,null,{"$f":"ROUND(IF(F74=0,SUM(D74+E74),((D74+E74)/F74)),2)","v":0},null,"Emergency/Initial Work   ",false,{"$f":"IF(J74=TRUE,$G$87,\"\")","v":""}]
[null,null,null,null,null,null,{"$f":"ROUND(IF(F75=0,SUM(D75+E75),((D75+E75)/F75)),2)","v":0},null,"Investigation Work      ",false,{"$f":"IF(J75=TRUE,$G$87,\"\")","v":""}]
[null,null,null,null,null,null,0,null,"Monitoring/Interim Work        ",false,""]
[null,null,null,null,null,null,0,null,"Corrective Action Plan Work",false,""]
[null,null,null,null,null,null,0,null,"Report Preparation ",false,""]
[null,null,null,null,null,null,0,null,"Emergency/Initial Work   ",{"$f":"IF(J74=TRUE,1,\"\")","v":""}]
[null,null,null,null,null,null,0,null,"Investigation Work      ",{"$f":"IF(J75=TRUE,2,\"\")","v":""}]
[null,null,null,null,null,null,0,null,"Monitoring/Interim Work        ",{"$f":"IF(J76=TRUE,3,\"\")","v":""}]
[null,null,null,null,null,null,0,null,"Corrective Action Plan Work",{"$f":"IF(J77=TRUE,4,\"\")","v":""}]
[null,null,null,null,null,null,0,null,"Report Preparation ",{"$f":"IF(J78=TRUE,5,\"\")","v":""}]
[null,null,null,null,null,null,0]
[null,null,null,null,null,null,0]
[null,null,null,null,null,null,0,null,{"$f":"IF(J74=TRUE,$M$29,IF(J75=TRUE,$M$30,IF(J76=TRUE,$M$31,IF(J77=TRUE,$M$32,IF(J78=TRUE,$M$33,0)))))","v":0}]
["SUBTOTAL OF THIS PAGE",null,null,null,null,null,{"$f":"SUM(G74:G86)","v":0},null,{"$f":"SUM(I86)","v":0},{"$f":"IF(I87>1,1,0)","v":0}]
["Page              of               (Travel Supplementary Sheet)"]
[]
[]
["PART 5.D (1)"]
["TRAVEL SUPPLEMENTARY SHEET"]
["Check Event:"]
[]
["LODGING/MEALS"]
[]
["1.    Overnight stay is allowed for any continuous site work such as multiple site visits, treatment system installation, drilling/P&A "]
["       wells, geoprobe work, over-excavation, soil treatment or at least 6 hour vacuum events."]
["2.   Prior approval from the Trust Fund Management should be obtained for overnight stay for work other than that "]
["      specifically identified in #1, above."]
["3.   Meals are only reimbursable when overnight stay is required."]
["4.   Claims for hotel charges must be accompanied by legible receipts indicating names of persons staying in a room.  Do not "]
["      provide charge card receipts.  Names can not be added after the receipt is generated."]
["5.   No RAC markup allowed"]
["6.   Single site visits:  (Hotel Charges) + (Meal Charges) = Total"]
["7.   Multiple site visits:  [(Hotel Charges) + (Meal Charges)] ÷ (No. Of Sites Visited) = Total"]
["8.   Airfares, toll charges, and taxi charges are not reimbursable."]
["9.  Travel charge for work activities addressed in unit pricing should not be addressed on this form."]
["RATES",null,"4/1/2012 MAXIMUM RATES"]
["Meals - Statewide",null,"$30/day "]
["Meals - New Orleans",null,"$35/day"]
["Hotel - Statewide",null,"$100/night (plus tax)"]
["Hotel - New Orleans",null,"$150/night (plus tax)"]
["Required Information- Check below the reason charges for overnight stay or meals are being requested:"]
[]
[]
["                                                                                                                                                                                              ."]
["LAST\nNAME OF\nPERSON","RAC\nINVOICE\nNO.","DATE(S)\nTRAVELED","HOTEL\nCHARGES","TOTAL\nMEAL\nCHARGES","NO. OF\nSITES\nVISITED","TOTAL",null,null,null,"total"]
[null,null,null,null,null,null,{"$f":"ROUND(IF(F119=0,SUM(D119+E119),((D119+E119)/F119)),2)","v":0},null,"Emergency/Initial Work   ",false,{"$f":"IF(J119=TRUE,$G$132,\"\")","v":""}]
[null,null,null,null,null,null,{"$f":"ROUND(IF(F120=0,SUM(D120+E120),((D120+E120)/F120)),2)","v":0},null,"Investigation Work      ",false,{"$f":"IF(J120=TRUE,$G$132,\"\")","v":""}]
[null,null,null,null,null,null,0,null,"Monitoring/Interim Work        ",false,""]
[null,null,null,null,null,null,0,null,"Corrective Action Plan Work",false,""]
[null,null,null,null,null,null,0,null,"Report Preparation ",false,""]
[null,null,null,null,null,null,0,null,"Emergency/Initial Work   ",{"$f":"IF(J119=TRUE,1,\"\")","v":""}]
[null,null,null,null,null,null,0,null,"Investigation Work      ",{"$f":"IF(J120=TRUE,2,\"\")","v":""}]
[null,null,null,null,null,null,0,null,"Monitoring/Interim Work        ",{"$f":"IF(J121=TRUE,3,\"\")","v":""}]
[null,null,null,null,null,null,0,null,"Corrective Action Plan Work",{"$f":"IF(J122=TRUE,4,\"\")","v":""}]
[null,null,null,null,null,null,0,null,"Report Preparation ",{"$f":"IF(J123=TRUE,5,\"\")","v":""}]
[null,null,null,null,null,null,0]
[null,null,null,null,null,null,0]
[null,null,null,null,null,null,0,null,{"$f":"IF(J119=TRUE,$M$29,IF(J120=TRUE,$M$30,IF(J121=TRUE,$M$31,IF(J122=TRUE,$M$32,IF(J123=TRUE,$M$33,0)))))","v":0}]
["SUBTOTAL OF THIS PAGE",null,null,null,null,null,{"$f":"SUM(G119:G131)","v":0},null,{"$f":"SUM(I131)","v":0},{"$f":"IF(I132>1,1,0)","v":0}]
["Page              of               (Travel Supplementary Sheet)"]
[]
[]
["PART 5.D (1)"]
["TRAVEL SUPPLEMENTARY SHEET"]
["Check Event:"]
[]
["LODGING/MEALS"]
[]
["1.    Overnight stay is allowed for any continuous site work such as multiple site visits, treatment system installation, drilling/P&A "]
["       wells, geoprobe work, over-excavation, soil treatment or at least 6 hour vacuum events."]
["2.   Prior approval from the Trust Fund Management should be obtained for overnight stay for work other than that "]
["      specifically identified in #1, above."]
["3.   Meals are only reimbursable when overnight stay is required."]
["4.   Claims for hotel charges must be accompanied by legible receipts indicating names of persons staying in a room.  Do not "]
["      provide charge card receipts.  Names can not be added after the receipt is generated."]
["5.   No RAC markup allowed"]
["6.   Single site visits:  (Hotel Charges) + (Meal Charges) = Total"]
["7.   Multiple site visits:  [(Hotel Charges) + (Meal Charges)] ÷ (No. Of Sites Visited) = Total"]
["8.   Airfares, toll charges, and taxi charges are not reimbursable."]
["9.  Travel charge for work activities addressed in unit pricing should not be addressed on this form."]
["RATES",null,"4/1/2012 MAXIMUM RATES"]
["Meals - Statewide",null,"$30/day "]
["Meals - New Orleans",null,"$35/day"]
["Hotel - Statewide",null,"$100/night (plus tax)"]
["Hotel - New Orleans",null,"$150/night (plus tax)"]
["Required Information- Check below the reason charges for overnight stay or meals are being requested:"]
[]
[]
["                                                                                                                                                                                              ."]
["LAST\nNAME OF\nPERSON","RAC\nINVOICE\nNO.","DATE(S)\nTRAVELED","HOTEL\nCHARGES","TOTAL\nMEAL\nCHARGES","NO. OF\nSITES\nVISITED","TOTAL",null,null,null,"total"]
[null,null,null,null,null,null,{"$f":"ROUND(IF(F164=0,SUM(D164+E164),((D164+E164)/F164)),2)","v":0},null,"Emergency/Initial Work   ",false,{"$f":"IF(J164=TRUE,$G$177,\"\")","v":""}]
[null,null,null,null,null,null,{"$f":"ROUND(IF(F165=0,SUM(D165+E165),((D165+E165)/F165)),2)","v":0},null,"Investigation Work      ",false,{"$f":"IF(J165=TRUE,$G$177,\"\")","v":""}]
[null,null,null,null,null,null,0,null,"Monitoring/Interim Work        ",false,""]
[null,null,null,null,null,null,0,null,"Corrective Action Plan Work",false,""]
[null,null,null,null,null,null,0,null,"Report Preparation ",false,""]
[null,null,null,null,null,null,0,null,"Emergency/Initial Work   ",{"$f":"IF(J164=TRUE,1,\"\")","v":""}]
[null,null,null,null,null,null,0,null,"Investigation Work      ",{"$f":"IF(J165=TRUE,2,\"\")","v":""}]
[null,null,null,null,null,null,0,null,"Monitoring/Interim Work        ",{"$f":"IF(J166=TRUE,3,\"\")","v":""}]
[null,null,null,null,null,null,0,null,"Corrective Action Plan Work",{"$f":"IF(J167=TRUE,4,\"\")","v":""}]
[null,null,null,null,null,null,0,null,"Report Preparation ",{"$f":"IF(J168=TRUE,5,\"\")","v":""}]
[null,null,null,null,null,null,0]
[null,null,null,null,null,null,0]
[null,null,null,null,null,null,0,null,{"$f":"IF(J164=TRUE,$M$29,IF(J165=TRUE,$M$30,IF(J166=TRUE,$M$31,IF(J167=TRUE,$M$32,IF(J168=TRUE,$M$33,0)))))","v":0}]
["SUBTOTAL OF THIS PAGE",null,null,null,null,null,{"$f":"SUM(G164:G176)","v":0},null,{"$f":"SUM(I176)","v":0},{"$f":"IF(I177>1,1,0)","v":0}]
["Page              of               (Travel Supplementary Sheet)"]
[]
[]
["PART 5.D (1)"]
["TRAVEL SUPPLEMENTARY SHEET"]
["Check Event:"]
[]
["LODGING/MEALS"]
[]
["1.    Overnight stay is allowed for any continuous site work such as multiple site visits, treatment system installation, drilling/P&A "]
["       wells, geoprobe work, over-excavation, soil treatment or at least 6 hour vacuum events."]
["2.   Prior approval from the Trust Fund Management should be obtained for overnight stay for work other than that "]
["      specifically identified in #1, above."]
["3.   Meals are only reimbursable when overnight stay is required."]
["4.   Claims for hotel charges must be accompanied by legible receipts indicating names of persons staying in a room.  Do not "]
["      provide charge card receipts.  Names can not be added after the receipt is generated."]
["5.   No RAC markup allowed"]
["6.   Single site visits:  (Hotel Charges) + (Meal Charges) = Total"]
["7.   Multiple site visits:  [(Hotel Charges) + (Meal Charges)] ÷ (No. Of Sites Visited) = Total"]
["8.   Airfares, toll charges, and taxi charges are not reimbursable."]
["9.  Travel charge for work activities addressed in unit pricing should not be addressed on this form."]
["RATES",null,"4/1/2012 MAXIMUM RATES"]
["Meals - Statewide",null,"$30/day "]
["Meals - New Orleans",null,"$35/day"]
["Hotel - Statewide",null,"$100/night (plus tax)"]
["Hotel - New Orleans",null,"$150/night (plus tax)"]
["Required Information- Check below the reason charges for overnight stay or meals are being requested:"]
[]
[]
["                                                                                                                                                                                              ."]
["LAST\nNAME OF\nPERSON","RAC\nINVOICE\nNO.","DATE(S)\nTRAVELED","HOTEL\nCHARGES","TOTAL\nMEAL\nCHARGES","NO. OF\nSITES\nVISITED","TOTAL",null,null,null,"total"]
[null,null,null,null,null,null,{"$f":"ROUND(IF(F209=0,SUM(D209+E209),((D209+E209)/F209)),2)","v":0},null,"Emergency/Initial Work   ",false,{"$f":"IF(J209=TRUE,$G$222,\"\")","v":""}]
[null,null,null,null,null,null,{"$f":"ROUND(IF(F210=0,SUM(D210+E210),((D210+E210)/F210)),2)","v":0},null,"Investigation Work      ",false,{"$f":"IF(J210=TRUE,$G$222,\"\")","v":""}]
[null,null,null,null,null,null,0,null,"Monitoring/Interim Work        ",false,""]
[null,null,null,null,null,null,0,null,"Corrective Action Plan Work",false,""]
[null,null,null,null,null,null,0,null,"Report Preparation ",false,""]
[null,null,null,null,null,null,0,null,"Emergency/Initial Work   ",{"$f":"IF(J209=TRUE,1,\"\")","v":""}]
[null,null,null,null,null,null,0,null,"Investigation Work      ",{"$f":"IF(J210=TRUE,2,\"\")","v":""}]
[null,null,null,null,null,null,0,null,"Monitoring/Interim Work        ",{"$f":"IF(J211=TRUE,3,\"\")","v":""}]
[null,null,null,null,null,null,0,null,"Corrective Action Plan Work",{"$f":"IF(J212=TRUE,4,\"\")","v":""}]
[null,null,null,null,null,null,0,null,"Report Preparation ",{"$f":"IF(J213=TRUE,5,\"\")","v":""}]
[null,null,null,null,null,null,0]
[null,null,null,null,null,null,0]
[null,null,null,null,null,null,0,null,{"$f":"IF(J209=TRUE,$M$29,IF(J210=TRUE,$M$30,IF(J211=TRUE,$M$31,IF(J212=TRUE,$M$32,IF(J213=TRUE,$M$33,0)))))","v":0}]
["SUBTOTAL OF THIS PAGE",null,null,null,null,null,{"$f":"SUM(G209:G221)","v":0},null,{"$f":"SUM(I221)","v":0},{"$f":"IF(I222>1,1,0)","v":0}]
["Page              of               (Travel Supplementary Sheet)"]

{"sheet":"Travel","index":11,"n_rows":209,"n_cols":15,"rows_kept":209,"cut":false,"hidden":false,"merged":[[174,0,174,8],[40,0,40,5],[206,0,206,7],[207,0,207,7],[82,0,82,5],[124,0,124,5],[166,0,166,5],[172,0,172,8],[173,0,173,8],[175,0,175,8],[176,0,176,8],[177,0,177,8],[168,0,168,8],[169,0,169,8],[170,0,170,8],[171,0,171,8],[81,0,81,7],[123,0,123,7],[165,0,165,7],[164,0,164,7],[136,0,136,8],[137,0,137,8],[138,0,138,8],[139,0,140,0],[208,0,208,5],[178,0,178,8],[179,0,179,8],[180,0,180,8],[181,0,182,0],[181,1,182,1],[181,2,182,2],[181,3,182,3],[181,4,182,4],[181,5,181,6],[181,7,182,7],[181,8,182,8],[139,1,140,1],[139,2,140,2],[139,3,140,3],[139,4,140,4],[139,5,139,6],[139,7,140,7],[139,8,140,8],[130,0,130,8],[131,0,131,8],[133,0,133,8],[134,0,134,8],[135,0,135,8],[126,0,126,8],[127,0,127,8],[128,0,128,8],[129,0,129,8],[132,0,132,8],[122,0,122,7],[94,0,94,8],[95,0,95,8],[96,0,96,8],[97,0,98,0],[97,1,98,1],[97,2,98,2],[97,3,98,3],[97,4,98,4],[97,5,97,6],[97,7,98,7],[97,8,98,8],[88,0,88,8],[89,0,89,8],[91,0,91,8],[92,0,92,8],[93,0,93,8],[84,0,84,8],[85,0,85,8],[86,0,86,8],[87,0,87,8],[90,0,90,8],[80,0,80,7],[53,0,53,8],[54,0,54,8],[55,0,56,0],[55,1,56,1],[55,2,56,2],[55,3,56,3],[55,4,56,4],[55,5,55,6],[55,7,56,7],[55,8,56,8],[47,0,47,8],[49,0,49,8],[50,0,50,8],[51,0,51,8],[52,0,52,8],[42,0,42,8],[43,0,43,8],[44,0,44,8],[45,0,45,8],[46,0,46,8],[48,0,48,8],[0,0,0,8],[1,0,1,8],[2,0,2,8],[6,0,6,8],[4,0,4,8],[5,0,5,8],[3,0,3,8],[8,0,8,8],[9,0,9,8],[7,0,7,8],[38,0,38,7],[39,0,39,7],[13,8,14,8],[10,0,10,8],[11,0,11,8],[12,0,12,8],[13,4,14,4],[13,3,14,3],[13,2,14,2],[13,1,14,1],[13,0,14,0],[13,5,13,6],[13,7,14,7]]}
["PART 5.D (2)"]
["TRAVEL SUPPLEMENTARY SHEET",null,null,null,null,null,null,null,null,null,null,"Hotal Total","Milage 2 total","Travel total"]
["Check Event:",null,null,null,null,null,null,null,null,null,"Emergency/Initial Work   ",{"$f":"'Hotel & Food'!M29","v":0},{"$f":"O16","v":0},{"$f":"SUM(L3:M3)","v":0}]
[null,null,null,null,null,null,null,null,null,null,"Investigation Work      ",{"$f":"'Hotel & Food'!M30","v":0},{"$f":"O17","v":0},{"$f":"SUM(L4:M4)","v":0}]
["UNIT PRICE TRAVEL",null,null,null,null,null,null,null,null,null,"Monitoring/Interim Work        ",{"$f":"'Hotel & Food'!M31","v":0},{"$f":"O18","v":0},0]
["(The unit price addresses costs associated with vehicle mileage and employees’ travel time)",null,null,null,null,null,null,null,null,null,"Corrective Action Plan Work",{"$f":"'Hotel & Food'!M32","v":0},{"$f":"O19","v":0},0]
["1. When multiple sites are visited in a single day, the total mileage shall be divided by the number of sites visited. ",null,null,null,null,null,null,null,null,null,"Report Preparation ",{"$f":"'Hotel & Food'!M33","v":0},{"$f":"O20","v":0},0]
["     Total Mileage should be rounded UP to a whole number and adjusted mileage should be rounded to two (2) decimal places. "]
["2. Activity Performed Codes:"]
["        1 - Groundwater Sampling, Free Product Recovery (Handbailing of Wells), Gauging, Treatment Unit Operation & Maintenance, "]
["             Discharge Sampling, Drilling/Plugging and Abandonment; "]
["        2 - Excavation, System Installation, Major Renovation, Major Repair, Site Investigation, Soil Confirmation Sampling;  "]
["        3 - Non-Unit Price Activity (Charged Time/Materials)     "]
["ACTIVITY PERFORMED","DATE\nSort By Oldest to Newest","DESTINATION\nShow Beginning,\nInterim, Ending Areas\nTraveled\n(Ex.:BR, Rayne,\nLafayette, BR.)","RAC\nINVOICE\nNO.\n","TOTAL MILEAGE","Complete these\ncolumns only when\nmultiple site visits\noccurred",null,"RATE","TOTAL"]
[null,null,null,null,null,"NO. OF\nSITES\nVISITED","ADJUSTED\nMILEAGE",null,null,null,null,null,"total",null,"sheet total"]
[null,null,null,null,null,null,{"$f":"IF(F16=0,\"\",ROUND(E16/F16,2))","v":""},2,{"$f":"ROUND(IF(F16=0,E16*H16,G16*H16),2)","v":0},null,"Emergency/Initial Work   ",false,{"$f":"IF(L16=TRUE,$I$39,\"\")","v":""},"Emergency/Initial Work   ",{"$f":"SUM(M16,M58,M100,M142,M184)","v":0}]
[null,null,null,null,null,null,{"$f":"IF(F17=0,\"\",ROUND(E17/F17,2))","v":""},2,{"$f":"ROUND(IF(F17=0,E17*H17,G17*H17),2)","v":0},null,"Investigation Work      ",false,{"$f":"IF(L17=TRUE,$I$39,\"\")","v":""},"Investigation Work      ",{"$f":"SUM(M17,M59,M101,M143,M185)","v":0}]
[null,null,null,null,null,null,"",2,0,null,"Monitoring/Interim Work        ",false,"","Monitoring/Interim Work        ",{"$f":"SUM(M18,M60,M102,M144,M186)","v":0}]
[null,null,null,null,null,null,"",2,0,null,"Corrective Action Plan Work",false,"","Corrective Action Plan Work",{"$f":"SUM(M19,M61,M103,M145,M187)","v":0}]
[null,null,null,null,null,null,"",2,0,null,"Report Preparation ",false,"","Report Preparation ",{"$f":"SUM(M20,M62,M104,M146,M188)","v":0}]
[null,null,null,null,null,null,"",2,0,null,"Emergency/Initial Work   ",{"$f":"IF(L16=TRUE,1,\"\")","v":""}]
[null,null,null,null,null,null,"",2,0,null,"Investigation Work      ",{"$f":"IF(L17=TRUE,2,\"\")","v":""}]
[null,null,null,null,null,null,"",2,0,null,"Monitoring/Interim Work        ",{"$f":"IF(L18=TRUE,3,\"\")","v":""}]
[null,null,null,null,null,null,"",2,0,null,"Corrective Action Plan Work",{"$f":"IF(L19=TRUE,4,\"\")","v":""}]
[null,null,null,null,null,null,"",2,0,null,"Report Preparation ",{"$f":"IF(L20=TRUE,5,\"\")","v":""}]
[null,null,null,null,null,null,"",2,0]
[null,null,null,null,null,null,"",2,0]
[null,null,null,null,null,null,"",2,0]
[null,null,null,null,null,null,"",2,0]
[null,null,null,null,null,null,"",2,0]
[null,null,null,null,null,null,"",2,0]
[null,null,null,null,null,null,"",2,0]
[null,null,null,null,null,null,"",2,0]
[null,null,null,null,null,null,"",2,0]
[null,null,null,null,null,null,"",2,0]
[null,null,null,null,null,null,"",2,0]
[null,null,null,null,null,null,"",2,0]
[null,null,null,null,null,null,"",2,0,null,{"$f":"IF(L16=TRUE,$N$3,IF(L17=TRUE,$N$4,IF(L18=TRUE,$N$5,IF(L19=TRUE,$N$6,IF(L20=TRUE,$N$7,0)))))","v":0}]
["SUBTOTAL OF THIS PAGE",null,null,null,null,null,null,null,{"$f":"SUM(I16:I38)","v":0}]
["TOTAL TRAVEL",null,null,null,null,null,null,null,{"$f":"SUM(K38)","v":0},null,{"$f":"IF(I40>0,1,0)","v":0}]
["Page              of               (Travel Supplementary Sheet)"]
[]
["PART 5.D (2)"]
["TRAVEL SUPPLEMENTARY SHEET"]
["Check Event:"]
[]
["UNIT PRICE TRAVEL"]
["(The unit price addresses costs associated with vehicle mileage and employees’ travel time)"]
["1. When multiple sites are visited in a single day, the total mileage shall be divided by the number of sites visited. "]
["     Total Mileage should be rounded UP to a whole number and adjusted mileage should be rounded to two (2) decimal places. "]
["2. Activity Performed Codes:"]
["        1 - Groundwater Sampling, Free Product Recovery (Handbailing of Wells), Gauging, Treatment Unit Operation & Maintenance, "]
["             Discharge Sampling, Drilling/Plugging and Abandonment; "]
["        2 - Excavation, System Installation, Major Renovation, Major Repair, Site Investigation, Soil Confirmation Sampling;  "]
["        3 - Non-Unit Price Activity (Charged Time/Materials)     "]
["ACTIVITY PERFORMED","DATE\nSort By Oldest to Newest","DESTINATION\nShow Beginning,\nInterim, Ending Areas\nTraveled\n(Ex.:BR, Rayne,\nLafayette, BR.)","RAC\nINVOICE\nNO.\n","TOTAL MILEAGE","Complete these\ncolumns only when\nmultiple site visits\noccurred",null,"RATE","TOTAL"]
[null,null,null,null,null,"NO. OF\nSITES\nVISITED","ADJUSTED\nMILEAGE",null,null,null,null,null,"total"]
[null,null,null,null,null,null,{"$f":"IF(F58=0,\"\",ROUND(E58/F58,2))","v":""},2,{"$f":"ROUND(IF(F58=0,E58*H58,G58*H58),2)","v":0},null,"Emergency/Initial Work   ",false,{"$f":"IF(L58=TRUE,$I$81,\"\")","v":""}]
[null,null,null,null,null,null,"",2,0,null,"Investigation Work      ",false,{"$f":"IF(L59=TRUE,$I$81,\"\")","v":""}]
[null,null,null,null,null,null,"",2,0,null,"Monitoring/Interim Work        ",false,""]
[null,null,null,null,null,null,"",2,0,null,"Corrective Action Plan Work",false,""]
[null,null,null,null,null,null,"",2,0,null,"Report Preparation ",false,""]
[null,null,null,null,null,null,"",2,0,null,"Emergency/Initial Work   ",{"$f":"IF(L58=TRUE,1,\"\")","v":""}]
[null,null,null,null,null,null,"",2,0,null,"Investigation Work      ",{"$f":"IF(L59=TRUE,2,\"\")","v":""}]
[null,null,null,null,null,null,"",2,0,null,"Monitoring/Interim Work        ",{"$f":"IF(L60=TRUE,3,\"\")","v":""}]
[null,null,null,null,null,null,"",2,0,null,"Corrective Action Plan Work",{"$f":"IF(L61=TRUE,4,\"\")","v":""}]
[null,null,null,null,null,null,"",2,0,null,"Report Preparation ",{"$f":"IF(L62=TRUE,5,\"\")","v":""}]
[null,null,null,null,null,null,"",2,0]
[null,null,null,null,null,null,"",2,0]
[null,null,null,null,null,null,"",2,0]
[null,null,null,null,null,null,"",2,0]
[null,null,null,null,null,null,"",2,0]
[null,null,null,null,null,null,"",2,0]
[null,null,null,null,null,null,"",2,0]
[null,null,null,null,null,null,"",2,0]
[null,null,null,null,null,null,"",2,0]
[null,null,null,null,null,null,"",2,0]
[null,null,null,null,null,null,"",2,0]
[null,null,null,null,null,null,"",2,0]
[null,null,null,null,null,null,"",2,0,null,{"$f":"IF(L58=TRUE,$N$3,IF(L59=TRUE,$N$4,IF(L60=TRUE,$N$5,IF(L61=TRUE,$N$6,IF(L62=TRUE,$N$7,0)))))","v":0}]
["SUBTOTAL OF THIS PAGE",null,null,null,null,null,null,null,{"$f":"SUM(I58:I80)","v":0}]
["TOTAL TRAVEL",null,null,null,null,null,null,null,{"$f":"SUM(K80)","v":0},null,{"$f":"IF(I82>0,1,0)","v":0}]
["Page              of               (Travel Supplementary Sheet)"]
[]
["PART 5.D (2)"]
["TRAVEL SUPPLEMENTARY SHEET"]
["Check Event:"]
[]
["UNIT PRICE TRAVEL"]
["(The unit price addresses costs associated with vehicle mileage and employees’ travel time)"]
["1. When multiple sites are visited in a single day, the total mileage shall be divided by the number of sites visited. "]
["     Total Mileage should be rounded UP to a whole number and adjusted mileage should be rounded to two (2) decimal places. "]
["2. Activity Performed Codes:"]
["        1 - Groundwater Sampling, Free Product Recovery (Handbailing of Wells), Gauging, Treatment Unit Operation & Maintenance, "]
["             Discharge Sampling, Drilling/Plugging and Abandonment; "]
["        2 - Excavation, System Installation, Major Renovation, Major Repair, Site Investigation, Soil Confirmation Sampling;  "]
["        3 - Non-Unit Price Activity (Charged Time/Materials)     "]
["ACTIVITY PERFORMED","DATE\nSort By Oldest to Newest","DESTINATION\nShow Beginning,\nInterim, Ending Areas\nTraveled\n(Ex.:BR, Rayne,\nLafayette, BR.)","RAC\nINVOICE\nNO.\n","TOTAL MILEAGE","Complete these\ncolumns only when\nmultiple site visits\noccurred",null,"RATE","TOTAL"]
[null,null,null,null,null,"NO. OF\nSITES\nVISITED","ADJUSTED\nMILEAGE",null,null,null,null,null,"total"]
[null,null,null,null,null,null,{"$f":"IF(F100=0,\"\",ROUND(E100/F100,2))","v":""},2,{"$f":"ROUND(IF(F100=0,E100*H100,G100*H100),2)","v":0},null,"Emergency/Initial Work   ",false,{"$f":"IF(L100=TRUE,$I$123,\"\")","v":""}]
[null,null,null,null,null,null,"",2,0,null,"Investigation Work      ",false,{"$f":"IF(L101=TRUE,$I$123,\"\")","v":""}]
[null,null,null,null,null,null,"",2,0,null,"Monitoring/Interim Work        ",false,""]
[null,null,null,null,null,null,"",2,0,null,"Corrective Action Plan Work",false,""]
[null,null,null,null,null,null,"",2,0,null,"Report Preparation ",false,""]
[null,null,null,null,null,null,"",2,0,null,"Emergency/Initial Work   ",{"$f":"IF(L100=TRUE,1,\"\")","v":""}]
[null,null,null,null,null,null,"",2,0,null,"Investigation Work      ",{"$f":"IF(L101=TRUE,2,\"\")","v":""}]
[null,null,null,null,null,null,"",2,0,null,"Monitoring/Interim Work        ",{"$f":"IF(L102=TRUE,3,\"\")","v":""}]
[null,null,null,null,null,null,"",2,0,null,"Corrective Action Plan Work",{"$f":"IF(L103=TRUE,4,\"\")","v":""}]
[null,null,null,null,null,null,"",2,0,null,"Report Preparation ",{"$f":"IF(L104=TRUE,5,\"\")","v":""}]
[null,null,null,null,null,null,"",2,0]
[null,null,null,null,null,null,"",2,0]
[null,null,null,null,null,null,"",2,0]
[null,null,null,null,null,null,"",2,0]
[null,null,null,null,null,null,"",2,0]
[null,null,null,null,null,null,"",2,0]
[null,null,null,null,null,null,"",2,0]
[null,null,null,null,null,null,"",2,0]
[null,null,null,null,null,null,"",2,0]
[null,null,null,null,null,null,"",2,0]
[null,null,null,null,null,null,"",2,0]
[null,null,null,null,null,null,"",2,0]
[null,null,null,null,null,null,"",2,0,null,{"$f":"IF(L100=TRUE,$N$3,IF(L101=TRUE,$N$4,IF(L102=TRUE,$N$5,IF(L103=TRUE,$N$6,IF(L104=TRUE,$N$7,0)))))","v":0}]
["SUBTOTAL OF THIS PAGE",null,null,null,null,null,null,null,{"$f":"SUM(I100:I122)","v":0}]
["TOTAL TRAVEL",null,null,null,null,null,null,null,{"$f":"SUM(K122)","v":0},null,{"$f":"IF(I124>0,1,0)","v":0}]
["Page              of               (Travel Supplementary Sheet)"]
[]
["PART 5.D (2)"]
["TRAVEL SUPPLEMENTARY SHEET"]
["Check Event:"]
[]
["UNIT PRICE TRAVEL"]
["(The unit price addresses costs associated with vehicle mileage and employees’ travel time)"]
["1. When multiple sites are visited in a single day, the total mileage shall be divided by the number of sites visited. "]
["     Total Mileage should be rounded UP to a whole number and adjusted mileage should be rounded to two (2) decimal places. "]
["2. Activity Performed Codes:"]
["        1 - Groundwater Sampling, Free Product Recovery (Handbailing of Wells), Gauging, Treatment Unit Operation & Maintenance, "]
["             Discharge Sampling, Drilling/Plugging and Abandonment; "]
["        2 - Excavation, System Installation, Major Renovation, Major Repair, Site Investigation, Soil Confirmation Sampling;  "]
["        3 - Non-Unit Price Activity (Charged Time/Materials)     "]
["ACTIVITY PERFORMED","DATE\nSort By Oldest to Newest","DESTINATION\nShow Beginning,\nInterim, Ending Areas\nTraveled\n(Ex.:BR, Rayne,\nLafayette, BR.)","RAC\nINVOICE\nNO.\n","TOTAL MILEAGE","Complete these\ncolumns only when\nmultiple site visits\noccurred",null,"RATE","TOTAL"]
[null,null,null,null,null,"NO. OF\nSITES\nVISITED","ADJUSTED\nMILEAGE",null,null,null,null,null,"total"]
[null,null,null,null,null,null,{"$f":"IF(F142=0,\"\",ROUND(E142/F142,2))","v":""},2,{"$f":"ROUND(IF(F142=0,E142*H142,G142*H142),2)","v":0},null,"Emergency/Initial Work   ",false,{"$f":"IF(L142=TRUE,$I$165,\"\")","v":""}]
[null,null,null,null,null,null,"",2,0,null,"Investigation Work      ",false,{"$f":"IF(L143=TRUE,$I$165,\"\")","v":""}]
[null,null,null,null,null,null,"",2,0,null,"Monitoring/Interim Work        ",false,""]
[null,null,null,null,null,null,"",2,0,null,"Corrective Action Plan Work",false,""]
[null,null,null,null,null,null,"",2,0,null,"Report Preparation ",false,""]
[null,null,null,null,null,null,"",2,0,null,"Emergency/Initial Work   ",{"$f":"IF(L142=TRUE,1,\"\")","v":""}]
[null,null,null,null,null,null,"",2,0,null,"Investigation Work      ",{"$f":"IF(L143=TRUE,2,\"\")","v":""}]
[null,null,null,null,null,null,"",2,0,null,"Monitoring/Interim Work        ",{"$f":"IF(L144=TRUE,3,\"\")","v":""}]
[null,null,null,null,null,null,"",2,0,null,"Corrective Action Plan Work",{"$f":"IF(L145=TRUE,4,\"\")","v":""}]
[null,null,null,null,null,null,"",2,0,null,"Report Preparation ",{"$f":"IF(L146=TRUE,5,\"\")","v":""}]
[null,null,null,null,null,null,"",2,0]
[null,null,null,null,null,null,"",2,0]
[null,null,null,null,null,null,"",2,0]
[null,null,null,null,null,null,"",2,0]
[null,null,null,null,null,null,"",2,0]
[null,null,null,null,null,null,"",2,0]
[null,null,null,null,null,null,"",2,0]
[null,null,null,null,null,null,"",2,0]
[null,null,null,null,null,null,"",2,0]
[null,null,null,null,null,null,"",2,0]
[null,null,null,null,null,null,"",2,0]
[null,null,null,null,null,null,"",2,0]
[null,null,null,null,null,null,"",2,0,null,{"$f":"IF(L142=TRUE,$N$3,IF(L143=TRUE,$N$4,IF(L144=TRUE,$N$5,IF(L145=TRUE,$N$6,IF(L146=TRUE,$N$7,0)))))","v":0}]
["SUBTOTAL OF THIS PAGE",null,null,null,null,null,null,null,{"$f":"SUM(I142:I164)","v":0}]
["TOTAL TRAVEL",null,null,null,null,null,null,null,{"$f":"SUM(K164)","v":0},null,{"$f":"IF(I166>0,1,0)","v":0}]
["Page              of               (Travel Supplementary Sheet)"]
[]
["PART 5.D (2)"]
["TRAVEL SUPPLEMENTARY SHEET"]
["Check Event:"]
[]
["UNIT PRICE TRAVEL"]
["(The unit price addresses costs associated with vehicle mileage and employees’ travel time)"]
["1. When multiple sites are visited in a single day, the total mileage shall be divided by the number of sites visited. "]
["     Total Mileage should be rounded UP to a whole number and adjusted mileage should be rounded to two (2) decimal places. "]
["2. Activity Performed Codes:"]
["        1 - Groundwater Sampling, Free Product Recovery (Handbailing of Wells), Gauging, Treatment Unit Operation & Maintenance, "]
["             Discharge Sampling, Drilling/Plugging and Abandonment; "]
["        2 - Excavation, System Installation, Major Renovation, Major Repair, Site Investigation, Soil Confirmation Sampling;  "]
["        3 - Non-Unit Price Activity (Charged Time/Materials)     "]
["ACTIVITY PERFORMED","DATE\nSort By Oldest to Newest","DESTINATION\nShow Beginning,\nInterim, Ending Areas\nTraveled\n(Ex.:BR, Rayne,\nLafayette, BR.)","RAC\nINVOICE\nNO.\n","TOTAL MILEAGE","Complete these\ncolumns only when\nmultiple site visits\noccurred",null,"RATE","TOTAL"]
[null,null,null,null,null,"NO. OF\nSITES\nVISITED","ADJUSTED\nMILEAGE",null,null,null,null,null,"total"]
[null,null,null,null,null,null,{"$f":"IF(F184=0,\"\",ROUND(E184/F184,2))","v":""},2,{"$f":"ROUND(IF(F184=0,E184*H184,G184*H184),2)","v":0},null,"Emergency/Initial Work   ",false,{"$f":"IF(L184=TRUE,$I$207,\"\")","v":""}]
[null,null,null,null,null,null,"",2,0,null,"Investigation Work      ",false,{"$f":"IF(L185=TRUE,$I$207,\"\")","v":""}]
[null,null,null,null,null,null,"",2,0,null,"Monitoring/Interim Work        ",false,""]
[null,null,null,null,null,null,"",2,0,null,"Corrective Action Plan Work",false,""]
[null,null,null,null,null,null,"",2,0,null,"Report Preparation ",false,""]
[null,null,null,null,null,null,"",2,0,null,"Emergency/Initial Work   ",{"$f":"IF(L184=TRUE,1,\"\")","v":""}]
[null,null,null,null,null,null,"",2,0,null,"Investigation Work      ",{"$f":"IF(L185=TRUE,2,\"\")","v":""}]
[null,null,null,null,null,null,"",2,0,null,"Monitoring/Interim Work        ",{"$f":"IF(L186=TRUE,3,\"\")","v":""}]
[null,null,null,null,null,null,"",2,0,null,"Corrective Action Plan Work",{"$f":"IF(L187=TRUE,4,\"\")","v":""}]
[null,null,null,null,null,null,"",2,0,null,"Report Preparation ",{"$f":"IF(L188=TRUE,5,\"\")","v":""}]
[null,null,null,null,null,null,"",2,0]
[null,null,null,null,null,null,"",2,0]
[null,null,null,null,null,null,"",2,0]
[null,null,null,null,null,null,"",2,0]
[null,null,null,null,null,null,"",2,0]
[null,null,null,null,null,null,"",2,0]
[null,null,null,null,null,null,"",2,0]
[null,null,null,null,null,null,"",2,0]
[null,null,null,null,null,null,"",2,0]
[null,null,null,null,null,null,"",2,0]
[null,null,null,null,null,null,"",2,0]
[null,null,null,null,null,null,"",2,0]
[null,null,null,null,null,null,"",2,0,null,{"$f":"IF(L184=TRUE,$N$3,IF(L185=TRUE,$N$4,IF(L186=TRUE,$N$5,IF(L187=TRUE,$N$6,IF(L188=TRUE,$N$7,0)))))","v":0}]
["SUBTOTAL OF THIS PAGE",null,null,null,null,null,null,null,{"$f":"SUM(I184:I206)","v":0}]
["TOTAL TRAVEL",null,null,null,null,null,null,null,{"$f":"SUM(K206)","v":0},null,{"$f":"IF(I208>0,1,0)","v":0}]
["Page              of               (Travel Supplementary Sheet)"]

{"sheet":"Transportation&Shipping","index":12,"n_rows":171,"n_cols":10,"rows_kept":171,"cut":false,"hidden":false,"merged":[[138,0,138,3],[139,0,139,3],[168,0,168,2],[170,0,170,2],[169,0,169,2],[134,0,134,3],[135,0,135,3],[136,0,136,3],[137,0,137,3],[129,0,129,3],[130,0,130,3],[131,0,131,3],[133,0,133,3],[95,0,95,3],[96,0,96,3],[125,0,125,2],[127,0,127,2],[126,0,126,2],[91,0,91,3],[92,0,92,3],[93,0,93,3],[94,0,94,3],[86,0,86,3],[87,0,87,3],[88,0,88,3],[90,0,90,3],[52,0,52,3],[53,0,53,3],[82,0,82,2],[84,0,84,2],[83,0,83,2],[48,0,48,3],[49,0,49,3],[50,0,50,3],[51,0,51,3],[43,0,43,3],[44,0,44,3],[45,0,45,3],[47,0,47,3],[41,0,41,2],[4,0,4,3],[40,0,40,2],[0,0,0,3],[1,0,1,3],[2,0,2,3],[5,0,5,3],[6,0,6,3],[7,0,7,3],[9,0,9,3],[10,0,10,3],[39,0,39,2],[8,0,8,3]]}
["PART 5.E"]
["TRANSPORTATION/SHIPPING SUPPLEMENTARY SHEET"]
["Check Event:"]
[]
["1.    This form should include shipping charges for contaminated soils and/or water, shipping charges for laboratory analysis, and"]
["       mob/demob of equipment used, other than for well drilling, plugging/abandonment, geoprobe work."]
["2.   Do not address RAC markup on this sheet.  RAC markup is to be shown on the Miscellaneous Supplementary Sheet."]
["3.   If a single invoice addresses charges for multiple sites, indicate on the invoice each site name and the amount charged to "]
["      each site."]
["4.   Rush charges not required by DEQ will not be paid."]
["5.   Transportation charges for work activities addressed in unit pricing should not be addressed on this form."]
["DESCRIPTION OF EACH\nITEM SHIPPED","RAC\nINVOICE NO.","OUTSIDE\nINVOICE NO.","TOTAL"]
[null,null,null,null,null,"Emergency/Initial Work   ",false,{"$f":"IF(G13=TRUE,$D$40,\"\")","v":""},"Emergency/Initial Work   ",{"$f":"SUM(H13,H56,H99,H142)","v":0}]
[null,null,null,null,null,"Investigation Work      ",false,{"$f":"IF(G14=TRUE,$D$40,\"\")","v":""},"Investigation Work      ",{"$f":"SUM(H14,H57,H100,H143)","v":0}]
[null,null,null,null,null,"Monitoring/Interim Work    ",false,"","Monitoring/Interim Work    ",{"$f":"SUM(H15,H58,H101,H144)","v":0}]
[null,null,null,null,null,"Corrective Action Plan Work",false,"","Corrective Action Plan Work",{"$f":"SUM(H16,H59,H102,H145)","v":0}]
[]
[null,null,null,null,null,"Emergency/Initial Work   ",{"$f":"IF(G13=TRUE,1,\"\")","v":""}]
[null,null,null,null,null,"Investigation Work      ",{"$f":"IF(G14=TRUE,2,\"\")","v":""}]
[null,null,null,null,null,"Monitoring/Interim Work    ",{"$f":"IF(G15=TRUE,3,\"\")","v":""}]
[null,null,null,null,null,"Corrective Action Plan Work",{"$f":"IF(G16=TRUE,4,\"\")","v":""}]
[]
[]
[]
[]
[]
[]
[]
[]
[]
[]
[]
[]
[]
[]
[]
[]
[]
[null,null,null,null,null,{"$f":"IF(G13=TRUE,$J$13,IF(G14=TRUE,$J$14,IF(G15=TRUE,$J$15,IF(G16=TRUE,$J$16,0))))","v":0}]
["SUBTOTAL OF THIS PAGE",null,null,{"$f":"SUM(D13:D38)","v":0}]
["TOTAL TRANSPORTATION/SHIPPING COSTS",null,null,{"$f":"SUM(F39)","v":0},null,{"$f":"IF(D41>0,1,0)","v":0}]
["Page                of                 (Transportation/Shipping Supplementary Sheet)"]
[]
["PART 5.E"]
["TRANSPORTATION/SHIPPING SUPPLEMENTARY SHEET"]
["Check Event:"]
[]
["1.    This form should include shipping charges for contaminated soils and/or water; shipping charges for laboratory analysis, "]
["       moblization and demobilization of equipment used other than for well drilling, plugging/abandonment, geoprobe work"]
["2.   Do not address RAC markup on this sheet.  RAC markup is to be shown on the Miscellaneous Supplementary Sheet."]
["3.   If a single invoice addresses charges for multiple sites, indicate on the invoice each site name and the amount charged to "]
["      each site."]
["4.   Rush charges not required by DEQ will not be paid."]
["5.   Transportation charges for work activities addressed in unit pricing should not be addressed on this form."]
["DESCRIPTION OF EACH\nITEM SHIPPED","RAC\nINVOICE NO.","OUTSIDE\nINVOICE NO.","TOTAL"]
[null,null,null,null,null,"Emergency/Initial Work   ",false,{"$f":"IF(G56=TRUE,$D$83,\"\")","v":""}]
[null,null,null,null,null,"Investigation Work      ",false,{"$f":"IF(G57=TRUE,$D$83,\"\")","v":""}]
[null,null,null,null,null,"Monitoring/Interim Work    ",false,""]
[null,null,null,null,null,"Corrective Action Plan Work",false,""]
[]
[null,null,null,null,null,"Emergency/Initial Work   ",{"$f":"IF(G56=TRUE,1,\"\")","v":""}]
[null,null,null,null,null,"Investigation Work      ",{"$f":"IF(G57=TRUE,2,\"\")","v":""}]
[null,null,null,null,null,"Monitoring/Interim Work    ",{"$f":"IF(G58=TRUE,3,\"\")","v":""}]
[null,null,null,null,null,"Corrective Action Plan Work",{"$f":"IF(G59=TRUE,4,\"\")","v":""}]
[]
[]
[]
[]
[]
[]
[]
[]
[]
[]
[]
[]
[]
[]
[]
[]
[]
[null,null,null,null,null,{"$f":"IF(G56=TRUE,$J$13,IF(G57=TRUE,$J$14,IF(G58=TRUE,$J$15,IF(G59=TRUE,$J$16,0))))","v":0}]
["SUBTOTAL OF THIS PAGE",null,null,{"$f":"SUM(D56:D81)","v":0}]
["TOTAL TRANSPORTATION/SHIPPING COSTS",null,null,{"$f":"SUM(F82)","v":0},null,{"$f":"IF(D84>0,1,0)","v":0}]
["Page                of                 (Transportation/Shipping Supplementary Sheet)"]
[]
["PART 5.E"]
["TRANSPORTATION/SHIPPING SUPPLEMENTARY SHEET"]
["Check Event:"]
[]
["1.    This form should include shipping charges for contaminated soils and/or water; shipping charges for laboratory analysis, "]
["       moblization and demobilization of equipment used other than for well drilling, plugging/abandonment, geoprobe work"]
["2.   Do not address RAC markup on this sheet.  RAC markup is to be shown on the Miscellaneous Supplementary Sheet."]
["3.   If a single invoice addresses charges for multiple sites, indicate on the invoice each site name and the amount charged to "]
["      each site."]
["4.   Rush charges not required by DEQ will not be paid."]
["5.   Transportation charges for work activities addressed in unit pricing should not be addressed on this form."]
["DESCRIPTION OF EACH\nITEM SHIPPED","RAC\nINVOICE NO.","OUTSIDE\nINVOICE NO.","TOTAL"]
[null,null,null,null,null,"Emergency/Initial Work   ",false,{"$f":"IF(G99=TRUE,$D$126,\"\")","v":""}]
[null,null,null,null,null,"Investigation Work      ",false,{"$f":"IF(G100=TRUE,$D$126,\"\")","v":""}]
[null,null,null,null,null,"Monitoring/Interim Work    ",false,""]
[null,null,null,null,null,"Corrective Action Plan Work",false,""]
[]
[null,null,null,null,null,"Emergency/Initial Work   ",{"$f":"IF(G99=TRUE,1,\"\")","v":""}]
[null,null,null,null,null,"Investigation Work      ",{"$f":"IF(G100=TRUE,2,\"\")","v":""}]
[null,null,null,null,null,"Monitoring/Interim Work    ",{"$f":"IF(G101=TRUE,3,\"\")","v":""}]
[null,null,null,null,null,"Corrective Action Plan Work",{"$f":"IF(G102=TRUE,4,\"\")","v":""}]
[]
[]
[]
[]
[]
[]
[]
[]
[]
[]
[]
[]
[]
[]
[]
[]
[]
[null,null,null,null,null,{"$f":"IF(G99=TRUE,$J$13,IF(G100=TRUE,$J$14,IF(G101=TRUE,$J$15,IF(G102=TRUE,$J$16,0))))","v":0}]
["SUBTOTAL OF THIS PAGE",null,null,{"$f":"SUM(D99:D124)","v":0}]
["TOTAL TRANSPORTATION/SHIPPING COSTS",null,null,{"$f":"SUM(F125)","v":0},null,{"$f":"IF(D127>0,1,0)","v":0}]
["Page                of                 (Transportation/Shipping Supplementary Sheet)"]
[]
["PART 5.E"]
["TRANSPORTATION/SHIPPING SUPPLEMENTARY SHEET"]
["Check Event:"]
[]
["1.    This form should include shipping charges for contaminated soils and/or water; shipping charges for laboratory analysis, "]
["       moblization and demobilization of equipment used other than for well drilling, plugging/abandonment, geoprobe work"]
["2.   Do not address RAC markup on this sheet.  RAC markup is to be shown on the Miscellaneous Supplementary Sheet."]
["3.   If a single invoice addresses charges for multiple sites, indicate on the invoice each site name and the amount charged to "]
["      each site."]
["4.   Rush charges not required by DEQ will not be paid."]
["5.   Transportation charges for work activities addressed in unit pricing should not be addressed on this form."]
["DESCRIPTION OF EACH\nITEM SHIPPED","RAC\nINVOICE NO.","OUTSIDE\nINVOICE NO.","TOTAL"]
[null,null,null,null,null,"Emergency/Initial Work   ",false,{"$f":"IF(G142=TRUE,$D$169,\"\")","v":""}]
[null,null,null,null,null,"Investigation Work      ",false,{"$f":"IF(G143=TRUE,$D$169,\"\")","v":""}]
[null,null,null,null,null,"Monitoring/Interim Work    ",false,""]
[null,null,null,null,null,"Corrective Action Plan Work",false,""]
[]
[null,null,null,null,null,"Emergency/Initial Work   ",{"$f":"IF(G142=TRUE,1,\"\")","v":""}]
[null,null,null,null,null,"Investigation Work      ",{"$f":"IF(G143=TRUE,2,\"\")","v":""}]
[null,null,null,null,null,"Monitoring/Interim Work    ",{"$f":"IF(G144=TRUE,3,\"\")","v":""}]
[null,null,null,null,null,"Corrective Action Plan Work",{"$f":"IF(G145=TRUE,4,\"\")","v":""}]
[]
[]
[]
[]
[]
[]
[]
[]
[]
[]
[]
[]
[]
[]
[]
[]
[]
[null,null,null,null,null,{"$f":"IF(G142=TRUE,$J$13,IF(G143=TRUE,$J$14,IF(G144=TRUE,$J$15,IF(G145=TRUE,$J$16,0))))","v":0}]
["SUBTOTAL OF THIS PAGE",null,null,{"$f":"SUM(D142:D167)","v":0}]
["TOTAL TRANSPORTATION/SHIPPING COSTS",null,null,{"$f":"SUM(F168)","v":0},null,{"$f":"IF(D170>0,1,0)","v":0}]
["Page                of                 (Transportation/Shipping Supplementary Sheet)"]

{"sheet":"Drilling-P&A","index":13,"n_rows":164,"n_cols":15,"rows_kept":164,"cut":false,"hidden":false,"merged":[[55,0,55,8],[119,0,119,1],[27,13,27,14],[34,0,34,1],[35,0,35,1],[36,0,36,1],[37,0,37,1],[33,0,33,1],[74,0,74,1],[75,0,75,1],[76,0,76,1],[36,5,36,7],[35,5,35,7],[45,0,45,8],[46,0,46,8],[47,0,47,8],[48,0,48,8],[49,0,49,8],[41,0,41,8],[43,0,43,8],[44,0,44,8],[50,0,50,8],[51,0,51,8],[52,0,52,8],[54,0,54,8],[95,0,95,8],[128,0,128,8],[120,0,120,7],[121,0,121,7],[123,0,123,8],[124,0,124,8],[122,0,122,3],[86,0,86,8],[88,0,88,8],[89,0,89,8],[90,0,90,8],[91,0,91,8],[118,5,118,7],[125,0,125,8],[126,0,126,8],[127,0,127,8],[96,0,96,8],[116,5,116,7],[97,0,97,8],[98,0,98,8],[92,0,92,8],[119,5,119,7],[117,0,117,1],[118,0,118,1],[163,0,163,3],[129,0,129,8],[130,0,130,8],[131,0,131,8],[132,0,132,8],[133,0,133,8],[162,0,162,7],[134,0,134,8],[135,0,135,8],[136,0,136,8],[137,0,137,8],[161,0,161,7],[156,5,156,7],[138,0,138,8],[139,0,139,8],[160,5,160,7],[159,5,159,7],[157,5,157,7],[158,5,158,7],[156,0,156,1],[157,0,157,1],[158,0,158,1],[159,0,159,1],[160,0,160,1],[14,0,14,8],[15,0,15,8],[38,0,38,7],[39,0,39,7],[40,0,40,3],[42,0,42,8],[37,5,37,7],[33,5,33,7],[16,0,16,8],[34,5,34,7],[53,0,53,8],[117,5,117,7],[79,0,79,7],[80,0,80,7],[56,0,56,8],[57,0,57,8],[77,5,77,7],[78,5,78,7],[75,5,75,7],[74,5,74,7],[76,5,76,7],[115,5,115,7],[115,0,115,1],[116,0,116,1],[82,0,82,8],[83,0,83,8],[84,0,84,8],[85,0,85,8],[81,0,81,3],[77,0,77,1],[78,0,78,1],[87,0,87,8],[93,0,93,8],[94,0,94,8],[0,0,0,8],[1,0,1,8],[2,0,2,8],[6,0,6,8],[8,0,8,8],[13,0,13,8],[9,0,9,8],[3,0,3,8],[7,0,7,8],[4,0,4,8],[5,0,5,8],[11,0,11,8],[12,0,12,8],[10,0,10,8]]}
["PART 5.F"]
["DRILLING/PLUGGING & ABANDONMENT SUPPLEMENTARY SHEET"]
["Check Event:"]
["1.    The per foot rates encompass all costs associated with drilling or plugging & abandoning of wells, borings, and"]
["       recovery wells with the exceptions of mileage, mob/demob unit price, analysis, and transportation and disposal of cuttings."]
["2.    Depth of (Boring or Well) X Cost Per Foot = Total."]
["3.    If a boring is converted to a monitoring well, it should be noted on this sheet.  When a boring is converted to a monitoring "]
["       well, the Department will pay only for the monitoring well cost."]
["4.   Please reduce the applicable cost per foot rate by $15/foot, if soil samples were not taken, prior to calculating the row total"]
["5.   Include drilling logs, well registrations, and plugging and abandonment forms as required."]
["6.   Methods of Plugging and Abandonment Wells (P&A) - In “P&A Wells” column, enter  "]
["                     1      if P&A includes overdrilling of wells  "]
["                     2      if P&A was limited to pulling casing/screen and grouting well "]
["                     3      if well is grouted only"]
["7.  If a minimum rate, or per day rate for chemical injection, is being charged, please indicate the number of events next to the"]
["      appropriate activity.  All well/activity information must still be documented, excluding the Cost Per Foot Rate; this includes"]
["     listing the dates of chemical injection events."]
["WELL/BORING\nIDENTIFICATION NUMBER\n(As shown in technical\nreports to DEQ) ","DATE \nOF ACTIVITY","TYPE OF ACTIVITY","RAC\nINVOICE\nNO.","P&A\nWELLS\n(Enter\n1, 2, or 3;\nsee note 6)","WELL\nDIAMETER\n(inches)","DEPTH (in feet)","COST PER\nFOOT\nRATE ","TOTAL"]
[null,null,null,null,null,null,null,null,{"$f":"ROUND((G19*H19),2)","v":0},null,"Emergency/Initial Work   ",false,{"$f":"IF(L19=TRUE,$I$39,\"\")","v":""},"Emergency/Initial Work   ",{"$f":"SUM(M19,M60,M101,M142)","v":0}]
[null,null,null,null,null,null,null,null,{"$f":"ROUND((G20*H20),2)","v":0},null,"Investigation Work      ",false,{"$f":"IF(L20=TRUE,$I$39,\"\")","v":""},"Investigation Work      ",{"$f":"SUM(M20,M61,M102,M143)","v":0}]
[null,null,null,null,null,null,null,null,0,null,"Monitoring/Interim Work    ",false,{"$f":"IF(L21=TRUE,$I$39,\"\")","v":""},"Monitoring/Interim Work    ",{"$f":"SUM(M21,M62,M103,M144)","v":0}]
[null,null,null,null,null,null,null,null,0,null,"Corrective Action Plan Work",false,{"$f":"IF(L22=TRUE,$I$39,\"\")","v":""},"Corrective Action Plan Work",{"$f":"SUM(M22,M63,M104,M145)","v":0}]
[null,null,null,null,null,null,null,null,0]
[null,null,null,null,null,null,null,null,0,null,"Emergency/Initial Work   ",{"$f":"IF(L19=TRUE,1,\"\")","v":""}]
[null,null,null,null,null,null,null,null,0,null,"Investigation Work      ",{"$f":"IF(L20=TRUE,2,\"\")","v":""}]
[null,null,null,null,null,null,null,null,0,null,"Monitoring/Interim Work    ",{"$f":"IF(L21=TRUE,3,\"\")","v":""}]
[null,null,null,null,null,null,null,null,0,null,"Corrective Action Plan Work",{"$f":"IF(L22=TRUE,4,\"\")","v":""}]
[null,null,null,null,null,null,null,null,0,null,null,null,null,"Type of Activity"]
[null,null,null,null,null,null,null,null,0,null,null,null,null,"Chemical Injection"]
[null,null,null,null,null,null,null,null,0,null,null,null,null,"Boring - Direct Push",1]
[null,null,null,null,null,null,null,null,{"$f":"ROUND((G31*H31),2)","v":0},null,null,null,null,"Boring - Drilling",2]
[null,null,null,null,null,null,null,null,0,null,null,null,null,"Monitoring Well",3]
[null,null,null,null,null,null,null,null,0,null,null,null,null,"Extraction Well"]
["DATE OF EVENT",null,"TYPE OF ACTIVITY","INVOICE NO.","# OF EVENTS","MINMUM RATE",null,null,null,null,null,null,null,"Hornizontal Recovery Well"]
[null,null,"DRILLING",null,null,3495,null,null,{"$f":"E35*F35","v":0},null,null,null,null,"Recovery Well"]
[null,null,"DIRECT PUSH ",null,null,2800,null,null,{"$f":"E36*F36","v":0},null,null,null,null,"Sparge Well"]
[null,null,"CHEMICAL INJECTION",null,null,4160,null,null,0,null,null,null,null,"Temporary Well"]
[null,null,"P&A",null,null,1750,null,null,0,null,{"$f":"IF(L19=TRUE,$O$19,IF(L20=TRUE,$O$20,IF(L21=TRUE,$O$21,IF(L22=TRUE,$O$22,0))))","v":0}]
["SUBTOTAL OF THIS PAGE",null,null,null,null,null,null,null,{"$f":"SUM(I19:I38)","v":0}]
["TOTAL DRILLING/P&A COSTS",null,null,null,null,null,null,null,{"$f":"SUM(K38)","v":0},null,{"$f":"IF(I40>0,1,0)","v":0}]
["Page            of              (Drilling/P & A Supplementary Sheet)"]
["PART 5.F"]
["DRILLING/PLUGGING & ABANDONMENT SUPPLEMENTARY SHEET"]
["Check Event:"]
["1.    The per foot rates encompass all costs associated with drilling or plugging & abandoning of wells, borings, and"]
["       recovery wells with the exceptions of mileage, mob/demob unit price, analysis, and transportation and disposal of cuttings."]
["2.    Depth of (Boring or Well) X Cost Per Foot = Total."]
["3.    If a boring is converted to a monitoring well, it should be noted on this sheet.  When a boring is converted to a monitoring "]
["       well, the Department will pay only for the monitoring well cost."]
["4.   Please reduce the applicable cost per foot rate by $15/foot, if soil samples were not taken, prior to calculating the row total"]
["5.   Include drilling logs, well registrations, and plugging and abandonment forms as required."]
["6.   Methods of Plugging and Abandonment Wells (P&A) - In “P&A Wells” column, enter  "]
["                     1      if P&A includes overdrilling of wells  "]
["                     2      if P&A was limited to pulling casing/screen and grouting well "]
["                     3      if well is grouted only"]
["7.  If a minimum rate, or per day rate for chemical injection, is being charged, please indicate the number of events next to the"]
["      appropriate activity.  All well/activity information must still be documented, excluding the Cost Per Foot Rate; this includes"]
["     listing the dates of chemical injection events."]
["WELL/BORING\nIDENTIFICATION NUMBER\n(As shown in technical\nreports to DEQ) ","DATE \nOF ACTIVITY","TYPE OF ACTIVITY","RAC\nINVOICE\nNO.","P&A\nWELLS\n(Enter\n1, 2, or 3;\nsee note 6)","WELL\nDIAMETER\n(inches)","DEPTH (in feet)","COST PER\nFOOT\nRATE ","TOTAL"]
[null,null,null,null,null,null,null,null,{"$f":"ROUND((G60*H60),2)","v":0},null,"Emergency/Initial Work   ",false,{"$f":"IF(L60=TRUE,$I$80,\"\")","v":""},"Emergency/Initial Work   ",{"$f":"SUM(M60,M100,M141,M183)","v":0}]
[null,null,null,null,null,null,null,null,{"$f":"ROUND((G61*H61),2)","v":0},null,"Investigation Work      ",false,{"$f":"IF(L61=TRUE,$I$80,\"\")","v":""},"Investigation Work      ",{"$f":"SUM(M61,M101,M142,M184)","v":0}]
[null,null,null,null,null,null,null,null,0,null,"Monitoring/Interim Work    ",false,"","Monitoring/Interim Work    ",{"$f":"SUM(M62,M102,M143,M185)","v":0}]
[null,null,null,null,null,null,null,null,0,null,"Corrective Action Plan Work",false,"","Corrective Action Plan Work",{"$f":"SUM(M63,M103,M144,M186)","v":0}]
[null,null,null,null,null,null,null,null,0]
[null,null,null,null,null,null,null,null,0,null,"Emergency/Initial Work   ",{"$f":"IF(L60=TRUE,1,\"\")","v":""}]
[null,null,null,null,null,null,null,null,0,null,"Investigation Work      ",{"$f":"IF(L61=TRUE,2,\"\")","v":""}]
[null,null,null,null,null,null,null,null,0,null,"Monitoring/Interim Work    ",{"$f":"IF(L62=TRUE,3,\"\")","v":""}]
[null,null,null,null,null,null,null,null,0,null,"Corrective Action Plan Work",{"$f":"IF(L63=TRUE,4,\"\")","v":""}]
[null,null,null,null,null,null,null,null,0]
[null,null,null,null,null,null,null,null,0]
[null,null,null,null,null,null,null,null,0]
[null,null,null,null,null,null,null,null,0]
[null,null,null,null,null,null,null,null,0]
[null,null,null,null,null,null,null,null,0]
["DATE OF EVENT",null,"TYPE OF ACTIVITY","INVOICE NO.","# OF EVENTS","MINMUM RATE"]
[null,null,"DRILLING",null,null,3495,null,null,{"$f":"E76*F76","v":0}]
[null,null,"DIRECT PUSH ",null,null,2800,null,null,{"$f":"E77*F77","v":0}]
[null,null,"CHEMICAL INJECTION",null,null,4160,null,null,0]
[null,null,"P&A",null,null,1750,null,null,0,null,{"$f":"IF(L60=TRUE,$O$19,IF(L61=TRUE,$O$20,IF(L62=TRUE,$O$21,IF(L63=TRUE,$O$22,0))))","v":0}]
["SUBTOTAL OF THIS PAGE",null,null,null,null,null,null,null,{"$f":"SUM(I60:I79)","v":0}]
["TOTAL DRILLING/P&A COSTS",null,null,null,null,null,null,null,{"$f":"SUM(K79)","v":0},null,{"$f":"IF(I81>0,1,0)","v":0}]
["Page            of              (Drilling/P & A Supplementary Sheet)"]
["PART 5.F"]
["DRILLING/PLUGGING & ABANDONMENT SUPPLEMENTARY SHEET"]
["Check Event:"]
["1.    The per foot rates encompass all costs associated with drilling or plugging & abandoning of wells, borings, and"]
["       recovery wells with the exceptions of mileage, mob/demob unit price, analysis, and transportation and disposal of cuttings."]
["2.    Depth of (Boring or Well) X Cost Per Foot = Total."]
["3.    If a boring is converted to a monitoring well, it should be noted on this sheet.  When a boring is converted to a monitoring "]
["       well, the Department will pay only for the monitoring well cost."]
["4.   Please reduce the applicable cost per foot rate by $15/foot, if soil samples were not taken, prior to calculating the row total"]
["5.   Include drilling logs, well registrations, and plugging and abandonment forms as required."]
["6.   Methods of Plugging and Abandonment Wells (P&A) - In “P&A Wells” column, enter  "]
["                     1      if P&A includes overdrilling of wells  "]
["                     2      if P&A was limited to pulling casing/screen and grouting well "]
["                     3      if well is grouted only"]
["7.  If a minimum rate, or per day rate for chemical injection, is being charged, please indicate the number of events next to the"]
["      appropriate activity.  All well/activity information must still be documented, excluding the Cost Per Foot Rate; this includes"]
["     listing the dates of chemical injection events."]
["WELL/BORING\nIDENTIFICATION NUMBER\n(As shown in technical\nreports to DEQ) ","DATE \nOF ACTIVITY","TYPE OF ACTIVITY","RAC\nINVOICE\nNO.","P&A\nWELLS\n(Enter\n1, 2, or 3;\nsee note 6)","WELL\nDIAMETER\n(inches)","DEPTH (in feet)","COST PER\nFOOT\nRATE ","TOTAL"]
[null,null,null,null,null,null,null,null,{"$f":"ROUND((G101*H101),2)","v":0},null,"Emergency/Initial Work   ",false,{"$f":"IF(L101=TRUE,$I$121,\"\")","v":""},"Emergency/Initial Work   ",{"$f":"SUM(M101,M140,M182,M224)","v":0}]
[null,null,null,null,null,null,null,null,{"$f":"ROUND((G102*H102),2)","v":0},null,"Investigation Work      ",false,{"$f":"IF(L102=TRUE,$I$121,\"\")","v":""},"Investigation Work      ",{"$f":"SUM(M102,M141,M183,M225)","v":0}]
[null,null,null,null,null,null,null,null,0,null,"Monitoring/Interim Work    ",false,"","Monitoring/Interim Work    ",{"$f":"SUM(M103,M142,M184,M226)","v":0}]
[null,null,null,null,null,null,null,null,0,null,"Corrective Action Plan Work",false,"","Corrective Action Plan Work",{"$f":"SUM(M104,M143,M185,M227)","v":0}]
[null,null,null,null,null,null,null,null,0]
[null,null,null,null,null,null,null,null,0,null,"Emergency/Initial Work   ",{"$f":"IF(L101=TRUE,1,\"\")","v":""}]
[null,null,null,null,null,null,null,null,0,null,"Investigation Work      ",{"$f":"IF(L102=TRUE,2,\"\")","v":""}]
[null,null,null,null,null,null,null,null,0,null,"Monitoring/Interim Work    ",{"$f":"IF(L103=TRUE,3,\"\")","v":""}]
[null,null,null,null,null,null,null,null,0,null,"Corrective Action Plan Work",{"$f":"IF(L104=TRUE,4,\"\")","v":""}]
[null,null,null,null,null,null,null,null,0]
[null,null,null,null,null,null,null,null,0]
[null,null,null,null,null,null,null,null,0]
[null,null,null,null,null,null,null,null,0]
[null,null,null,null,null,null,null,null,0]
[null,null,null,null,null,null,null,null,0]
["DATE OF EVENT",null,"TYPE OF ACTIVITY","INVOICE NO.","# OF EVENTS","MINMUM RATE"]
[null,null,"DRILLING",null,null,3495,null,null,{"$f":"E117*F117","v":0}]
[null,null,"DIRECT PUSH ",null,null,2800,null,null,{"$f":"E118*F118","v":0}]
[null,null,"CHEMICAL INJECTION",null,null,4160,null,null,0]
[null,null,"P&A",null,null,1750,null,null,0,null,{"$f":"IF(L101=TRUE,$O$19,IF(L102=TRUE,$O$20,IF(L103=TRUE,$O$21,IF(L104=TRUE,$O$22,0))))","v":0}]
["SUBTOTAL OF THIS PAGE",null,null,null,null,null,null,null,{"$f":"SUM(I101:I120)","v":0}]
["TOTAL DRILLING/P&A COSTS",null,null,null,null,null,null,null,{"$f":"SUM(K120)","v":0},null,{"$f":"IF(I122>0,1,0)","v":0}]
["Page            of              (Drilling/P & A Supplementary Sheet)"]
["PART 5.F"]
["DRILLING/PLUGGING & ABANDONMENT SUPPLEMENTARY SHEET"]
["Check Event:"]
["1.    The per foot rates encompass all costs associated with drilling or plugging & abandoning of wells, borings, and"]
["       recovery wells with the exceptions of mileage, mob/demob unit price, analysis, and transportation and disposal of cuttings."]
["2.    Depth of (Boring or Well) X Cost Per Foot = Total."]
["3.    If a boring is converted to a monitoring well, it should be noted on this sheet.  When a boring is converted to a monitoring "]
["       well, the Department will pay only for the monitoring well cost."]
["4.   Please reduce the applicable cost per foot rate by $15/foot, if soil samples were not taken, prior to calculating the row total"]
["5.   Include drilling logs, well registrations, and plugging and abandonment forms as required."]
["6.   Methods of Plugging and Abandonment Wells (P&A) - In “P&A Wells” column, enter  "]
["                     1      if P&A includes overdrilling of wells  "]
["                     2      if P&A was limited to pulling casing/screen and grouting well "]
["                     3      if well is grouted only"]
["7.  If a minimum rate, or per day rate for chemical injection, is being charged, please indicate the number of events next to the"]
["      appropriate activity.  All well/activity information must still be documented, excluding the Cost Per Foot Rate; this includes"]
["     listing the dates of chemical injection events."]
["WELL/BORING\nIDENTIFICATION NUMBER\n(As shown in technical\nreports to DEQ) ","DATE \nOF ACTIVITY","TYPE OF ACTIVITY","RAC\nINVOICE\nNO.","P&A\nWELLS\n(Enter\n1, 2, or 3;\nsee note 6)","WELL\nDIAMETER\n(inches)","DEPTH (in feet)","COST PER\nFOOT\nRATE ","TOTAL"]
[null,null,null,null,null,null,null,null,{"$f":"ROUND((G142*H142),2)","v":0},null,"Emergency/Initial Work   ",false,{"$f":"IF(L142=TRUE,$I$162,\"\")","v":""},"Emergency/Initial Work   ",{"$f":"SUM(M142,M181,M223,M265)","v":0}]
[null,null,null,null,null,null,null,null,{"$f":"ROUND((G143*H143),2)","v":0},null,"Investigation Work      ",false,{"$f":"IF(L143=TRUE,$I$162,\"\")","v":""},"Investigation Work      ",{"$f":"SUM(M143,M182,M224,M266)","v":0}]
[null,null,null,null,null,null,null,null,0,null,"Monitoring/Interim Work    ",false,"","Monitoring/Interim Work    ",{"$f":"SUM(M144,M183,M225,M267)","v":0}]
[null,null,null,null,null,null,null,null,0,null,"Corrective Action Plan Work",false,"","Corrective Action Plan Work",{"$f":"SUM(M145,M184,M226,M268)","v":0}]
[null,null,null,null,null,null,null,null,0]
[null,null,null,null,null,null,null,null,0,null,"Emergency/Initial Work   ",{"$f":"IF(L142=TRUE,1,\"\")","v":""}]
[null,null,null,null,null,null,null,null,0,null,"Investigation Work      ",{"$f":"IF(L143=TRUE,2,\"\")","v":""}]
[null,null,null,null,null,null,null,null,0,null,"Monitoring/Interim Work    ",{"$f":"IF(L144=TRUE,3,\"\")","v":""}]
[null,null,null,null,null,null,null,null,0,null,"Corrective Action Plan Work",{"$f":"IF(L145=TRUE,4,\"\")","v":""}]
[null,null,null,null,null,null,null,null,0]
[null,null,null,null,null,null,null,null,0]
[null,null,null,null,null,null,null,null,0]
[null,null,null,null,null,null,null,null,0]
[null,null,null,null,null,null,null,null,0]
[null,null,null,null,null,null,null,null,0]
["DATE OF EVENT",null,"TYPE OF ACTIVITY","INVOICE NO.","# OF EVENTS","MINMUM RATE"]
[null,null,"DRILLING",null,null,3495,null,null,{"$f":"E158*F158","v":0}]
[null,null,"DIRECT PUSH ",null,null,2800,null,null,{"$f":"E159*F159","v":0}]
[null,null,"CHEMICAL INJECTION",null,null,4160,null,null,0]
[null,null,"P&A",null,null,1750,null,null,0,null,{"$f":"IF(L142=TRUE,$O$19,IF(L143=TRUE,$O$20,IF(L144=TRUE,$O$21,IF(L145=TRUE,$O$22,0))))","v":0}]
["SUBTOTAL OF THIS PAGE",null,null,null,null,null,null,null,{"$f":"SUM(I142:I161)","v":0}]
["TOTAL DRILLING/P&A COSTS",null,null,null,null,null,null,null,{"$f":"SUM(K161)","v":0},null,{"$f":"IF(I163>0,1,0)","v":0}]
["Page            of              (Drilling/P & A Supplementary Sheet)"]

{"sheet":"Analysis","index":14,"n_rows":167,"n_cols":17,"rows_kept":167,"cut":false,"hidden":false,"merged":[[161,0,161,7],[162,0,162,1],[162,4,162,6],[163,0,163,1],[163,4,163,6],[36,0,36,1],[37,0,37,1],[36,4,36,6],[37,4,37,6],[155,0,155,7],[133,0,133,7],[134,0,134,7],[135,0,135,7],[136,0,136,7],[137,0,137,7],[129,0,129,7],[130,0,130,7],[131,0,131,7],[132,0,132,7],[124,0,124,7],[126,0,126,7],[166,0,166,7],[164,0,164,5],[164,6,164,7],[165,0,165,5],[165,6,165,7],[127,0,127,7],[128,0,128,7],[94,0,94,7],[95,0,95,7],[122,0,122,5],[122,6,122,7],[123,0,123,5],[123,6,123,7],[113,0,113,7],[119,0,119,7],[120,0,120,1],[120,4,120,6],[121,0,121,1],[121,4,121,6],[89,0,89,7],[90,0,90,7],[91,0,91,7],[92,0,92,7],[93,0,93,7],[85,0,85,7],[86,0,86,7],[87,0,87,7],[88,0,88,7],[81,0,81,5],[81,6,81,7],[82,0,82,7],[84,0,84,7],[50,0,50,7],[51,0,51,7],[52,0,52,7],[53,0,53,7],[80,0,80,5],[80,6,80,7],[71,0,71,7],[77,0,77,7],[78,0,78,1],[78,4,78,6],[79,0,79,1],[79,4,79,6],[45,0,45,7],[46,0,46,7],[47,0,47,7],[48,0,48,7],[49,0,49,7],[3,0,3,7],[0,0,0,7],[1,0,1,7],[2,0,2,7],[38,0,38,5],[38,6,38,7],[7,0,7,7],[8,0,8,7],[11,0,11,7],[4,0,4,7],[5,0,5,7],[6,0,6,7],[9,0,9,7],[10,0,10,7],[29,0,29,7],[35,0,35,7],[40,0,40,7],[42,0,42,7],[43,0,43,7],[44,0,44,7],[39,0,39,5],[39,6,39,7]]}
["PART 5.G"]
["ANALYSIS SUPPLEMENTARY SHEET"]
["Check Event:"]
[]
["1.    Do not address RAC markups on this sheet.  RAC markups should be shown on the Miscellaneous Supplementary Sheet."]
["2.    Charges for analyzing samples will only be reimbursed at the intervals required by DEQ.",null,null,null,null,null,null,null,null,null,null,null,null,null,null,"Atterberg Limits (LL, PLI, PI)",56]
["3.    If the owner is directly billed for analysis, no markup allowed.",null,null,null,null,null,null,null,null,null,null,null,null,null,null,"BTEX",55]
["4.   Rush charges assessed by the laboratory to analyze a sample will not be paid when not required by DEQ.",null,null,null,null,null,null,null,null,null,null,null,null,null,null,"BTEX/MTBE",84]
["5.   (No. of Test) X (Cost Per Test) = Total",null,null,null,null,null,null,null,null,"SOIL",null,null,null,null,null,"BTEX/TPH-G",70]
["6.   See Appendix B, Table 4 of the Trust Fund Cost Control Guidance Document for rates",null,null,null,null,null,null,null,null,"WATER",null,null,null,null,null,"Dry Density-Calculated/Unit Weight Determination",22.5]
["7.   Purchase of sampling equipment (EnCores, preserved vials, etc.) should be addressed on the Part 5.H (1).",null,null,null,null,null,null,null,null,"AIR",null,null,null,null,null,"EPH Analysis",160]
[null,null,null,null,null,null,null,null,null,null,null,null,null,null,null,"Organic Matter/Fractional Organic Carbon",45]
["RAC\nINVOICE\nNO.","LAB INVOICE NUMBER","PARAMETER\n(Ex.:  BTEX, TPH-G, etc.)","METHOD USED","MEDIUM ANALYZED","NO. OF TESTS","COST PER\nTEST","TOTAL",null,null,"total",null,"Sheet total",null,null,"Hydraulic Conductivity - Constant Head",168]
[null,null,null,null,null,null,{"$f":"IF(C14>0,VLOOKUP(C14,$P$6:$Q$35,2,FALSE),\"\")","v":""},{"$f":"ROUND(IF(C14>0,(F14*G14),0),2)","v":0},"Emergency/Initial Work   ",false,{"$f":"IF(J14=TRUE,$G$39,\"\")","v":""},"Emergency/Initial Work   ",{"$f":"SUM(K14,K56,K98,K140)","v":0},null,null,"Hydraulic Conductivity - Falling Head",313.5]
[null,null,null,null,null,null,"",{"$f":"ROUND(IF(C15>0,(F15*G15),0),2)","v":0},"Investigation Work      ",false,{"$f":"IF(J15=TRUE,$G$39,\"\")","v":""},"Investigation Work      ",{"$f":"SUM(K15,K57,K99,K141)","v":0},null,null,"Lead",27]
[null,null,null,null,null,null,"",0,"Monitoring/Interim Work    ",false,"","Monitoring/Interim Work    ",{"$f":"SUM(K16,K58,K100,K142)","v":0},null,null,"Moisture Content",8]
[null,null,null,null,null,null,"",0,"Corrective Action Plan Work",false,"","Corrective Action Plan Work",{"$f":"SUM(K17,K59,K101,K143)","v":0},null,null,"MTBE",84]
[null,null,null,null,null,null,"",0,null,null,null,null,null,null,null,"Organic matter",45]
[null,null,null,null,null,null,"",0,"Emergency/Initial Work   ",{"$f":"IF(J14=TRUE,1,\"\")","v":""},null,null,null,null,null,"PAH",135]
[null,null,null,null,null,null,"",0,"Investigation Work      ",{"$f":"IF(J15=TRUE,2,\"\")","v":""},null,null,null,null,null,"Particle Size Analysis – Hydrometer",106.5]
[null,null,null,null,null,null,"",0,"Monitoring/Interim Work    ",{"$f":"IF(J16=TRUE,3,\"\")","v":""},null,null,null,null,null,"Particle Size Analysis – Sieve",56]
[null,null,null,null,null,null,"",0,"Corrective Action Plan Work",{"$f":"IF(J17=TRUE,4,\"\")","v":""},null,null,null,null,null,"RCRA Metals",135]
[null,null,null,null,null,null,"",0,null,null,null,null,null,null,null,"Soil pH",28]
[null,null,null,null,null,null,"",0,null,null,null,null,null,null,null,"Specific Gravity",100]
[null,null,null,null,null,null,"",0,null,null,null,null,null,null,null,"SPLP Analysis",40]
[null,null,null,null,null,null,"",0,null,null,null,null,null,null,null,"TCLP",40]
[null,null,null,null,null,null,"",0,null,null,null,null,null,null,null,"TOC",30]
[null,null,null,null,null,null,"",0,null,null,null,null,null,null,null,"Total Porosity - Calculated",62]
[null,null,null,null,null,null,"",0,null,null,null,null,null,null,null,"TPH-D (RECAP DRO)",65]
["USE SPACE BELOW FOR PARAMETERS/METHODS/RATES NOT LISTED/POPULATED ABOVE",null,null,null,null,null,null,null,null,null,null,null,null,null,null,"TPH-G (RECAP GRO)",45]
[null,null,null,null,null,null,null,{"$f":"ROUND(IF(C31>0,(F31*G31),0),2)","v":0},null,null,null,null,null,null,null,"TPH-O",65]
[null,null,null,null,null,null,null,{"$f":"ROUND(IF(C32>0,(F32*G32),0),2)","v":0},null,null,null,null,null,null,null,"Triaxial Permeability - Falling Head",313.5]
[null,null,null,null,null,null,null,0,null,null,null,null,null,null,null,"Unified Soil Classification System",45]
[null,null,null,null,null,null,null,0,null,null,null,null,null,null,null,"Moisture Content/Volumetric Content",8]
[null,null,null,null,null,null,null,0,null,null,null,null,null,null,null,"VPH Analysis (TPH-G Fractions)",135]
["AQUIFER TESTING EVENTS"]
["RAC Invoice No.",null,"Date of Event","No. of Wells","Rate"]
[null,null,null,null,"$1,100.00 - 1st well; $300.00 - each add. well",null,null,{"$f":"ROUND(IF(AND(C38>0,D38=1),1100,IF(AND(C38>0,D38>1),1100+(D38-1)*300,0)),2)","v":0},{"$f":"IF(J14=TRUE,$M$14,IF(J15=TRUE,$M$15,IF(J16=TRUE,$M$16,IF(J17=TRUE,$M$17,0))))","v":0}]
["SUBTOTAL OF THIS PAGE",null,null,null,null,null,{"$f":"SUM(H14:H38)","v":0}]
["TOTAL ANALYSIS COSTS",null,null,null,null,null,{"$f":"SUM(I38)","v":0},null,{"$f":"IF(G40>0,1,0)","v":0}]
["Page               of                    (Analysis Supplementary Sheet)"]
[]
["PART 5.G"]
["ANALYSIS SUPPLEMENTARY SHEET"]
["Check Event:"]
[]
["1.    Do not address RAC markups on this sheet.  RAC markups should be shown on the Miscellaneous Supplementary Sheet."]
["2.    Charges for analyzing samples will only be reimbursed at the intervals required by DEQ."]
["3.    If the owner is directly billed for analysis, no markup allowed."]
["4.   Rush charges assessed by the laboratory to analyze a sample will not be paid when not required by DEQ."]
["5.   (No. of Test) X (Cost Per Test) = Total"]
["6.   See Appendix B, Table 4 of the Trust Fund Cost Control Guidance Document for rates"]
["7.   Purchase of sampling equipment (EnCores, preserved vials, etc.) should be addressed on the Part 5.H (1)."]
[]
["RAC\nINVOICE\nNO.","LAB INVOICE NUMBER","PARAMETER\n(Ex.:  BTEX, TPH-G, etc.)","METHOD USED","MEDIUM ANALYZED","NO. OF TESTS","COST PER\nTEST","TOTAL",null,null,"total"]
[null,null,null,null,null,null,{"$f":"IF(C56>0,VLOOKUP(C56,$P$6:$Q$35,2,FALSE),\"\")","v":""},{"$f":"ROUND(IF(C56>0,(F56*G56),0),2)","v":0},"Emergency/Initial Work   ",false,{"$f":"IF(J56=TRUE,$G$81,\"\")","v":""}]
[null,null,null,null,null,null,"",{"$f":"ROUND(IF(C57>0,(F57*G57),0),2)","v":0},"Investigation Work      ",false,{"$f":"IF(J57=TRUE,$G$81,\"\")","v":""}]
[null,null,null,null,null,null,"",0,"Monitoring/Interim Work    ",false,""]
[null,null,null,null,null,null,"",0,"Corrective Action Plan Work",false,""]
[null,null,null,null,null,null,"",0]
[null,null,null,null,null,null,"",0,"Emergency/Initial Work   ",{"$f":"IF(J56=TRUE,1,\"\")","v":""}]
[null,null,null,null,null,null,"",0,"Investigation Work      ",{"$f":"IF(J57=TRUE,2,\"\")","v":""}]
[null,null,null,null,null,null,"",0,"Monitoring/Interim Work    ",{"$f":"IF(J58=TRUE,3,\"\")","v":""}]
[null,null,null,null,null,null,"",0,"Corrective Action Plan Work",{"$f":"IF(J59=TRUE,4,\"\")","v":""}]
[null,null,null,null,null,null,"",0]
[null,null,null,null,null,null,"",0]
[null,null,null,null,null,null,"",0]
[null,null,null,null,null,null,"",0]
[null,null,null,null,null,null,"",0]
[null,null,null,null,null,null,"",0]
[null,null,null,null,null,null,"",0]
["USE SPACE BELOW FOR PARAMETERS/METHODS/RATES NOT LISTED/POPULATED ABOVE"]
[null,null,null,null,null,null,null,{"$f":"ROUND(IF(C73>0,(F73*G73),0),2)","v":0}]
[null,null,null,null,null,null,null,{"$f":"ROUND(IF(C74>0,(F74*G74),0),2)","v":0}]
[null,null,null,null,null,null,null,0]
[null,null,null,null,null,null,null,0]
[null,null,null,null,null,null,null,0]
["AQUIFER TESTING EVENTS"]
["RAC Invoice No.",null,"Date of Event","No. of Wells","Rate"]
[null,null,null,null,"$1,100.00 - 1st well; $300.00 - each add. well",null,null,{"$f":"ROUND(IF(AND(C80>0,D80=1),1100,IF(AND(C80>0,D80>1),1100+(D80-1)*300,0)),2)","v":0},{"$f":"IF(J56=TRUE,$M$14,IF(J57=TRUE,$M$15,IF(J58=TRUE,$M$16,IF(J59=TRUE,$M$17,0))))","v":0}]
["SUBTOTAL OF THIS PAGE",null,null,null,null,null,{"$f":"SUM(H56:H80)","v":0}]
["TOTAL ANALYSIS COSTS",null,null,null,null,null,{"$f":"SUM(I80)","v":0},null,{"$f":"IF(G82>0,1,0)","v":0}]
["Page               of                    (Analysis Supplementary Sheet)"]
[]
["PART 5.G"]
["ANALYSIS SUPPLEMENTARY SHEET"]
["Check Event:"]
[]
["1.    Do not address RAC markups on this sheet.  RAC markups should be shown on the Miscellaneous Supplementary Sheet."]
["2.    Charges for analyzing samples will only be reimbursed at the intervals required by DEQ."]
["3.    If the owner is directly billed for analysis, no markup allowed."]
["4.   Rush charges assessed by the laboratory to analyze a sample will not be paid when not required by DEQ."]
["5.   (No. of Test) X (Cost Per Test) = Total"]
["6.   See Appendix B, Table 4 of the Trust Fund Cost Control Guidance Document for rates"]
["7.   Purchase of sampling equipment (EnCores, preserved vials, etc.) should be addressed on the Part 5.H (1)."]
[]
["RAC\nINVOICE\nNO.","LAB INVOICE NUMBER","PARAMETER\n(Ex.:  BTEX, TPH-G, etc.)","METHOD USED","MEDIUM ANALYZED","NO. OF TESTS","COST PER\nTEST","TOTAL",null,null,"total"]
[null,null,null,null,null,null,{"$f":"IF(C98>0,VLOOKUP(C98,$P$6:$Q$35,2,FALSE),\"\")","v":""},{"$f":"ROUND(IF(C98>0,(F98*G98),0),2)","v":0},"Emergency/Initial Work   ",false,{"$f":"IF(J98=TRUE,$G$123,\"\")","v":""}]
[null,null,null,null,null,null,"",{"$f":"ROUND(IF(C99>0,(F99*G99),0),2)","v":0},"Investigation Work      ",false,{"$f":"IF(J99=TRUE,$G$123,\"\")","v":""}]
[null,null,null,null,null,null,"",0,"Monitoring/Interim Work    ",false,""]
[null,null,null,null,null,null,"",0,"Corrective Action Plan Work",false,""]
[null,null,null,null,null,null,"",0]
[null,null,null,null,null,null,"",0,"Emergency/Initial Work   ",{"$f":"IF(J98=TRUE,1,\"\")","v":""}]
[null,null,null,null,null,null,"",0,"Investigation Work      ",{"$f":"IF(J99=TRUE,2,\"\")","v":""}]
[null,null,null,null,null,null,"",0,"Monitoring/Interim Work    ",{"$f":"IF(J100=TRUE,3,\"\")","v":""}]
[null,null,null,null,null,null,"",0,"Corrective Action Plan Work",{"$f":"IF(J101=TRUE,4,\"\")","v":""}]
[null,null,null,null,null,null,"",0]
[null,null,null,null,null,null,"",0]
[null,null,null,null,null,null,"",0]
[null,null,null,null,null,null,"",0]
[null,null,null,null,null,null,"",0]
[null,null,null,null,null,null,"",0]
[null,null,null,null,null,null,"",0]
["USE SPACE BELOW FOR PARAMETERS/METHODS/RATES NOT LISTED/POPULATED ABOVE"]
[null,null,null,null,null,null,null,{"$f":"ROUND(IF(C115>0,(F115*G115),0),2)","v":0}]
[null,null,null,null,null,null,null,{"$f":"ROUND(IF(C116>0,(F116*G116),0),2)","v":0}]
[null,null,null,null,null,null,null,0]
[null,null,null,null,null,null,null,0]
[null,null,null,null,null,null,null,0]
["AQUIFER TESTING EVENTS"]
["RAC Invoice No.",null,"Date of Event","No. of Wells","Rate"]
[null,null,null,null,"$1,100.00 - 1st well; $300.00 - each add. well",null,null,{"$f":"ROUND(IF(AND(C122>0,D122=1),1100,IF(AND(C122>0,D122>1),1100+(D122-1)*300,0)),2)","v":0},{"$f":"IF(J98=TRUE,$M$14,IF(J99=TRUE,$M$15,IF(J100=TRUE,$M$16,IF(J101=TRUE,$M$17,0))))","v":0}]
["SUBTOTAL OF THIS PAGE",null,null,null,null,null,{"$f":"SUM(H98:H122)","v":0}]
["TOTAL ANALYSIS COSTS",null,null,null,null,null,{"$f":"SUM(I122)","v":0},null,{"$f":"IF(G124>0,1,0)","v":0}]
["Page               of                    (Analysis Supplementary Sheet)"]
[]
["PART 5.G"]
["ANALYSIS SUPPLEMENTARY SHEET"]
["Check Event:"]
[]
["1.    Do not address RAC markups on this sheet.  RAC markups should be shown on the Miscellaneous Supplementary Sheet."]
["2.    Charges for analyzing samples will only be reimbursed at the intervals required by DEQ."]
["3.    If the owner is directly billed for analysis, no markup allowed."]
["4.   Rush charges assessed by the laboratory to analyze a sample will not be paid when not required by DEQ."]
["5.   (No. of Test) X (Cost Per Test) = Total"]
["6.   See Appendix B, Table 4 of the Trust Fund Cost Control Guidance Document for rates"]
["7.   Purchase of sampling equipment (EnCores, preserved vials, etc.) should be addressed on the Part 5.H (1)."]
[]
["RAC\nINVOICE\nNO.","LAB INVOICE NUMBER","PARAMETER\n(Ex.:  BTEX, TPH-G, etc.)","METHOD USED","MEDIUM ANALYZED","NO. OF TESTS","COST PER\nTEST","TOTAL",null,null,"total"]
[null,null,null,null,null,null,{"$f":"IF(C140>0,VLOOKUP(C140,$P$6:$Q$35,2,FALSE),\"\")","v":""},{"$f":"ROUND(IF(C140>0,(F140*G140),0),2)","v":0},"Emergency/Initial Work   ",false,{"$f":"IF(J140=TRUE,$G$165,\"\")","v":""}]
[null,null,null,null,null,null,"",{"$f":"ROUND(IF(C141>0,(F141*G141),0),2)","v":0},"Investigation Work      ",false,{"$f":"IF(J141=TRUE,$G$165,\"\")","v":""}]
[null,null,null,null,null,null,"",0,"Monitoring/Interim Work    ",false,""]
[null,null,null,null,null,null,"",0,"Corrective Action Plan Work",false,""]
[null,null,null,null,null,null,"",0]
[null,null,null,null,null,null,"",0,"Emergency/Initial Work   ",{"$f":"IF(J140=TRUE,1,\"\")","v":""}]
[null,null,null,null,null,null,"",0,"Investigation Work      ",{"$f":"IF(J141=TRUE,2,\"\")","v":""}]
[null,null,null,null,null,null,"",0,"Monitoring/Interim Work    ",{"$f":"IF(J142=TRUE,3,\"\")","v":""}]
[null,null,null,null,null,null,"",0,"Corrective Action Plan Work",{"$f":"IF(J143=TRUE,4,\"\")","v":""}]
[null,null,null,null,null,null,"",0]
[null,null,null,null,null,null,"",0]
[null,null,null,null,null,null,"",0]
[null,null,null,null,null,null,"",0]
[null,null,null,null,null,null,"",0]
[null,null,null,null,null,null,"",0]
[null,null,null,null,null,null,"",0]
["USE SPACE BELOW FOR PARAMETERS/METHODS/RATES NOT LISTED/POPULATED ABOVE"]
[null,null,null,null,null,null,null,{"$f":"ROUND(IF(C157>0,(F157*G157),0),2)","v":0}]
[null,null,null,null,null,null,null,{"$f":"ROUND(IF(C158>0,(F158*G158),0),2)","v":0}]
[null,null,null,null,null,null,null,0]
[null,null,null,null,null,null,null,0]
[null,null,null,null,null,null,null,0]
["AQUIFER TESTING EVENTS"]
["RAC Invoice No.",null,"Date of Event","No. of Wells","Rate"]
[null,null,null,null,"$1,100.00 - 1st well; $300.00 - each add. well",null,null,{"$f":"ROUND(IF(AND(C164>0,D164=1),1100,IF(AND(C164>0,D164>1),1100+(D164-1)*300,0)),2)","v":0},{"$f":"IF(J140=TRUE,$M$14,IF(J141=TRUE,$M$15,IF(J142=TRUE,$M$16,IF(J143=TRUE,$M$17,0))))","v":0}]
["SUBTOTAL OF THIS PAGE",null,null,null,null,null,{"$f":"SUM(H140:H164)","v":0}]
["TOTAL ANALYSIS COSTS",null,null,null,null,null,{"$f":"SUM(I164)","v":0},null,{"$f":"IF(G166>0,1,0)","v":0}]
["Page               of                    (Analysis Supplementary Sheet)"]

{"sheet":"Miscellaneous 1","index":15,"n_rows":252,"n_cols":19,"rows_kept":252,"cut":false,"hidden":false,"merged":[[229,3,229,4],[230,3,230,4],[231,3,231,4],[232,3,232,4],[233,3,233,4],[234,3,234,4],[235,3,235,4],[236,3,236,4],[237,3,237,4],[251,0,251,2],[238,3,238,4],[239,3,239,4],[240,3,240,4],[241,3,241,4],[242,3,242,4],[243,3,243,4],[244,3,244,4],[245,3,245,4],[246,3,246,4],[250,0,250,2],[250,3,250,4],[247,3,247,4],[248,3,248,4],[249,0,249,2],[249,3,249,4],[226,3,226,4],[227,3,227,4],[228,3,228,4],[210,0,210,4],[211,0,211,4],[212,0,212,4],[213,0,213,4],[215,0,215,4],[216,0,216,4],[217,0,217,4],[218,0,218,4],[219,3,219,4],[220,3,220,4],[221,3,221,4],[222,3,222,4],[223,3,223,4],[224,3,224,4],[225,3,225,4],[204,3,204,4],[206,3,206,4],[207,0,207,2],[207,3,207,4],[209,0,209,2],[199,3,199,4],[200,3,200,4],[201,3,201,4],[202,3,202,4],[203,3,203,4],[208,0,208,2],[208,3,208,4],[205,3,205,4],[194,3,194,4],[195,3,195,4],[196,3,196,4],[197,3,197,4],[198,3,198,4],[189,3,189,4],[190,3,190,4],[191,3,191,4],[192,3,192,4],[193,3,193,4],[184,3,184,4],[185,3,185,4],[186,3,186,4],[187,3,187,4],[188,3,188,4],[179,3,179,4],[180,3,180,4],[181,3,181,4],[182,3,182,4],[183,3,183,4],[174,0,174,4],[175,0,175,4],[176,0,176,4],[177,3,177,4],[178,3,178,4],[168,0,168,4],[169,0,169,4],[170,0,170,4],[171,0,171,4],[173,0,173,4],[162,3,162,4],[164,3,164,4],[165,0,165,2],[165,3,165,4],[167,0,167,2],[157,3,157,4],[158,3,158,4],[159,3,159,4],[160,3,160,4],[161,3,161,4],[163,3,163,4],[152,3,152,4],[153,3,153,4],[154,3,154,4],[155,3,155,4],[156,3,156,4],[147,3,147,4],[148,3,148,4],[149,3,149,4],[150,3,150,4],[151,3,151,4],[142,3,142,4],[143,3,143,4],[144,3,144,4],[145,3,145,4],[146,3,146,4],[137,3,137,4],[138,3,138,4],[139,3,139,4],[140,3,140,4],[141,3,141,4],[132,0,132,4],[133,0,133,4],[134,0,134,4],[135,3,135,4],[136,3,136,4],[126,0,126,4],[127,0,127,4],[128,0,128,4],[129,0,129,4],[131,0,131,4],[120,3,120,4],[122,3,122,4],[123,0,123,2],[123,3,123,4],[125,0,125,2],[115,3,115,4],[116,3,116,4],[117,3,117,4],[118,3,118,4],[119,3,119,4],[121,3,121,4],[110,3,110,4],[111,3,111,4],[112,3,112,4],[113,3,113,4],[114,3,114,4],[105,3,105,4],[106,3,106,4],[107,3,107,4],[108,3,108,4],[109,3,109,4],[100,3,100,4],[101,3,101,4],[102,3,102,4],[103,3,103,4],[104,3,104,4],[95,3,95,4],[96,3,96,4],[97,3,97,4],[98,3,98,4],[99,3,99,4],[90,0,90,4],[91,0,91,4],[92,0,92,4],[93,3,93,4],[94,3,94,4],[84,0,84,4],[85,0,85,4],[86,0,86,4],[87,0,87,4],[89,0,89,4],[79,3,79,4],[80,3,80,4],[81,0,81,2],[81,3,81,4],[83,0,83,2],[73,3,73,4],[74,3,74,4],[75,3,75,4],[76,3,76,4],[77,3,77,4],[78,3,78,4],[68,3,68,4],[69,3,69,4],[70,3,70,4],[71,3,71,4],[72,3,72,4],[63,3,63,4],[64,3,64,4],[65,3,65,4],[66,3,66,4],[67,3,67,4],[58,3,58,4],[59,3,59,4],[60,3,60,4],[61,3,61,4],[62,3,62,4],[53,3,53,4],[54,3,54,4],[55,3,55,4],[56,3,56,4],[57,3,57,4],[12,3,12,4],[14,3,14,4],[48,0,48,4],[49,0,49,4],[50,0,50,4],[51,3,51,4],[52,3,52,4],[42,0,42,4],[43,0,43,4],[44,0,44,4],[45,0,45,4],[47,0,47,4],[37,3,37,4],[33,3,33,4],[39,3,39,4],[34,3,34,4],[35,3,35,4],[36,3,36,4],[38,3,38,4],[28,3,28,4],[29,3,29,4],[30,3,30,4],[31,3,31,4],[32,3,32,4],[0,0,0,4],[1,0,1,4],[2,0,2,4],[3,0,3,4],[5,0,5,4],[9,3,9,4],[6,0,6,4],[10,3,10,4],[11,3,11,4],[7,0,7,4],[8,0,8,4],[40,0,40,2],[40,3,40,4],[82,0,82,2],[82,3,82,4],[124,0,124,2],[124,3,124,4],[166,0,166,2],[166,3,166,4],[13,3,13,4],[19,3,19,4],[15,3,15,4],[16,3,16,4],[17,3,17,4],[18,3,18,4],[23,3,23,4],[24,3,24,4],[25,3,25,4],[26,3,26,4],[27,3,27,4],[41,0,41,2],[39,0,39,2],[20,3,20,4],[21,3,21,4],[22,3,22,4]]}
["PART 5.H (1)"]
["MISCELLANEOUS SUPPLEMENTARY SHEET"]
["Check Event:"]
[]
[]
["1. All costs not associated with the previous categories should be listed here. (Ex.: utility charges, DOTD or DNR permits/maps,"]
["    DEQ permits, surveying charges, subcontracted drafting charges, purchases of supplies, disposal of sampling kits and bailing kits)"]
["2. Miscellaneous charges for work activities addressed in unit pricing should not be addressed on this form."]
["3. All markups allowed to the RAC should be identified on this sheet."]
["DESCRIPTION OF EACH\nMISCELLANEOUS ITEM AND NO. OF\nITEMS","RAC\nINVOICE NO.","OUTSIDE\nINVOICE\nNO.","COST",null,null,null,null,"TOTAL",null,"Sheet total"]
[null,null,null,null,null,null,"Emergency/Initial Work   ",false,{"$f":"IF(H11=TRUE,$D$40,\"\")","v":""},"Emergency/Initial Work   ",{"$f":"SUM(I11,I53,I95,I137,I179,I221)","v":0},null,null,null,null,null,null,null,{"$f":"IF(H11=TRUE,1,\"\")","v":""}]
[null,null,null,null,null,null,"Investigation Work      ",false,{"$f":"IF(H12=TRUE,$D$40,\"\")","v":""},"Investigation Work      ",{"$f":"SUM(I12,I54,I96,I138,I180,I222)","v":0},null,null,null,null,null,null,null,{"$f":"IF(H12=TRUE,2,\"\")","v":""}]
[null,null,null,null,null,null,"Monitoring/Interim Work        ",false,"","Monitoring/Interim Work        ",{"$f":"SUM(I13,I55,I97,I139,I181,I223)","v":0},null,null,null,null,null,null,null,{"$f":"IF(H13=TRUE,3,\"\")","v":""}]
[null,null,null,null,null,null,"Corrective Action Plan Work",false,"","Corrective Action Plan Work",{"$f":"SUM(I14,I56,I98,I140,I182,I224)","v":0},null,null,null,null,null,null,null,{"$f":"IF(H14=TRUE,4,\"\")","v":""}]
[null,null,null,null,null,null,"Report Preparation ",false,"","Report Preparation ",{"$f":"SUM(I15,I57,I99,I141,I183,I225)","v":0},null,null,null,null,null,null,null,{"$f":"IF(H15=TRUE,5,\"\")","v":""}]
[]
[]
[null,null,null,null,null,null,"MIS 2","box 1-4","box 5-8","box8-12","box13-16",null,"MIS 2"]
[null,null,null,null,null,null,"Emergency/Initial Work   ",{"$f":"'Miscellaneous 2'!K9","v":false},{"$f":"'Miscellaneous 2'!K59","v":false},{"$f":"'Miscellaneous 2'!K109","v":false},{"$f":"'Miscellaneous 2'!K159","v":false},null,"Emergency/Initial Work   ",{"$f":"IF(H19=FALSE,0,1)","v":0},{"$f":"IF(I19=FALSE,0,1)","v":0},0,0,{"$f":"SUM(N19:Q19)","v":0}]
[null,null,null,null,null,null,"Investigation Work      ",{"$f":"'Miscellaneous 2'!K10","v":false},{"$f":"'Miscellaneous 2'!K60","v":false},{"$f":"'Miscellaneous 2'!K110","v":false},{"$f":"'Miscellaneous 2'!K160","v":false},null,"Investigation Work      ",{"$f":"IF(H20=FALSE,0,1)","v":0},{"$f":"IF(I20=FALSE,0,1)","v":0},{"$f":"IF(J20=FALSE,0,1)","v":0},{"$f":"IF(K20=FALSE,0,1)","v":0},{"$f":"SUM(N20:Q20)","v":0}]
[null,null,null,null,null,null,"Monitoring/Interim Work        ",{"$f":"'Miscellaneous 2'!K11","v":false},{"$f":"'Miscellaneous 2'!K61","v":false},{"$f":"'Miscellaneous 2'!K111","v":false},{"$f":"'Miscellaneous 2'!K161","v":false},null,"Monitoring/Interim Work        ",0,0,0,0,0]
[null,null,null,null,null,null,"Corrective Action Plan Work",{"$f":"'Miscellaneous 2'!K12","v":false},{"$f":"'Miscellaneous 2'!K62","v":false},{"$f":"'Miscellaneous 2'!K112","v":false},{"$f":"'Miscellaneous 2'!K162","v":false},null,"Corrective Action Plan Work",0,0,0,0,0]
[]
[null,null,null,null,null,null,"MIS3","box 1-5","box 6-10","box11-15","box16-20","box20-25","MIS3"]
[null,null,null,null,null,null,"Emergency/Initial Work   ",{"$f":"'Miscellaneous 2'!K18","v":false},{"$f":"'Miscellaneous 2'!L18","v":false},{"$f":"'Miscellaneous 2'!M18","v":false},{"$f":"'Miscellaneous 2'!N18","v":false},{"$f":"'Miscellaneous 2'!O18","v":false},"Emergency/Initial Work   ",{"$f":"IF(H25=FALSE,0,1)","v":0},{"$f":"IF(I25=FALSE,0,1)","v":0},0,0,{"$f":"SUM(N25:Q25)","v":0}]
[null,null,null,null,null,null,"Investigation Work      ",{"$f":"'Miscellaneous 2'!K19","v":false},{"$f":"'Miscellaneous 2'!L19","v":false},{"$f":"'Miscellaneous 2'!M19","v":false},{"$f":"'Miscellaneous 2'!N19","v":false},{"$f":"'Miscellaneous 2'!O19","v":false},"Investigation Work      ",{"$f":"IF(H26=FALSE,0,1)","v":0},0,0,0,{"$f":"SUM(N26:Q26)","v":0}]
[null,null,null,null,null,null,"Monitoring/Interim Work        ",{"$f":"'Miscellaneous 2'!K20","v":false},{"$f":"'Miscellaneous 2'!L20","v":false},{"$f":"'Miscellaneous 2'!M20","v":false},{"$f":"'Miscellaneous 2'!N20","v":false},{"$f":"'Miscellaneous 2'!O20","v":false},"Monitoring/Interim Work        ",0,0,0,0,0]
[null,null,null,null,null,null,"Corrective Action Plan Work",{"$f":"'Miscellaneous 2'!K21","v":false},{"$f":"'Miscellaneous 2'!L21","v":false},{"$f":"'Miscellaneous 2'!M21","v":false},{"$f":"'Miscellaneous 2'!N21","v":false},{"$f":"'Miscellaneous 2'!O21","v":false},"Corrective Action Plan Work",0,0,0,0,0]
[]
[]
[null,null,null,null,null,null,"Emergency/Initial Work   ",{"$f":"(R19+R25)","v":0},{"$f":"IF(H31>=1,TRUE,FALSE)","v":false}]
[null,null,null,null,null,null,"Investigation Work      ",{"$f":"(R20+R26)","v":0},{"$f":"IF(H32>=1,TRUE,FALSE)","v":false}]
[null,null,null,null,null,null,"Monitoring/Interim Work        ",0,{"$f":"IF(H33>=1,TRUE,FALSE)","v":false}]
[null,null,null,null,null,null,"Corrective Action Plan Work",0,{"$f":"IF(H34>=1,TRUE,FALSE)","v":false}]
[]
[]
[]
[]
[null,null,null,null,null,null,{"$f":"IF(H11=TRUE,$K$11,IF(H12=TRUE,$K$12,IF(H13=TRUE,$K$13,IF(H14=TRUE,$K$14,IF(H15=TRUE,$K$15,0)))))","v":0}]
["SUBTOTAL OF THIS PAGE",null,null,{"$f":"SUM(D11:E39)","v":0},null,null,{"$f":"SUM(G39)","v":0},{"$f":"IF(G40>0,1,0)","v":0}]
["MISCELLANEOUS TOTAL",null,null,{"$f":"G41","v":""},null,null,{"$f":"IF(AND(H11=TRUE,$I$31=FALSE),$K$11,IF(AND(H12=TRUE,$I$32=FALSE),$K$12,IF(AND(H13=TRUE,$I$33=FALSE),$K$13,IF(AND(H14=TRUE,$I$34=FALSE),$K$14,\"\"))))","v":""}]
["Page                 of                  (Miscellaneous Supplementary Sheet)"]
["PART 5.H (1)"]
["MISCELLANEOUS SUPPLEMENTARY SHEET"]
["Check Event:"]
[]
[]
["1. All costs not associated with the previous categories should be listed here. (Ex.: utility charges, DOTD or DNR permits/maps,"]
["    DEQ permits, surveying charges, subcontracted drafting charges, purchases of supplies, disposal of sampling kits and bailing kits)"]
["2. Miscellaneous charges for work activities addressed in unit pricing should not be addressed on this form."]
["3.   All markups allowed to the RAC should be identified on this sheet."]
["DESCRIPTION OF EACH\nMISCELLANEOUS ITEM AND NO. OF\nITEMS","RAC\nINVOICE NO.","OUTSIDE\nINVOICE\nNO.","COST",null,null,null,null,"TOTAL"]
[null,null,null,null,null,null,"Emergency/Initial Work   ",false,{"$f":"IF(H53=TRUE,$D$82,\"\")","v":""},null,null,null,null,null,null,null,null,null,{"$f":"IF(H53=TRUE,1,\"\")","v":""}]
[null,null,null,null,null,null,"Investigation Work      ",false,{"$f":"IF(H54=TRUE,$D$82,\"\")","v":""},null,null,null,null,null,null,null,null,null,{"$f":"IF(H54=TRUE,2,\"\")","v":""}]
[null,null,null,null,null,null,"Monitoring/Interim Work        ",false,"",null,null,null,null,null,null,null,null,null,{"$f":"IF(H55=TRUE,3,\"\")","v":""}]
[null,null,null,null,null,null,"Corrective Action Plan Work",false,"",null,null,null,null,null,null,null,null,null,{"$f":"IF(H56=TRUE,4,\"\")","v":""}]
[null,null,null,null,null,null,"Report Preparation ",false,"",null,null,null,null,null,null,null,null,null,{"$f":"IF(H57=TRUE,5,\"\")","v":""}]
[]
[]
[]
[]
[]
[]
[]
[]
[]
[]
[]
[]
[]
[]
[]
[]
[]
[]
[]
[]
[]
[]
[]
[null,null,null,null,null,null,{"$f":"IF(H53=TRUE,$K$11,IF(H54=TRUE,$K$12,IF(H55=TRUE,$K$13,IF(H56=TRUE,$K$14,IF(H57=TRUE,$K$15,0)))))","v":0}]
["SUBTOTAL OF THIS PAGE",null,null,{"$f":"SUM(D53:E81)","v":0},null,null,{"$f":"SUM(G81)","v":0},{"$f":"IF(G82>0,1,0)","v":0}]
["MISCELLANEOUS TOTAL",null,null,{"$f":"G83","v":""},null,null,{"$f":"IF(AND(H53=TRUE,$I$31=FALSE),$K$11,IF(AND(H54=TRUE,$I$32=FALSE),$K$12,IF(AND(H55=TRUE,$I$33=FALSE),$K$13,IF(AND(H56=TRUE,$I$34=FALSE),$K$14,\"\"))))","v":""}]
["Page                 of                  (Miscellaneous Supplementary Sheet)"]
["PART 5.H (1)"]
["MISCELLANEOUS SUPPLEMENTARY SHEET"]
["Check Event:"]
[]
[]
["1. All costs not associated with the previous categories should be listed here. (Ex.: utility charges, DOTD or DNR permits/maps,"]
["    DEQ permits, surveying charges, subcontracted drafting charges, purchases of supplies, disposal of sampling kits and bailing kits)"]
["2. Miscellaneous charges for work activities addressed in unit pricing should not be addressed on this form."]
["3.   All markups allowed to the RAC should be identified on this sheet."]
["DESCRIPTION OF EACH\nMISCELLANEOUS ITEM AND NO. OF\nITEMS","RAC\nINVOICE NO.","OUTSIDE\nINVOICE\nNO.","COST",null,null,null,null,"TOTAL"]
[null,null,null,null,null,null,"Emergency/Initial Work   ",false,{"$f":"IF(H95=TRUE,$D$124,\"\")","v":""},null,null,null,null,null,null,null,null,null,{"$f":"IF(H95=TRUE,1,\"\")","v":""}]
[null,null,null,null,null,null,"Investigation Work      ",false,{"$f":"IF(H96=TRUE,$D$124,\"\")","v":""},null,null,null,null,null,null,null,null,null,{"$f":"IF(H96=TRUE,2,\"\")","v":""}]
[null,null,null,null,null,null,"Monitoring/Interim Work        ",false,"",null,null,null,null,null,null,null,null,null,{"$f":"IF(H97=TRUE,3,\"\")","v":""}]
[null,null,null,null,null,null,"Corrective Action Plan Work",false,"",null,null,null,null,null,null,null,null,null,{"$f":"IF(H98=TRUE,4,\"\")","v":""}]
[null,null,null,null,null,null,"Report Preparation ",false,"",null,null,null,null,null,null,null,null,null,{"$f":"IF(H99=TRUE,5,\"\")","v":""}]
[]
[]
[]
[]
[]
[]
[]
[]
[]
[]
[]
[]
[]
[]
[]
[]
[]
[]
[]
[]
[]
[]
[]
[null,null,null,null,null,null,{"$f":"IF(H95=TRUE,$K$11,IF(H96=TRUE,$K$12,IF(H97=TRUE,$K$13,IF(H98=TRUE,$K$14,IF(H99=TRUE,$K$15,0)))))","v":0}]
["SUBTOTAL OF THIS PAGE",null,null,{"$f":"SUM(D95:E123)","v":0},null,null,{"$f":"SUM(G123)","v":0},{"$f":"IF(G124>0,1,0)","v":0}]
["MISCELLANEOUS TOTAL",null,null,{"$f":"G125","v":""},null,null,{"$f":"IF(AND(H95=TRUE,$I$31=FALSE),$K$11,IF(AND(H96=TRUE,$I$32=FALSE),$K$12,IF(AND(H97=TRUE,$I$33=FALSE),$K$13,IF(AND(H98=TRUE,$I$34=FALSE),$K$14,\"\"))))","v":""}]
["Page                 of                  (Miscellaneous Supplementary Sheet)"]
["PART 5.H (1)"]
["MISCELLANEOUS SUPPLEMENTARY SHEET"]
["Check Event:"]
[]
[]
["1. All costs not associated with the previous categories should be listed here. (Ex.: utility charges, DOTD or DNR permits/maps,"]
["    DEQ permits, surveying charges, subcontracted drafting charges, purchases of supplies, disposal of sampling kits and bailing kits)"]
["2. Miscellaneous charges for work activities addressed in unit pricing should not be addressed on this form."]
["3.   All markups allowed to the RAC should be identified on this sheet."]
["DESCRIPTION OF EACH\nMISCELLANEOUS ITEM AND NO. OF\nITEMS","RAC\nINVOICE NO.","OUTSIDE\nINVOICE\nNO.","COST",null,null,null,null,"TOTAL"]
[null,null,null,null,null,null,"Emergency/Initial Work   ",false,{"$f":"IF(H137=TRUE,$D$166,\"\")","v":""},null,null,null,null,null,null,null,null,null,{"$f":"IF(H137=TRUE,1,\"\")","v":""}]
[null,null,null,null,null,null,"Investigation Work      ",false,{"$f":"IF(H138=TRUE,$D$166,\"\")","v":""},null,null,null,null,null,null,null,null,null,{"$f":"IF(H138=TRUE,2,\"\")","v":""}]
[null,null,null,null,null,null,"Monitoring/Interim Work        ",false,"",null,null,null,null,null,null,null,null,null,{"$f":"IF(H139=TRUE,3,\"\")","v":""}]
[null,null,null,null,null,null,"Corrective Action Plan Work",false,"",null,null,null,null,null,null,null,null,null,{"$f":"IF(H140=TRUE,4,\"\")","v":""}]
[null,null,null,null,null,null,"Report Preparation ",false,"",null,null,null,null,null,null,null,null,null,{"$f":"IF(H141=TRUE,5,\"\")","v":""}]
[]
[]
[]
[]
[]
[]
[]
[]
[]
[]
[]
[]
[]
[]
[]
[]
[]
[]
[]
[]
[]
[]
[]
[null,null,null,null,null,null,{"$f":"IF(H137=TRUE,$K$11,IF(H138=TRUE,$K$12,IF(H139=TRUE,$K$13,IF(H140=TRUE,$K$14,IF(H141=TRUE,$K$15,0)))))","v":0}]
["SUBTOTAL OF THIS PAGE",null,null,{"$f":"SUM(D137:E165)","v":0},null,null,{"$f":"SUM(G165)","v":0},{"$f":"IF(G166>0,1,0)","v":0}]
["MISCELLANEOUS TOTAL",null,null,{"$f":"G167","v":""},null,null,{"$f":"IF(AND(H137=TRUE,$I$31=FALSE),$K$11,IF(AND(H138=TRUE,$I$32=FALSE),$K$12,IF(AND(H139=TRUE,$I$33=FALSE),$K$13,IF(AND(H140=TRUE,$I$34=FALSE),$K$14,\"\"))))","v":""}]
["Page                 of                  (Miscellaneous Supplementary Sheet)"]
["PART 5.H (1)"]
["MISCELLANEOUS SUPPLEMENTARY SHEET"]
["Check Event:"]
[]
[]
["1. All costs not associated with the previous categories should be listed here. (Ex.: utility charges, DOTD or DNR permits/maps,"]
["    DEQ permits, surveying charges, subcontracted drafting charges, purchases of supplies, disposal of sampling kits and bailing kits)"]
["2. Miscellaneous charges for work activities addressed in unit pricing should not be addressed on this form."]
["3.   All markups allowed to the RAC should be identified on this sheet."]
["DESCRIPTION OF EACH\nMISCELLANEOUS ITEM AND NO. OF\nITEMS","RAC\nINVOICE NO.","OUTSIDE\nINVOICE\nNO.","COST",null,null,null,null,"TOTAL"]
[null,null,null,null,null,null,"Emergency/Initial Work   ",false,{"$f":"IF(H179=TRUE,$D$208,\"\")","v":""},null,null,null,null,null,null,null,null,null,{"$f":"IF(H179=TRUE,1,\"\")","v":""}]
[null,null,null,null,null,null,"Investigation Work      ",false,{"$f":"IF(H180=TRUE,$D$208,\"\")","v":""},null,null,null,null,null,null,null,null,null,{"$f":"IF(H180=TRUE,2,\"\")","v":""}]
[null,null,null,null,null,null,"Monitoring/Interim Work        ",false,"",null,null,null,null,null,null,null,null,null,{"$f":"IF(H181=TRUE,3,\"\")","v":""}]
[null,null,null,null,null,null,"Corrective Action Plan Work",false,"",null,null,null,null,null,null,null,null,null,{"$f":"IF(H182=TRUE,4,\"\")","v":""}]
[null,null,null,null,null,null,"Report Preparation ",false,"",null,null,null,null,null,null,null,null,null,{"$f":"IF(H183=TRUE,5,\"\")","v":""}]
[]
[]
[]
[]
[]
[]
[]
[]
[]
[]
[]
[]
[]
[]
[]
[]
[]
[]
[]
[]
[]
[]
[]
[null,null,null,null,null,null,{"$f":"IF(H179=TRUE,$K$11,IF(H180=TRUE,$K$12,IF(H181=TRUE,$K$13,IF(H182=TRUE,$K$14,IF(H183=TRUE,$K$15,0)))))","v":0}]
["SUBTOTAL OF THIS PAGE",null,null,{"$f":"SUM(D179:E207)","v":0},null,null,{"$f":"SUM(G207)","v":0},{"$f":"IF(G208>0,1,0)","v":0}]
["MISCELLANEOUS TOTAL",null,null,{"$f":"G209","v":""},null,null,{"$f":"IF(AND(H179=TRUE,$I$31=FALSE),$K$11,IF(AND(H180=TRUE,$I$32=FALSE),$K$12,IF(AND(H181=TRUE,$I$33=FALSE),$K$13,IF(AND(H182=TRUE,$I$34=FALSE),$K$14,\"\"))))","v":""}]
["Page                 of                  (Miscellaneous Supplementary Sheet)"]
["PART 5.H (1)"]
["MISCELLANEOUS SUPPLEMENTARY SHEET"]
["Check Event:"]
[]
[]
["1. All costs not associated with the previous categories should be listed here. (Ex.: utility charges, DOTD or DNR permits/maps,"]
["    DEQ permits, surveying charges, subcontracted drafting charges, purchases of supplies, disposal of sampling kits and bailing kits)"]
["2. Miscellaneous charges for work activities addressed in unit pricing should not be addressed on this form."]
["3.   All markups allowed to the RAC should be identified on this sheet."]
["DESCRIPTION OF EACH\nMISCELLANEOUS ITEM AND NO. OF\nITEMS","RAC\nINVOICE NO.","OUTSIDE\nINVOICE\nNO.","COST",null,null,null,null,"TOTAL"]
[null,null,null,null,null,null,"Emergency/Initial Work   ",false,{"$f":"IF(H221=TRUE,$D$250,\"\")","v":""},null,null,null,null,null,null,null,null,null,{"$f":"IF(H221=TRUE,1,\"\")","v":""}]
[null,null,null,null,null,null,"Investigation Work      ",false,{"$f":"IF(H222=TRUE,$D$250,\"\")","v":""},null,null,null,null,null,null,null,null,null,{"$f":"IF(H222=TRUE,2,\"\")","v":""}]
[null,null,null,null,null,null,"Monitoring/Interim Work        ",false,"",null,null,null,null,null,null,null,null,null,{"$f":"IF(H223=TRUE,3,\"\")","v":""}]
[null,null,null,null,null,null,"Corrective Action Plan Work",false,"",null,null,null,null,null,null,null,null,null,{"$f":"IF(H224=TRUE,4,\"\")","v":""}]
[null,null,null,null,null,null,"Report Preparation ",false,"",null,null,null,null,null,null,null,null,null,{"$f":"IF(H225=TRUE,5,\"\")","v":""}]
[]
[]
[]
[]
[]
[]
[]
[]
[]
[]
[]
[]
[]
[]
[]
[]
[]
[]
[]
[]
[]
[]
[]
[null,null,null,null,null,null,{"$f":"IF(H221=TRUE,$K$11,IF(H222=TRUE,$K$12,IF(H223=TRUE,$K$13,IF(H224=TRUE,$K$14,IF(H225=TRUE,$K$15,0)))))","v":0}]
["SUBTOTAL OF THIS PAGE",null,null,{"$f":"SUM(D221:E249)","v":0},null,null,{"$f":"SUM(G249)","v":0},{"$f":"IF(G250>0,1,0)","v":0}]
["MISCELLANEOUS TOTAL",null,null,{"$f":"G251","v":""},null,"`",{"$f":"IF(AND(H221=TRUE,$I$31=FALSE),$K$11,IF(AND(H222=TRUE,$I$32=FALSE),$K$12,IF(AND(H223=TRUE,$I$33=FALSE),$K$13,IF(AND(H224=TRUE,$I$34=FALSE),$K$14,\"\"))))","v":""}]
["Page                 of                  (Miscellaneous Supplementary Sheet)"]

{"sheet":"Miscellaneous 2","index":16,"n_rows":200,"n_cols":24,"rows_kept":200,"cut":false,"hidden":false,"merged":[[95,7,96,7],[96,0,96,1],[96,2,96,4],[103,0,103,7],[104,0,104,7],[105,0,105,4],[106,6,112,6],[106,7,112,7],[47,0,47,4],[97,0,97,4],[97,5,97,7],[101,0,101,7],[93,3,93,4],[75,6,85,6],[75,7,85,7],[79,2,79,3],[80,2,80,4],[86,0,86,4],[86,6,90,6],[86,7,90,7],[91,6,94,6],[114,0,114,3],[120,0,120,3],[106,0,106,3],[107,0,107,3],[98,0,98,4],[113,0,113,3],[99,0,99,5],[102,0,102,7],[119,0,119,3],[119,6,124,6],[119,7,124,7],[130,2,130,4],[56,0,56,3],[136,0,136,4],[136,6,140,6],[136,7,140,7],[141,6,144,6],[141,7,144,7],[144,3,144,4],[145,0,145,4],[145,6,146,6],[63,6,68,6],[100,0,100,7],[98,5,98,7],[113,6,118,6],[113,7,118,7],[142,3,142,4],[143,3,143,4],[125,6,135,6],[125,7,135,7],[129,2,129,3],[91,7,94,7],[94,3,94,4],[95,0,95,4],[95,6,96,6],[150,0,150,7],[151,0,151,7],[149,0,149,5],[148,0,148,4],[156,0,156,3],[157,0,157,3],[145,7,146,7],[146,0,146,1],[146,2,146,4],[148,5,148,7],[195,6,196,6],[195,7,196,7],[196,0,196,1],[196,2,196,4],[163,0,163,3],[193,3,193,4],[170,0,170,3],[169,0,169,3],[169,6,174,6],[169,7,174,7],[175,0,175,1],[186,7,190,7],[192,3,192,4],[175,6,185,6],[175,7,185,7],[179,2,179,3],[180,2,180,4],[186,0,186,4],[186,6,190,6],[164,0,164,3],[175,2,175,3],[46,2,46,4],[48,5,48,7],[53,0,53,7],[50,0,50,7],[49,0,49,5],[199,0,199,5],[197,0,197,4],[197,5,197,7],[147,0,147,4],[147,5,147,7],[152,0,152,7],[153,0,153,7],[154,0,154,7],[155,0,155,4],[156,6,162,6],[156,7,162,7],[198,0,198,4],[198,5,198,7],[163,6,168,6],[163,7,168,7],[191,6,194,6],[191,7,194,7],[194,3,194,4],[195,0,195,4],[0,0,0,7],[1,0,1,7],[3,0,3,7],[2,0,2,7],[4,0,4,7],[5,0,5,4],[6,6,12,6],[6,7,12,7],[6,0,6,3],[7,0,7,3],[13,0,13,3],[14,0,14,3],[20,0,20,3],[19,0,19,3],[47,5,47,7],[13,7,18,7],[70,0,70,3],[57,0,57,3],[25,2,25,3],[19,6,24,6],[19,7,24,7],[13,6,18,6],[42,3,42,4],[43,3,43,4],[54,0,54,7],[52,0,52,7],[69,0,69,3],[69,6,74,6],[69,7,74,7],[56,7,62,7],[48,0,48,4],[25,0,25,1],[51,0,51,7],[55,0,55,4],[22,17,22,23],[75,0,75,1],[75,2,75,3],[125,0,125,1],[125,2,125,3],[29,2,29,3],[30,2,30,4],[46,0,46,1],[92,3,92,4],[63,7,68,7],[25,6,35,6],[25,7,35,7],[45,0,45,4],[45,6,46,6],[45,7,46,7],[36,0,36,4],[36,6,40,6],[36,7,40,7],[41,7,44,7],[41,6,44,6],[44,3,44,4],[63,0,63,3],[64,0,64,3],[56,6,62,6]]}
["PART 5.H (2)",null,null,null,null,null,null,null,null,null,"Mis 1 ","Mis 2","Mis 1&2 total"]
["MISCELLANEOUS SUPPLEMENTARY SHEET",null,null,null,null,null,null,null,null,"Emergency/Initial Work   ",{"$f":"'Miscellaneous 1'!K11","v":0},{"$f":"N9","v":0},{"$f":"SUM(K2:L2)","v":0}]
["UNIT PRICING FORM",null,null,null,null,null,null,null,null,"Investigation Work      ",{"$f":"'Miscellaneous 1'!K12","v":0},{"$f":"N10","v":0},{"$f":"SUM(K3:L3)","v":0}]
["Check Event:",null,null,null,null,null,null,null,null,"Monitoring/Interim Work    ",{"$f":"'Miscellaneous 1'!K13","v":0},0,0]
["Charges for the following activities shall be addressed on this form:  groundwater sampling, discharge sampling and routine scheduled treatment unit operation and maintenance events.  Refer to the Cost Control Guidance Document regarding specific activities/items covered under these unit prices. It is mandatory unit pricing for these activities.",null,null,null,null,null,null,null,null,"Corrective Action Plan Work",{"$f":"'Miscellaneous 1'!K14","v":0},0,0]
["UNIT PRICE ACTIVITY",null,null,null,null,"RAC INVOICE NO.","RATES","COST"]
["Groundwater Sampling             Total Number of Wells Sampled:\n",null,null,null,{"$f":"IF(COUNTA(A9:E13)>0,COUNTA(A9:E13),\"\")","v":""},null,"$585.00 - 1st Well\n$182.00 – Others",{"$f":"ROUND(IF(COUNTA(A9:E13)=1,585,IF(COUNTA(A9:E13)>1,585+((COUNTA(A9:E13)-1)*182),0)),2)","v":0},null,null,null,null,null,"PAGE TOTAL"]
["List wells sampled below:                        Date sampling occurred:",null,null,null,null,null,null,null,null,null,null,null,null,null,null,null,null,null,"2nd type of print report"]
[null,null,null,null,null,null,null,null,null,"Emergency/Initial Work   ",false,{"$f":"IF(K9=TRUE,$F$48,\"\")","v":""},"Emergency/Initial Work   ",{"$f":"SUM(L9,L59,L109,L159)","v":0},null,null,null,"Emergency/Initial Work   ",{"$f":"IF(K9=TRUE,1,\"\")","v":""}]
[null,null,null,null,null,null,null,null,null,"Investigation Work      ",false,{"$f":"IF(K10=TRUE,$F$48,\"\")","v":""},"Investigation Work      ",{"$f":"SUM(L10,L60,L110,L160)","v":0},null,null,null,"Investigation Work      ",{"$f":"IF(K10=TRUE,2,\"\")","v":""}]
[null,null,null,null,null,null,null,null,null,"Monitoring/Interim Work    ",false,{"$f":"IF(K11=TRUE,$F$48,\"\")","v":""},"Monitoring/Interim Work    ",{"$f":"SUM(L11,L61,L111,L161)","v":0},null,null,null,"Monitoring/Interim Work    ",{"$f":"IF(K11=TRUE,3,\"\")","v":""}]
[null,null,null,null,null,null,null,null,null,"Corrective Action Plan Work",false,{"$f":"IF(K12=TRUE,$F$48,\"\")","v":""},"Corrective Action Plan Work",{"$f":"SUM(L12,L62,L112,L162)","v":0},null,null,null,"Corrective Action Plan Work",{"$f":"IF(K12=TRUE,4,\"\")","v":""}]
[]
["Free Product Recovery        Total Number of Wells Handbailed:",null,null,null,{"$f":"IF(COUNTA(A16:E19)>0,COUNTA(A16:E19),\"\")","v":""},null,"$177.00 - 1st Well\n$58.00 – Others\n\nThe $58.00 rate applies to all wells handbailed on the same date as sampled."]
["List wells handbailed below:              Date handbailing occurred:"]
[]
[null,null,null,null,null,null,null,null,null,null,"box 1-5","box 6-10","box 11-15","box 16-20","box 21-25"]
[null,null,null,null,null,null,null,null,null,"Emergency/Initial Work   ",{"$f":"'Miscellaneous 3'!H8","v":false},{"$f":"'Miscellaneous 3'!H56","v":false},{"$f":"'Miscellaneous 3'!H104","v":false},{"$f":"'Miscellaneous 3'!H152","v":false},{"$f":"'Miscellaneous 3'!H200","v":false}]
[null,null,null,null,null,null,null,null,null,"Investigation Work      ",{"$f":"'Miscellaneous 3'!H9","v":false},{"$f":"'Miscellaneous 3'!H57","v":false},{"$f":"'Miscellaneous 3'!H105","v":false},{"$f":"'Miscellaneous 3'!H153","v":false},{"$f":"'Miscellaneous 3'!H201","v":false}]
["Gauging Wells                             Total Number of Wells Gauged:",null,null,null,{"$f":"IF(COUNTA(A22:E25)>0,COUNTA(A22:E25),\"\")","v":""},null,"$16.00 per well",{"$f":"ROUND((COUNTA(A22:E25)*16),2)","v":0},null,"Monitoring/Interim Work        ",{"$f":"'Miscellaneous 3'!H10","v":false},{"$f":"'Miscellaneous 3'!H58","v":false},{"$f":"'Miscellaneous 3'!H106","v":false},{"$f":"'Miscellaneous 3'!H154","v":false},{"$f":"'Miscellaneous 3'!H202","v":false}]
["List wells gauged below:                           Date gauging occurred:",null,null,null,null,null,null,null,null,"Corrective Action Plan Work",{"$f":"'Miscellaneous 3'!H11","v":false},{"$f":"'Miscellaneous 3'!H59","v":false},{"$f":"'Miscellaneous 3'!H107","v":false},{"$f":"'Miscellaneous 3'!H155","v":false},{"$f":"'Miscellaneous 3'!H203","v":false}]
[]
[null,null,null,null,null,null,null,null,null,"Emergency/Initial Work   ",{"$f":"IF(K18=FALSE,0,1)","v":0},{"$f":"IF(L18=FALSE,0,1)","v":0},0,0,0,{"$f":"SUM(K23:O23)","v":0},null,"Operation and Maintenance"]
[null,null,null,null,null,null,null,null,null,"Investigation Work      ",{"$f":"IF(K19=FALSE,0,1)","v":0},0,0,0,0,{"$f":"SUM(K24:O24)","v":0},null,"Status","Unit Type","Rates","Weekly","Biweekly","Monthly","Quarterly"]
[null,null,null,null,null,null,null,null,null,"Monitoring/Interim Work        ",0,0,0,0,0,0,null,"Active","Type 1","Active Type 1",375,750]
["Treatment Unit O&M ",null,"Total No. of Events:",null,{"$f":"IF(COUNTA(C32:E36)>0,COUNTA(C32:E36),\"\")","v":""},null,"See pages 65-66 and \npage 72 of the \n2017 Cost Control\nGuidance Document\nfor rate descriptions",{"$f":"ROUND(SUM((IF(COUNTA(C32:E36)>=1,(E26*E29)+(E28*200),0))+(E30*COUNTA(A32:A36))+(900*COUNTA(B32:B36))),2)","v":0},null,"Corrective Action Plan Work",0,0,0,0,0,0,null,"Post","Type 2","Active Type 2",230,460]
["Remed. Status:",null,null,"Unit Type:",null,null,null,null,null,null,null,null,null,null,null,null,null,null,"Type 3","Active Type 3",250,500]
["Frequency:",null,null,"Add. Units:",null,null,null,null,null,null,null,null,null,null,null,null,null,null,null,"Post Type 1",null,null,375,625]
["# of Oil Changes:",{"$f":"IF(COUNTA(A32:A35)>0,COUNTA(A32:A35),\"\")","v":""},null,"O&M Rate:",{"$f":"IF(B27>0,INDEX($U$25:$X$31,MATCH(B27&\" \"&E27,$T$25:$T$31,0),MATCH(B28,$U$24:$X$24,0)),0)","v":0},null,null,null,null,null,null,null,null,null,null,null,null,null,null,"Post Type 2",null,null,230,385]
["Unit HP Rating:",null,"Oil Change Rate:",null,{"$f":"IF(AND(B29>0,B30>0),IF(B30>40,2800+500,2800),0)","v":0},null,null,null,null,null,null,null,null,null,null,null,null,null,null,"Post Type 3",null,null,250,415]
["Oil Changes:","Strip. Cleanings:","O&M Events:"]
[]
[]
[]
[null,null,null,null,null,null,null,null,null,"Emergency/Initial Work   ",{"$f":"IF(P23=1,TRUE,FALSE)","v":false}]
[null,null,null,null,null,null,null,null,null,"Investigation Work      ",{"$f":"IF(P24=1,TRUE,FALSE)","v":false}]
["Discharge Sampling Event - List dates sampling occurred \n(When additional sampling events are being requested due to an exceedance, a copy of the analytical result documenting the exceedance must be provided.)",null,null,null,null,null,"$235.00 per event",{"$f":"ROUND((COUNTA(A38:E41)*235),2)","v":0},null,"Monitoring/Interim Work        ",{"$f":"IF(P25=1,TRUE,FALSE)","v":false}]
[null,null,null,null,null,null,null,null,null,"Corrective Action Plan Work",{"$f":"IF(P26=1,TRUE,FALSE)","v":false}]
[]
[]
[]
["Mob/Demob for Drilling/Direct Push/P&A",null,null,null,null,null,"$286.00 once per event",{"$f":"ROUND((COUNTA(B43:B45)*286),2)","v":0}]
["Date of event:",null," Type of event:"]
["Date of event:",null," Type of event:"]
["Date of event:",null," Type of event:"]
["Obtaining offsite access",null,null,null,null,null,"$410.00 per property",{"$f":"C47*410","v":0}]
["Number of Properties Accessed",null,null,null,null,null,null,null,null,{"$f":"IF(K9=TRUE,$N$9,IF(K10=TRUE,$N$10,IF(K11=TRUE,$N$11,IF(K12=TRUE,$N$12,0))))","v":0}]
["SUBTOTAL OF THIS PAGE",null,null,null,null,{"$f":"SUM(H7:H47)","v":0},null,null,null,{"$f":"SUM(J47)","v":0},{"$f":"IF(J48>0,1,0)","v":0}]
["MISCELLANEOUS TOTAL",null,null,null,null,{"$f":"J49","v":""},null,null,null,{"$f":"IF(AND(K9=TRUE,$K$35=FALSE),$M$2,IF(AND(K10=TRUE,$K$36=FALSE),$M$3,IF(AND(K11=TRUE,$K$37=FALSE),$M$4,IF(AND(K12=TRUE,$K$38=FALSE),$M$5,\"\"))))","v":""}]
["Page             of                (Miscellaneous Supplementary Sheet)"]
["PART 5.H (2)"]
["MISCELLANEOUS SUPPLEMENTARY SHEET"]
["UNIT PRICING FORM"]
["Check Event:"]
["Charges for the following activities shall be addressed on this form:  groundwater sampling, discharge sampling and routine scheduled treatment unit operation and maintenance events.  Refer to the Cost Control Guidance Document regarding specific activities/items covered under these unit prices. It is mandatory unit pricing for these activities."]
["UNIT PRICE ACTIVITY",null,null,null,null,"RAC INVOICE NO.","RATES","COST"]
["Groundwater Sampling             Total Number of Wells Sampled:\n",null,null,null,{"$f":"IF(COUNTA(A59:E63)>0,COUNTA(A59:E63),\"\")","v":""},null,"$585.00 - 1st Well\n$182.00 – Others",{"$f":"ROUND(IF(COUNTA(A59:E63)=1,585,IF(COUNTA(A59:E63)>1,585+((COUNTA(A59:E63)-1)*182),0)),2)","v":0}]
["List wells sampled below:                        Date sampling occurred:",null,null,null,null,null,null,null,null,null,null,null,null,null,null,null,null,null,"2nd type of print report"]
[null,null,null,null,null,null,null,null,null,"Emergency/Initial Work   ",false,{"$f":"IF(K59=TRUE,$F$98,\"\")","v":""},null,null,null,null,null,"Emergency/Initial Work   ",{"$f":"IF(K59=TRUE,1,\"\")","v":""}]
[null,null,null,null,null,null,null,null,null,"Investigation Work      ",false,{"$f":"IF(K60=TRUE,$F$98,\"\")","v":""},null,null,null,null,null,"Investigation Work      ",{"$f":"IF(K60=TRUE,2,\"\")","v":""}]
[null,null,null,null,null,null,null,null,null,"Monitoring/Interim Work    ",false,"",null,null,null,null,null,"Monitoring/Interim Work    ",{"$f":"IF(K61=TRUE,3,\"\")","v":""}]
[null,null,null,null,null,null,null,null,null,"Corrective Action Plan Work",false,"",null,null,null,null,null,"Corrective Action Plan Work",{"$f":"IF(K62=TRUE,4,\"\")","v":""}]
[]
["Free Product Recovery        Total Number of Wells Handbailed:",null,null,null,{"$f":"IF(COUNTA(A66:E69)>0,COUNTA(A66:E69),\"\")","v":""},null,"$177.00 - 1st Well\n$58.00 – Others\n\nThe $58.00 rate applies to all wells handbailed on the same date as sampled."]
["List wells handbailed below:              Date handbailing occurred:"]
[]
[]
[]
[]
["Gauging Wells                             Total Number of Wells Gauged:",null,null,null,{"$f":"IF(COUNTA(A72:E75)>0,COUNTA(A72:E75),\"\")","v":""},null,"$16.00 per well",{"$f":"ROUND((COUNTA(A72:E75)*16),2)","v":0}]
["List wells gauged below:                           Date gauging occurred:"]
[]
[]
[]
[]
["Treatment Unit O&M ",null,"Total No. of Events:",null,{"$f":"IF(COUNTA(C82:E86)>0,COUNTA(C82:E86),\"\")","v":""},null,"See pages 65-66 and \npage 72 of the \n2017 Cost Control\nGuidance Document\nfor rate descriptions",{"$f":"ROUND(SUM((IF(COUNTA(C82:E86)>=1,(E76*E79)+(E78*200),0))+(E80*COUNTA(A82:A86))+(900*COUNTA(B82:B86))),2)","v":0}]
["Remed. Status:",null,null,"Unit Type:"]
["Frequency:",null,null,"Add. Units:"]
["# of Oil Changes:",{"$f":"IF(COUNTA(A82:A85)>0,COUNTA(A82:A85),\"\")","v":""},null,"O&M Rate:",{"$f":"IF(B77>0,INDEX($U$25:$X$31,MATCH(B77&\" \"&E77,$T$25:$T$31,0),MATCH(B78,$U$24:$X$24,0)),0)","v":0}]
["Unit HP Rating:",null,"Oil Change Rate:",null,{"$f":"IF(AND(B79>0,B80>0),IF(B80>40,2800+500,2800),0)","v":0}]
["Oil Changes:","Strip. Cleanings:","O&M Events:"]
[]
[]
[]
[]
[]
["Discharge Sampling Event - List dates sampling occurred \n(When additional sampling events are being requested due to an exceedance, a copy of the analytical result documenting the exceedance must be provided.)",null,null,null,null,null,"$235.00 per event",{"$f":"ROUND((COUNTA(A88:E91)*235),2)","v":0}]
[]
[]
[]
[]
["Mob/Demob for Drilling/Direct Push/P&A",null,null,null,null,null,"$286.00 once per event",{"$f":"ROUND((COUNTA(B93:B95)*286),2)","v":0}]
["Date of event:",null," Type of event:"]
["Date of event:",null," Type of event:"]
["Date of event:",null," Type of event:"]
["Obtaining offsite access",null,null,null,null,null,"$410.00 per property",{"$f":"C97*410","v":0}]
["Number of Properties Accessed",null,null,null,null,null,null,null,null,{"$f":"IF(K59=TRUE,$N$9,IF(K60=TRUE,$N$10,IF(K61=TRUE,$N$11,IF(K62=TRUE,$N$12,0))))","v":0}]
["SUBTOTAL OF THIS PAGE",null,null,null,null,{"$f":"SUM(H57:H97)","v":0},null,null,null,{"$f":"SUM(J97)","v":0},{"$f":"IF(J98>0,1,0)","v":0}]
["MISCELLANEOUS TOTAL",null,null,null,null,{"$f":"J99","v":""},null,null,null,{"$f":"IF((K59=TRUE)*AND($K$35=FALSE),$M$2,IF((K60=TRUE)*AND($K$36=FALSE),$M$3,IF((K61=TRUE)*AND($K$37=FALSE),$M$4,IF((K62=TRUE)*AND($K$38=FALSE),$M$5,\"\"))))","v":""}]
["Page             of                (Miscellaneous Supplementary Sheet)"]
["PART 5.H (2)"]
["MISCELLANEOUS SUPPLEMENTARY SHEET"]
["UNIT PRICING FORM"]
["Check Event:"]
["Charges for the following activities shall be addressed on this form:  groundwater sampling, discharge sampling and routine scheduled treatment unit operation and maintenance events.  Refer to the Cost Control Guidance Document regarding specific activities/items covered under these unit prices. It is mandatory unit pricing for these activities."]
["UNIT PRICE ACTIVITY",null,null,null,null,"RAC INVOICE NO.","RATES","COST"]
["Groundwater Sampling             Total Number of Wells Sampled:\n",null,null,null,{"$f":"IF(COUNTA(A109:E113)>0,COUNTA(A109:E113),\"\")","v":""},null,"$585.00 - 1st Well\n$182.00 – Others",{"$f":"ROUND(IF(COUNTA(A109:E113)=1,585,IF(COUNTA(A109:E113)>1,585+((COUNTA(A109:E113)-1)*182),0)),2)","v":0}]
["List wells sampled below:                        Date sampling occurred:",null,null,null,null,null,null,null,null,null,null,null,null,null,null,null,null,null,"2nd type of print report"]
[null,null,null,null,null,null,null,null,null,"Emergency/Initial Work   ",false,{"$f":"IF(K109=TRUE,$F$148,\"\")","v":""},null,null,null,null,null,"Emergency/Initial Work   ",{"$f":"IF(K109=TRUE,1,\"\")","v":""}]
[null,null,null,null,null,null,null,null,null,"Investigation Work      ",false,{"$f":"IF(K110=TRUE,$F$148,\"\")","v":""},null,null,null,null,null,"Investigation Work      ",{"$f":"IF(K110=TRUE,2,\"\")","v":""}]
[null,null,null,null,null,null,null,null,null,"Monitoring/Interim Work    ",false,"",null,null,null,null,null,"Monitoring/Interim Work    ",{"$f":"IF(K111=TRUE,3,\"\")","v":""}]
[null,null,null,null,null,null,null,null,null,"Corrective Action Plan Work",false,"",null,null,null,null,null,"Corrective Action Plan Work",{"$f":"IF(K112=TRUE,4,\"\")","v":""}]
[]
["Free Product Recovery        Total Number of Wells Handbailed:",null,null,null,{"$f":"IF(COUNTA(A116:E119)>0,COUNTA(A116:E119),\"\")","v":""},null,"$177.00 - 1st Well\n$58.00 – Others\n\nThe $58.00 rate applies to all wells handbailed on the same date as sampled."]
["List wells handbailed below:              Date handbailing occurred:"]
[]
[]
[]
[]
["Gauging Wells                             Total Number of Wells Gauged:",null,null,null,{"$f":"IF(COUNTA(A122:E125)>0,COUNTA(A122:E125),\"\")","v":""},null,"$16.00 per well",{"$f":"ROUND((COUNTA(A122:E125)*16),2)","v":0}]
["List wells gauged below:                           Date gauging occurred:"]
[]
[]
[]
[]
["Treatment Unit O&M ",null,"Total No. of Events:",null,{"$f":"IF(COUNTA(C132:E136)>0,COUNTA(C132:E136),\"\")","v":""},null,"See pages 65-66 and \npage 72 of the \n2017 Cost Control\nGuidance Document\nfor rate descriptions",{"$f":"ROUND(SUM((IF(COUNTA(C132:E136)>=1,(E126*E129)+(E128*200),0))+(E130*COUNTA(A132:A136))+(900*COUNTA(B132:B136))),2)","v":0}]
["Remed. Status:",null,null,"Unit Type:"]
["Frequency:",null,null,"Add. Units:"]
["# of Oil Changes:",{"$f":"IF(COUNTA(A132:A135)>0,COUNTA(A132:A135),\"\")","v":""},null,"O&M Rate:",{"$f":"IF(B127>0,INDEX($U$25:$X$31,MATCH(B127&\" \"&E127,$T$25:$T$31,0),MATCH(B128,$U$24:$X$24,0)),0)","v":0}]
["Unit HP Rating:",null,"Oil Change Rate:",null,{"$f":"IF(AND(B129>0,B130>0),IF(B130>40,2800+500,2800),0)","v":0}]
["Oil Changes:","Strip. Cleanings:","O&M Events:"]
[]
[]
[]
[]
[]
["Discharge Sampling Event - List dates sampling occurred \n(When additional sampling events are being requested due to an exceedance, a copy of the analytical result documenting the exceedance must be provided.)",null,null,null,null,null,"$235.00 per event",{"$f":"ROUND((COUNTA(A138:E141)*235),2)","v":0}]
[]
[]
[]
[]
["Mob/Demob for Drilling/Direct Push/P&A",null,null,null,null,null,"$286.00 once per event",{"$f":"ROUND((COUNTA(B143:B145)*286),2)","v":0}]
["Date of event:",null," Type of event:"]
["Date of event:",null," Type of event:"]
["Date of event:",null," Type of event:"]
["Obtaining offsite access",null,null,null,null,null,"$410.00 per property",{"$f":"C147*410","v":0}]
["Number of Properties Accessed",null,null,null,null,null,null,null,null,{"$f":"IF(K109=TRUE,$N$9,IF(K110=TRUE,$N$10,IF(K111=TRUE,$N$11,IF(K112=TRUE,$N$12,0))))","v":0}]
["SUBTOTAL OF THIS PAGE",null,null,null,null,{"$f":"SUM(H107:H147)","v":0},null,null,null,{"$f":"SUM(J147)","v":0},{"$f":"IF(J148>0,1,0)","v":0}]
["MISCELLANEOUS TOTAL",null,null,null,null,{"$f":"J149","v":""},null,null,null,{"$f":"IF((K109=TRUE)*AND($K$35=FALSE),$M$2,IF((K110=TRUE)*AND($K$36=FALSE),$M$3,IF((K111=TRUE)*AND($K$37=FALSE),$M$4,IF((K112=TRUE)*AND($K$38=FALSE),$M$5,\"\"))))","v":""}]
["Page             of                (Miscellaneous Supplementary Sheet)"]
["PART 5.H (2)"]
["MISCELLANEOUS SUPPLEMENTARY SHEET"]
["UNIT PRICING FORM"]
["Check Event:"]
["Charges for the following activities shall be addressed on this form:  groundwater sampling, discharge sampling and routine scheduled treatment unit operation and maintenance events.  Refer to the Cost Control Guidance Document regarding specific activities/items covered under these unit prices. It is mandatory unit pricing for these activities."]
["UNIT PRICE ACTIVITY",null,null,null,null,"RAC INVOICE NO.","RATES","COST"]
["Groundwater Sampling             Total Number of Wells Sampled:\n",null,null,null,{"$f":"IF(COUNTA(A159:E163)>0,COUNTA(A159:E163),\"\")","v":""},null,"$585.00 - 1st Well\n$182.00 – Others",{"$f":"ROUND(IF(COUNTA(A159:E163)=1,585,IF(COUNTA(A159:E163)>1,585+((COUNTA(A159:E163)-1)*182),0)),2)","v":0}]
["List wells sampled below:                        Date sampling occurred:",null,null,null,null,null,null,null,null,null,null,null,null,null,null,null,null,null,"2nd type of print report"]
[null,null,null,null,null,null,null,null,null,"Emergency/Initial Work   ",false,{"$f":"IF(K159=TRUE,$F$198,\"\")","v":""},null,null,null,null,null,"Emergency/Initial Work   ",{"$f":"IF(K159=TRUE,1,\"\")","v":""}]
[null,null,null,null,null,null,null,null,null,"Investigation Work      ",false,{"$f":"IF(K160=TRUE,$F$198,\"\")","v":""},null,null,null,null,null,"Investigation Work      ",{"$f":"IF(K160=TRUE,2,\"\")","v":""}]
[null,null,null,null,null,null,null,null,null,"Monitoring/Interim Work    ",false,"",null,null,null,null,null,"Monitoring/Interim Work    ",{"$f":"IF(K161=TRUE,3,\"\")","v":""}]
[null,null,null,null,null,null,null,null,null,"Corrective Action Plan Work",false,"",null,null,null,null,null,"Corrective Action Plan Work",{"$f":"IF(K162=TRUE,4,\"\")","v":""}]
[]
["Free Product Recovery        Total Number of Wells Handbailed:",null,null,null,{"$f":"IF(COUNTA(A166:E169)>0,COUNTA(A166:E169),\"\")","v":""},null,"$177.00 - 1st Well\n$58.00 – Others\n\nThe $58.00 rate applies to all wells handbailed on the same date as sampled."]
["List wells handbailed below:              Date handbailing occurred:"]
[]
[]
[]
[]
["Gauging Wells                             Total Number of Wells Gauged:",null,null,null,{"$f":"IF(COUNTA(A172:E175)>0,COUNTA(A172:E175),\"\")","v":""},null,"$16.00 per well",{"$f":"ROUND((COUNTA(A172:E175)*16),2)","v":0}]
["List wells gauged below:                           Date gauging occurred:"]
[]
[]
[]
[]
["Treatment Unit O&M ",null,"Total No. of Events:",null,{"$f":"IF(COUNTA(C182:E186)>0,COUNTA(C182:E186),\"\")","v":""},null,"See pages 65-66 and \npage 72 of the \n2017 Cost Control\nGuidance Document\nfor rate descriptions",{"$f":"ROUND(SUM((IF(COUNTA(C182:E186)>=1,(E176*E179)+(E178*200),0))+(E180*COUNTA(A182:A186))+(900*COUNTA(B182:B186))),2)","v":0}]
["Remed. Status:",null,null,"Unit Type:"]
["Frequency:",null,null,"Add. Units:"]
["# of Oil Changes:",{"$f":"IF(COUNTA(A182:A185)>0,COUNTA(A182:A185),\"\")","v":""},null,"O&M Rate:",{"$f":"IF(B177>0,INDEX($U$25:$X$31,MATCH(B177&\" \"&E177,$T$25:$T$31,0),MATCH(B178,$U$24:$X$24,0)),0)","v":0}]
["Unit HP Rating:",null,"Oil Change Rate:",null,{"$f":"IF(AND(B179>0,B180>0),IF(B180>40,2800+500,2800),0)","v":0}]
["Oil Changes:","Strip. Cleanings:","O&M Events:"]
[]
[]
[]
[]
[]
["Discharge Sampling Event - List dates sampling occurred \n(When additional sampling events are being requested due to an exceedance, a copy of the analytical result documenting the exceedance must be provided.)",null,null,null,null,null,"$235.00 per event",{"$f":"ROUND((COUNTA(A188:E191)*235),2)","v":0}]
[]
[]
[]
[]
["Mob/Demob for Drilling/Direct Push/P&A",null,null,null,null,null,"$286.00 once per event",{"$f":"ROUND((COUNTA(B193:B195)*286),2)","v":0}]
["Date of event:",null," Type of event:"]
["Date of event:",null," Type of event:"]
["Date of event:",null," Type of event:"]
["Obtaining offsite access",null,null,null,null,null,"$410.00 per property",{"$f":"C197*410","v":0}]
["Number of Properties Accessed",null,null,null,null,null,null,null,null,{"$f":"IF(K159=TRUE,$N$9,IF(K160=TRUE,$N$10,IF(K161=TRUE,$N$11,IF(K162=TRUE,$N$12,0))))","v":0}]
["SUBTOTAL OF THIS PAGE",null,null,null,null,{"$f":"SUM(H157:H197)","v":0},null,null,null,{"$f":"SUM(J197)","v":0},{"$f":"IF(J198>0,1,0)","v":0}]
["MISCELLANEOUS TOTAL",null,null,null,null,{"$f":"J199","v":""},null,null,null,{"$f":"IF((K159=TRUE)*AND($K$35=FALSE),$M$2,IF((K160=TRUE)*AND($K$36=FALSE),$M$3,IF((K161=TRUE)*AND($K$37=FALSE),$M$4,IF((K162=TRUE)*AND($K$38=FALSE),$M$5,\"\"))))","v":""}]
["Page             of                (Miscellaneous Supplementary Sheet)"]

{"sheet":"Miscellaneous 3","index":17,"n_rows":240,"n_cols":13,"rows_kept":240,"cut":false,"hidden":false,"merged":[[172,0,172,1],[220,0,220,1],[121,4,123,4],[124,3,126,3],[124,4,126,4],[175,2,176,2],[175,3,176,3],[175,4,176,4],[151,3,156,3],[144,0,144,4],[145,0,145,4],[146,0,146,4],[150,0,150,1],[172,3,174,3],[172,4,174,4],[127,2,128,2],[127,3,128,3],[127,4,128,4],[129,3,137,3],[129,4,135,4],[136,2,137,2],[136,4,137,4],[138,3,140,3],[116,4,117,4],[118,0,118,1],[118,2,120,2],[118,3,120,3],[118,4,120,4],[164,2,165,2],[164,3,165,3],[164,4,165,4],[148,0,148,4],[143,0,143,3],[121,0,121,1],[121,2,123,2],[121,3,123,3],[124,0,124,1],[159,0,159,1],[162,4,163,4],[164,0,164,1],[158,0,158,1],[151,2,152,2],[153,2,154,2],[155,2,156,2],[138,4,140,4],[153,4,154,4],[155,4,156,4],[234,3,236,3],[234,4,236,4],[197,0,197,4],[169,0,169,1],[162,3,163,3],[205,0,205,1],[199,0,200,1],[199,3,204,3],[198,0,198,1],[190,0,190,2],[190,3,190,4],[191,0,191,3],[196,0,196,4],[169,2,171,2],[169,3,171,3],[169,4,171,4],[193,0,193,4],[194,0,194,4],[195,0,195,4],[192,0,192,4],[166,0,166,1],[166,2,168,2],[166,3,168,3],[166,4,168,4],[239,0,239,3],[237,0,237,2],[237,3,237,4],[238,0,238,2],[238,3,238,4],[210,3,211,3],[210,4,211,4],[212,0,212,1],[217,0,217,1],[217,2,219,2],[217,3,219,3],[217,4,219,4],[220,3,222,3],[220,4,222,4],[212,2,213,2],[212,3,213,3],[225,3,233,3],[225,4,231,4],[232,2,233,2],[232,4,233,4],[214,0,214,1],[214,2,216,2],[214,3,216,3],[214,4,216,4],[103,0,104,1],[141,0,141,2],[94,0,94,2],[157,0,157,1],[141,3,141,4],[149,0,149,4],[151,0,152,1],[55,2,56,2],[55,0,56,1],[68,2,69,2],[68,3,69,3],[68,4,69,4],[70,0,70,1],[70,2,72,2],[70,3,72,3],[70,4,72,4],[116,2,117,2],[116,3,117,3],[102,0,102,1],[103,3,108,3],[109,0,109,1],[142,0,142,2],[142,3,142,4],[147,0,147,4],[0,0,0,4],[1,0,1,4],[3,0,3,4],[2,0,2,4],[20,0,20,1],[7,2,8,2],[5,0,5,4],[7,3,12,3],[6,0,6,1],[7,0,8,1],[9,2,10,2],[11,2,12,2],[13,0,13,1],[14,0,14,1],[15,0,15,1],[62,0,62,1],[52,0,52,4],[48,0,48,4],[49,0,49,4],[50,0,50,4],[51,0,51,4],[46,0,46,2],[46,3,46,4],[4,0,4,4],[55,3,60,3],[61,0,61,1],[25,0,25,1],[31,2,32,2],[31,3,32,3],[31,4,32,4],[25,2,27,2],[25,3,27,3],[25,4,27,4],[57,4,58,4],[59,4,60,4],[53,0,53,4],[54,0,54,1],[57,2,58,2],[59,2,60,2],[63,3,65,3],[63,4,65,4],[66,3,67,3],[45,0,45,2],[42,3,44,3],[42,4,44,4],[11,4,12,4],[9,4,10,4],[14,9,14,12],[15,3,17,3],[15,4,17,4],[22,9,22,10],[18,4,19,4],[18,3,19,3],[22,0,22,1],[22,2,24,2],[22,4,24,4],[20,4,21,4],[22,3,24,3],[20,3,21,3],[20,2,21,2],[63,0,63,1],[45,3,45,4],[47,0,47,3],[24,6,24,7],[30,6,30,7],[29,9,29,12],[28,3,30,3],[28,4,30,4],[33,3,41,3],[33,4,39,4],[40,2,41,2],[40,4,41,4],[66,4,67,4],[68,0,68,1],[73,4,75,4],[76,3,78,3],[76,4,78,4],[79,2,80,2],[79,3,80,3],[79,4,80,4],[81,3,89,3],[81,4,87,4],[88,2,89,2],[88,4,89,4],[73,0,73,1],[73,2,75,2],[73,3,75,3],[76,0,76,1],[90,3,92,3],[90,4,92,4],[105,4,106,4],[107,4,108,4],[111,3,113,3],[111,4,113,4],[114,3,115,3],[114,4,115,4],[116,0,116,1],[97,0,97,4],[93,0,93,2],[93,3,93,4],[103,2,104,2],[105,2,106,2],[107,2,108,2],[94,3,94,4],[95,0,95,3],[110,0,110,1],[111,0,111,1],[98,0,98,4],[99,0,99,4],[100,0,100,4],[101,0,101,4],[96,0,96,4],[28,0,28,1],[159,3,161,3],[159,4,161,4],[223,2,224,2],[223,3,224,3],[223,4,224,4],[203,4,204,4],[207,3,209,3],[207,4,209,4],[212,4,213,4],[189,0,189,2],[189,3,189,4],[177,3,185,3],[177,4,183,4],[184,2,185,2],[186,3,188,3],[186,4,188,4],[206,0,206,1],[207,0,207,1],[199,2,200,2],[201,2,202,2],[203,2,204,2],[201,4,202,4],[184,4,185,4]]}
["PART 5.H (3)",null,null,null,null,null,null,"Mis1","Mis 2","Mis 3","Total"]
["MISCELLANEOUS SUPPLEMENTARY SHEET",null,null,null,null,null,"Emergency/Initial Work   ",{"$f":"'Miscellaneous 1'!K11","v":0},{"$f":"'Miscellaneous 2'!N9","v":0},{"$f":"K8","v":0},{"$f":"SUM(H2:J2)","v":0}]
["UNIT PRICING FORM",null,null,null,null,null,"Investigation Work      ",{"$f":"'Miscellaneous 1'!K12","v":0},{"$f":"'Miscellaneous 2'!N10","v":0},{"$f":"K9","v":0},{"$f":"SUM(H3:J3)","v":0}]
["Check Event:",null,null,null,null,null,"Monitoring/Interim Work        ",{"$f":"'Miscellaneous 1'!K13","v":0},{"$f":"'Miscellaneous 2'!N11","v":0},{"$f":"K10","v":0},0]
[null,null,null,null,null,null,"Corrective Action Plan Work",{"$f":"'Miscellaneous 1'!K14","v":0},{"$f":"'Miscellaneous 2'!N12","v":0},0,{"$f":"SUM(H5:J5)","v":0}]
[" Unit pricing for these activities is mandatory.",null,null,null,null,null,"Report Preparation ",{"$f":"'Miscellaneous 1'!K15","v":0},0,0,0]
["UNIT PRICE ACTIVITY",null,"RAC INVOICE NO.","RATES","COST",null,null,null,null,null,"Sheet Total"]
["Bid Package Preparation:\n    Provide Bid Summary with RAC Invoice.",null,null,"See page 54 of the \n2017 Cost Control\nGuidance Document\nfor rate descriptions",null,null,"Emergency/Initial Work   ",false,{"$f":"IF(H8=TRUE,$D$46,\"\")","v":""},"Emergency/Initial Work   ",{"$f":"SUM(I8,I56,I104,I152,I200)","v":0}]
[null,null,null,null,null,null,"Investigation Work      ",false,{"$f":"IF(H9=TRUE,$D$46,\"\")","v":""},"Investigation Work      ",{"$f":"SUM(I9,I57,I105,I153,I201)","v":0}]
["Description of Bid Package:",null,null,null,{"$f":"ROUND(IF(B10>0,IF(B10=$J$17,INDEX($K$17:$M$21,MATCH(B10,$J$17:$J$21,0),MATCH(B11,$K$16:$M$16,0)),VLOOKUP(B10,$J$18:$K$21,2,FALSE)),0),2)","v":0},null,"Monitoring/Interim Work        ",false,{"$f":"IF(H10=TRUE,$D$46,\"\")","v":""},"Monitoring/Interim Work        ",0]
["Value of Work:",null,null,null,null,null,"Corrective Action Plan Work",false,{"$f":"IF(H11=TRUE,$D$46,\"\")","v":""},"Corrective Action Plan Work",{"$f":"SUM(I11,I59,I107,I155,I203)","v":0}]
["Description of Bid Package:",null,null,null,{"$f":"ROUND(IF(B12>0,IF(B12=$J$17,INDEX($K$17:$M$21,MATCH(B12,$J$17:$J$21,0),MATCH(B13,$K$16:$M$16,0)),VLOOKUP(B12,$J$18:$K$21,2,FALSE)),0),2)","v":0},null,"Report Preparation ",false,{"$f":"IF(H12=TRUE,$D$46,\"\")","v":""},"Report Preparation ",0]
["Value of Work:"]
["Treatment System Design/Engineering/Planning and\nTreatment System Installation Design/Engineering/Planning",null,null,"$4,680.00\n(See page 73 of the CCGD)",{"$f":"ROUND(IF(C14>0,4680,0),2)","v":0},null,"Emergency/Initial Work   ",{"$f":"IF(H8=TRUE,1,\"\")","v":""}]
["Conveyance Notice \n(Copy of conveyance notice for each property is required for payment)",null,null,"$1,200.00\nper affected property",{"$f":"ROUND(IF(C15>0,1200,0),2)","v":0},null,"Investigation Work      ",{"$f":"IF(H9=TRUE,2,\"\")","v":""},null,"Bid Package Prep"]
["Corrective Action Plan Construction and Operations Report",null,null,"See page 56 of the 2017\nCost Control Guidance Document for rate descriptions",{"$f":"ROUND(IF(AND(B17>0,B18>0),VLOOKUP(B18,$J$24:$K$27,2,FALSE),0),2)","v":0},null,"Monitoring/Interim Work        ",{"$f":"IF(H10=TRUE,3,\"\")","v":""},null,null,"$0.00 - $1,999.99","$2,000.00 - $9,999.99","$10,000.00 and greater"]
["Date of Report:",null,null,null,null,null,"Corrective Action Plan Work",{"$f":"IF(H11=TRUE,4,\"\")","v":""},null,"Work Value Based",0,118,300]
["Report Type:",null,null,null,null,null,"Report Preparation ",{"$f":"IF(H12=TRUE,5,\"\")","v":""},null,"Treatment System Purchase",585]
["P & A Report",null,null,"$750.00 per report",{"$f":"ROUND(IF(B20>0,750,0),2)","v":0},null,null,null,null,"Chemical Injection Events",585]
["Date of Report:",null,null,null,null,null,null,null,null,"Used Treatment System Sale",585]
["Permit Application Development and Submittal (select from lists)",null,null,"See page 67 of the 2017 \nCCGD for rate descrpitions",{"$f":"IF(OR(COUNTIF(A22:B22,\"*Water*\")>1,COUNTIF(A22:B22,\"*Air*\")>1),\"Duplicate Entry\",SUM(IF(A22>0,VLOOKUP(A22,$G$32:$H$34,2,FALSE),0)+IF(B22>0,VLOOKUP(B22,$G$32:$H$34,2,FALSE),0)))","v":0},null,null,null,null,"Treatment System Installation",1750]
[]
["Quarterly Monitoring Reports (if applicable) – Indicate report period",null,null,"See page 61 of the 2017\nCost Control Guidance Document for rate descriptions",null,null,null,null,null,"Construction and Operations Report"]
["Quarter","Year",null,null,null,null,null,null,null,"With System Installation",1840]
[null,null,null,null,null,null,"Monitoring Reports",null,null,"Without System Installation",780]
["Annual or Semi-Annual Report (if applicable) - Indicate report period",null,null,"See page 62 of the 2017\nCost Control Guidance Document for rate descriptions",null,null,"Annual","Jan. - March",null,"Excavation > or = 675 tons",3000]
["Report Type:",null,null,null,null,null,"Semi-Annual","April - June",null,"Excavation < or = 675 tons",1800]
["Report Period:",null,null,null,null,null,null,"July - Sept."]
["State or Municipal/Parish Quarterly Discharge Monitoring Report",null,null,"$208.00 per report\n($78.00 for “No Discharge\")",null,null,null,"Oct. - Dec."]
["Report period(s):",null,null,null,null,null,null,null,null,"Vacuum Event"]
["Permit number(s):",null,null,null,null,null,"Permits",null,null,null,"First Event","Additional Events","Planning"]
["Soil Confirmation Report       Date:\n",null,null,"17% of reimbursed\n field work ($10,000 max)",{"$f":"ROUND(IF(OR(B33=0,B32=0),0,IF(B33*0.17>10000,10000,B33*0.17)),2)","v":0},null,"Air Exemption",1405,null,"Free Product Recovery Only",572,104,86]
["Cost of Field Work:",null,null,null,null,null,"Air Permit (Small Source)",4680,null,"Free Product Recovery and Vapor Calculations",1500,500,250]
["Vac. Events Report       Date of Report:",null,null,"See page 74-75 of the \n2017 Cost Control\nGuidance Document\nfor rate descriptions",{"$f":"ROUND(IF(OR(COUNTA(A37:B40)=0,B34=0),0,IF(COUNTA(A37:B40)=1,VLOOKUP(B35,$J$32:$M$33,2,FALSE),IF(COUNTA(A37:B40)>1,\nVLOOKUP(B35,$J$32:$M$33,2,FALSE)+((COUNTA(A37:B40)-1)*VLOOKUP(B35,$J$32:$M$33,3,FALSE)),0))),2)","v":0},null,"Water",1750]
["Report Type:"]
["List Dates of Events:"]
[]
[]
[]
[]
["Vacuum Event Planning         Type:",null,null,null,{"$f":"ROUND(IF(AND(B41>0,B42>0),VLOOKUP(B41,$J$31:$M$33,4,FALSE)*B42,0),2)","v":0}]
["Number of Events:"]
["Vacuum Extraction Pilot Test Report",null,null,"$350.00 per plan\n$2,912.00 per report",{"$f":"ROUND(IF(AND(B44>0,B45>0),(350+2912),IF(OR(B44>0,B45>0),IF(AND(B44>0,B45=0),350,IF(AND(B44=0,B45>0),2912,0)),0)),2)","v":0}]
[" Date of Plan:"]
[" Date of Report:"]
["SUBTOTAL OF THIS PAGE",null,null,{"$f":"SUM(E8:E44)","v":0},null,null,{"$f":"IF(H8=TRUE,$K$2,IF(H9=TRUE,$K$3,IF(H10=TRUE,$K$4,IF(H11=TRUE,$K$5,))))","v":0}]
["MISCELLANOUS TOTAL",null,null,{"$f":"SUM(G46)","v":0},null,null,{"$f":"IF(SUM(D46:E47)>0,1,0)","v":0}]
["Page             of                 (Miscellaneous Supplementary Sheet)"]
["PART 5.H (3)"]
["MISCELLANEOUS SUPPLEMENTARY SHEET"]
["UNIT PRICING FORM"]
["Check Event:"]
[]
[" Unit pricing for these activities is mandatory."]
["UNIT PRICE ACTIVITY",null,"RAC INVOICE NO.","RATES","COST"]
["Bid Package Preparation:\n    Provide Bid Summary with RAC Invoice.",null,null,"See page 54 of the \n2017 Cost Control\nGuidance Document\nfor rate descriptions",null,null,"Emergency/Initial Work   ",false,{"$f":"IF(H56=TRUE,$D$94,\"\")","v":""}]
[null,null,null,null,null,null,"Investigation Work      ",false,{"$f":"IF(H57=TRUE,$D$94,\"\")","v":""}]
["Description of Bid Package:",null,null,null,{"$f":"ROUND(IF(B58>0,IF(B58=$J$17,INDEX($K$17:$M$21,MATCH(B58,$J$17:$J$21,0),MATCH(B59,$K$16:$M$16,0)),VLOOKUP(B58,$J$18:$K$21,2,FALSE)),0),2)","v":0},null,"Monitoring/Interim Work        ",false,""]
["Value of Work:",null,null,null,null,null,"Corrective Action Plan Work",false,""]
["Description of Bid Package:",null,null,null,{"$f":"ROUND(IF(B60>0,IF(B60=$J$17,INDEX($K$17:$M$21,MATCH(B60,$J$17:$J$21,0),MATCH(B61,$K$16:$M$16,0)),VLOOKUP(B60,$J$18:$K$21,2,FALSE)),0),2)","v":0},null,"Report Preparation ",false,""]
["Value of Work:"]
["Treatment System Design/Engineering/Planning and\nTreatment System Installation Design/Engineering/Planning",null,null,"$4,680.00\n(See page 73 of the CCGD)",{"$f":"ROUND(IF(C62>0,4680,0),2)","v":0},null,"Emergency/Initial Work   ",{"$f":"IF(H56=TRUE,1,\"\")","v":""}]
["Conveyance Notice \n(Copy of conveyance notice for each property is required for payment)",null,null,"$1,200.00\nper affected property",{"$f":"ROUND(IF(C63>0,1200,0),2)","v":0},null,"Investigation Work      ",{"$f":"IF(H57=TRUE,2,\"\")","v":""}]
["Corrective Action Plan Construction and Operations Report",null,null,"See page 56 of the 2017\nCost Control Guidance Document for rate descriptions",{"$f":"ROUND(IF(AND(B65>0,B66>0),VLOOKUP(B66,$J$24:$K$27,2,FALSE),0),2)","v":0},null,"Monitoring/Interim Work        ",{"$f":"IF(H58=TRUE,3,\"\")","v":""}]
["Date of Report:",null,null,null,null,null,"Corrective Action Plan Work",{"$f":"IF(H59=TRUE,4,\"\")","v":""}]
["Report Type:",null,null,null,null,null,"Report Preparation ",{"$f":"IF(H60=TRUE,5,\"\")","v":""}]
["P & A Report",null,null,"$750.00 per report",{"$f":"ROUND(IF(B68>0,750,0),2)","v":0}]
["Date of Report:"]
["Permit Application Development and Submittal (select from lists)",null,null,"See page 67 of the 2017 \nCCGD for rate descrpitions",{"$f":"IF(OR(COUNTIF(A70:B70,\"*Water*\")>1,COUNTIF(A70:B70,\"*Air*\")>1),\"Duplicate Entry\",SUM(IF(A70>0,VLOOKUP(A70,$G$32:$H$34,2,FALSE),0)+IF(B70>0,VLOOKUP(B70,$G$32:$H$34,2,FALSE),0)))","v":0}]
[]
["Quarterly Monitoring Reports (if applicable) – Indicate report period",null,null,"See page 61 of the 2017\nCost Control Guidance Document for rate descriptions"]
["Quarter","Year"]
[]
["Annual or Semi-Annual Report (if applicable) - Indicate report period",null,null,"See page 62 of the 2017\nCost Control Guidance Document for rate descriptions"]
["Report Type:"]
["Report Period:"]
["State or Municipal/Parish Quarterly Discharge Monitoring Report ",null,null,"$208.00 per report\n($78.00 for “No Discharge\")"]
["Report period(s):"]
["Permit number(s):"]
["Soil Confirmation Report       Date:\n",null,null,"17% of reimbursed\n field work ($10,000 max)",{"$f":"ROUND(IF(OR(B81=0,B80=0),0,IF(B81*0.17>10000,10000,B81*0.17)),2)","v":0}]
["Cost of Field Work:"]
["Vac. Events Report       Date of Report:",null,null,"See page 74-75 of the \n2017 Cost Control\nGuidance Document\nfor rate descriptions",{"$f":"ROUND(IF(OR(COUNTA(A85:B88)=0,B82=0),0,IF(COUNTA(A85:B88)=1,VLOOKUP(B83,$J$32:$M$33,2,FALSE),IF(COUNTA(A85:B88)>1,\nVLOOKUP(B83,$J$32:$M$33,2,FALSE)+((COUNTA(A85:B88)-1)*VLOOKUP(B83,$J$32:$M$33,3,FALSE)),0))),2)","v":0}]
["Report Type:"]
["List Dates of Events:"]
[]
[]
[]
[]
["Vacuum Event Planning         Type:",null,null,null,{"$f":"ROUND(IF(AND(B89>0,B90>0),VLOOKUP(B89,$J$31:$M$33,4,FALSE)*B90,0),2)","v":0}]
["Number of Events:"]
["Vacuum Extraction Pilot Test Report",null,null,"$350.00 per plan\n$2,912.00 per report",{"$f":"ROUND(IF(AND(B92>0,B93>0),(350+2912),IF(OR(B92>0,B93>0),IF(AND(B92>0,B93=0),350,IF(AND(B92=0,B93>0),2912,0)),0)),2)","v":0}]
[" Date of Plan:"]
[" Date of Report:"]
["SUBTOTAL OF THIS PAGE",null,null,{"$f":"SUM(E56:E92)","v":0},null,null,{"$f":"IF(H56=TRUE,$K$2,IF(H57=TRUE,$K$3,IF(H58=TRUE,$K$4,IF(H59=TRUE,$K$5,))))","v":0}]
["MISCELLANOUS TOTAL",null,null,{"$f":"SUM(G94)","v":0},null,null,{"$f":"IF(SUM(D94:E95)>0,1,0)","v":0}]
["Page             of                 (Miscellaneous Supplementary Sheet)"]
["PART 5.H (3)"]
["MISCELLANEOUS SUPPLEMENTARY SHEET"]
["UNIT PRICING FORM"]
["Check Event:"]
[]
[" Unit pricing for these activities is mandatory."]
["UNIT PRICE ACTIVITY",null,"RAC INVOICE NO.","RATES","COST"]
["Bid Package Preparation:\n    Provide Bid Summary with RAC Invoice.",null,null,"See page 54 of the \n2017 Cost Control\nGuidance Document\nfor rate descriptions",null,null,"Emergency/Initial Work   ",false,{"$f":"IF(H104=TRUE,$D$142,\"\")","v":""}]
[null,null,null,null,null,null,"Investigation Work      ",false,{"$f":"IF(H105=TRUE,$D$142,\"\")","v":""}]
["Description of Bid Package:",null,null,null,{"$f":"ROUND(IF(B106>0,IF(B106=$J$17,INDEX($K$17:$M$21,MATCH(B106,$J$17:$J$21,0),MATCH(B107,$K$16:$M$16,0)),VLOOKUP(B106,$J$18:$K$21,2,FALSE)),0),2)","v":0},null,"Monitoring/Interim Work        ",false,""]
["Value of Work:",null,null,null,null,null,"Corrective Action Plan Work",false,""]
["Description of Bid Package:",null,null,null,{"$f":"ROUND(IF(B108>0,IF(B108=$J$17,INDEX($K$17:$M$21,MATCH(B108,$J$17:$J$21,0),MATCH(B109,$K$16:$M$16,0)),VLOOKUP(B108,$J$18:$K$21,2,FALSE)),0),2)","v":0},null,"Report Preparation ",false,""]
["Value of Work:"]
["Treatment System Design/Engineering/Planning and\nTreatment System Installation Design/Engineering/Planning",null,null,"$4,680.00\n(See page 73 of the CCGD)",{"$f":"ROUND(IF(C110>0,4680,0),2)","v":0},null,"Emergency/Initial Work   ",{"$f":"IF(H104=TRUE,1,\"\")","v":""}]
["Conveyance Notice \n(Copy of conveyance notice for each property is required for payment)",null,null,"$1,200.00\nper affected property",{"$f":"ROUND(IF(C111>0,1200,0),2)","v":0},null,"Investigation Work      ",{"$f":"IF(H105=TRUE,2,\"\")","v":""}]
["Corrective Action Plan Construction and Operations Report",null,null,"See page 56 of the 2017\nCost Control Guidance Document for rate descriptions",{"$f":"ROUND(IF(AND(B113>0,B114>0),VLOOKUP(B114,$J$24:$K$27,2,FALSE),0),2)","v":0},null,"Monitoring/Interim Work        ",{"$f":"IF(H106=TRUE,3,\"\")","v":""}]
["Date of Report:",null,null,null,null,null,"Corrective Action Plan Work",{"$f":"IF(H107=TRUE,4,\"\")","v":""}]
["Report Type:",null,null,null,null,null,"Report Preparation ",{"$f":"IF(H108=TRUE,5,\"\")","v":""}]
["P & A Report",null,null,"$750.00 per report",{"$f":"ROUND(IF(B116>0,750,0),2)","v":0}]
["Date of Report:"]
["Permit Application Development and Submittal (select from lists)",null,null,"See page 67 of the 2017 \nCCGD for rate descrpitions",{"$f":"IF(OR(COUNTIF(A118:B118,\"*Water*\")>1,COUNTIF(A118:B118,\"*Air*\")>1),\"Duplicate Entry\",SUM(IF(A118>0,VLOOKUP(A118,$G$32:$H$34,2,FALSE),0)+IF(B118>0,VLOOKUP(B118,$G$32:$H$34,2,FALSE),0)))","v":0}]
[]
["Quarterly Monitoring Reports (if applicable) – Indicate report period",null,null,"See page 61 of the 2017\nCost Control Guidance Document for rate descriptions"]
["Quarter","Year"]
[]
["Annual or Semi-Annual Report (if applicable) - Indicate report period",null,null,"See page 62 of the 2017\nCost Control Guidance Document for rate descriptions"]
["Report Type:"]
["Report Period:"]
["State or Municipal/Parish Quarterly Discharge Monitoring Report ",null,null,"$208.00 per report\n($78.00 for “No Discharge\")"]
["Report period(s):"]
["Permit number(s):"]
["Soil Confirmation Report       Date:\n",null,null,"17% of reimbursed\n field work ($10,000 max)",{"$f":"ROUND(IF(OR(B129=0,B128=0),0,IF(B129*0.17>10000,10000,B129*0.17)),2)","v":0}]
["Cost of Field Work:"]
["Vac. Events Report       Date of Report:",null,null,"See page 74-75 of the \n2017 Cost Control\nGuidance Document\nfor rate descriptions",{"$f":"ROUND(IF(OR(COUNTA(A133:B136)=0,B130=0),0,IF(COUNTA(A133:B136)=1,VLOOKUP(B131,$J$32:$M$33,2,FALSE),IF(COUNTA(A133:B136)>1,\nVLOOKUP(B131,$J$32:$M$33,2,FALSE)+((COUNTA(A133:B136)-1)*VLOOKUP(B131,$J$32:$M$33,3,FALSE)),0))),2)","v":0}]
["Report Type:"]
["List Dates of Events:"]
[]
[]
[]
[]
["Vacuum Event Planning         Type:",null,null,null,{"$f":"ROUND(IF(AND(B137>0,B138>0),VLOOKUP(B137,$J$31:$M$33,4,FALSE)*B138,0),2)","v":0}]
["Number of Events:"]
["Vacuum Extraction Pilot Test Report",null,null,"$350.00 per plan\n$2,912.00 per report",{"$f":"ROUND(IF(AND(B140>0,B141>0),(350+2912),IF(OR(B140>0,B141>0),IF(AND(B140>0,B141=0),350,IF(AND(B140=0,B141>0),2912,0)),0)),2)","v":0}]
[" Date of Plan:"]
[" Date of Report:"]
["SUBTOTAL OF THIS PAGE",null,null,{"$f":"SUM(E104:E140)","v":0},null,null,{"$f":"IF(H104=TRUE,$K$2,IF(H105=TRUE,$K$3,IF(H106=TRUE,$K$4,IF(H107=TRUE,$K$5,))))","v":0}]
["MISCELLANOUS TOTAL",null,null,{"$f":"SUM(G142)","v":0},null,null,{"$f":"IF(SUM(D142:E143)>0,1,0)","v":0}]
["Page             of                 (Miscellaneous Supplementary Sheet)"]
["PART 5.H (3)"]
["MISCELLANEOUS SUPPLEMENTARY SHEET"]
["UNIT PRICING FORM"]
["Check Event:"]
[]
[" Unit pricing for these activities is mandatory."]
["UNIT PRICE ACTIVITY",null,"RAC INVOICE NO.","RATES","COST"]
["Bid Package Preparation:\n    Provide Bid Summary with RAC Invoice.",null,null,"See page 54 of the \n2017 Cost Control\nGuidance Document\nfor rate descriptions",null,null,"Emergency/Initial Work   ",false,{"$f":"IF(H152=TRUE,$D$190,\"\")","v":""}]
[null,null,null,null,null,null,"Investigation Work      ",false,{"$f":"IF(H153=TRUE,$D$190,\"\")","v":""}]
["Description of Bid Package:",null,null,null,{"$f":"ROUND(IF(B154>0,IF(B154=$J$17,INDEX($K$17:$M$21,MATCH(B154,$J$17:$J$21,0),MATCH(B155,$K$16:$M$16,0)),VLOOKUP(B154,$J$18:$K$21,2,FALSE)),0),2)","v":0},null,"Monitoring/Interim Work        ",false,""]
["Value of Work:",null,null,null,null,null,"Corrective Action Plan Work",false,""]
["Description of Bid Package:",null,null,null,{"$f":"ROUND(IF(B156>0,IF(B156=$J$17,INDEX($K$17:$M$21,MATCH(B156,$J$17:$J$21,0),MATCH(B157,$K$16:$M$16,0)),VLOOKUP(B156,$J$18:$K$21,2,FALSE)),0),2)","v":0},null,"Report Preparation ",false,""]
["Value of Work:"]
["Treatment System Design/Engineering/Planning and\nTreatment System Installation Design/Engineering/Planning",null,null,"$4,680.00\n(See page 73 of the CCGD)",{"$f":"ROUND(IF(C158>0,4680,0),2)","v":0},null,"Emergency/Initial Work   ",{"$f":"IF(H152=TRUE,1,\"\")","v":""}]
["Conveyance Notice \n(Copy of conveyance notice for each property is required for payment)",null,null,"$1,200.00\nper affected property",{"$f":"ROUND(IF(C159>0,1200,0),2)","v":0},null,"Investigation Work      ",{"$f":"IF(H153=TRUE,2,\"\")","v":""}]
["Corrective Action Plan Construction and Operations Report",null,null,"See page 56 of the 2017\nCost Control Guidance Document for rate descriptions",{"$f":"ROUND(IF(AND(B161>0,B162>0),VLOOKUP(B162,$J$24:$K$27,2,FALSE),0),2)","v":0},null,"Monitoring/Interim Work        ",{"$f":"IF(H154=TRUE,3,\"\")","v":""}]
["Date of Report:",null,null,null,null,null,"Corrective Action Plan Work",{"$f":"IF(H155=TRUE,4,\"\")","v":""}]
["Report Type:",null,null,null,null,null,"Report Preparation ",{"$f":"IF(H156=TRUE,5,\"\")","v":""}]
["P & A Report",null,null,"$750.00 per report",{"$f":"ROUND(IF(B164>0,750,0),2)","v":0}]
["Date of Report:"]
["Permit Application Development and Submittal (select from lists)",null,null,"See page 67 of the 2017 \nCCGD for rate descrpitions",{"$f":"IF(OR(COUNTIF(A166:B166,\"*Water*\")>1,COUNTIF(A166:B166,\"*Air*\")>1),\"Duplicate Entry\",SUM(IF(A166>0,VLOOKUP(A166,$G$32:$H$34,2,FALSE),0)+IF(B166>0,VLOOKUP(B166,$G$32:$H$34,2,FALSE),0)))","v":0}]
[]
["Quarterly Monitoring Reports (if applicable) – Indicate report period",null,null,"See page 61 of the 2017\nCost Control Guidance Document for rate descriptions"]
["Quarter","Year"]
[]
["Annual or Semi-Annual Report (if applicable) - Indicate report period",null,null,"See page 62 of the 2017\nCost Control Guidance Document for rate descriptions"]
["Report Type:"]
["Report Period:"]
["State or Municipal/Parish Quarterly Discharge Monitoring Report ",null,null,"$208.00 per report\n($78.00 for “No Discharge\")"]
["Report period(s):"]
["Permit number(s):"]
["Soil Confirmation Report       Date:\n",null,null,"17% of reimbursed\n field work ($10,000 max)",{"$f":"ROUND(IF(OR(B177=0,B176=0),0,IF(B177*0.17>10000,10000,B177*0.17)),2)","v":0}]
["Cost of Field Work:"]
["Vac. Events Report       Date of Report:",null,null,"See page 74-75 of the \n2017 Cost Control\nGuidance Document\nfor rate descriptions",{"$f":"ROUND(IF(OR(COUNTA(A181:B184)=0,B178=0),0,IF(COUNTA(A181:B184)=1,VLOOKUP(B179,$J$32:$M$33,2,FALSE),IF(COUNTA(A181:B184)>1,\nVLOOKUP(B179,$J$32:$M$33,2,FALSE)+((COUNTA(A181:B184)-1)*VLOOKUP(B179,$J$32:$M$33,3,FALSE)),0))),2)","v":0}]
["Report Type:"]
["List Dates of Events:"]
[]
[]
[]
[]
["Vacuum Event Planning         Type:",null,null,null,{"$f":"ROUND(IF(AND(B185>0,B186>0),VLOOKUP(B185,$J$31:$M$33,4,FALSE)*B186,0),2)","v":0}]
["Number of Events:"]
["Vacuum Extraction Pilot Test Report",null,null,"$350.00 per plan\n$2,912.00 per report",{"$f":"ROUND(IF(AND(B188>0,B189>0),(350+2912),IF(OR(B188>0,B189>0),IF(AND(B188>0,B189=0),350,IF(AND(B188=0,B189>0),2912,0)),0)),2)","v":0}]
[" Date of Plan:"]
[" Date of Report:"]
["SUBTOTAL OF THIS PAGE",null,null,{"$f":"SUM(E152:E188)","v":0},null,null,{"$f":"IF(H152=TRUE,$K$2,IF(H153=TRUE,$K$3,IF(H154=TRUE,$K$4,IF(H155=TRUE,$K$5,))))","v":0}]
["MISCELLANOUS TOTAL",null,null,{"$f":"SUM(G190)","v":0},null,null,{"$f":"IF(SUM(D190:E191)>0,1,0)","v":0}]
["Page             of                 (Miscellaneous Supplementary Sheet)"]
["PART 5.H (3)"]
["MISCELLANEOUS SUPPLEMENTARY SHEET"]
["UNIT PRICING FORM"]
["Check Event:"]
[]
[" Unit pricing for these activities is mandatory."]
["UNIT PRICE ACTIVITY",null,"RAC INVOICE NO.","RATES","COST"]
["Bid Package Preparation:\n    Provide Bid Summary with RAC Invoice.",null,null,"See page 54 of the \n2017 Cost Control\nGuidance Document\nfor rate descriptions",null,null,"Emergency/Initial Work   ",false,{"$f":"IF(H200=TRUE,$D$238,\"\")","v":""}]
[null,null,null,null,null,null,"Investigation Work      ",false,{"$f":"IF(H201=TRUE,$D$238,\"\")","v":""}]
["Description of Bid Package:",null,null,null,{"$f":"ROUND(IF(B202>0,IF(B202=$J$17,INDEX($K$17:$M$21,MATCH(B202,$J$17:$J$21,0),MATCH(B203,$K$16:$M$16,0)),VLOOKUP(B202,$J$18:$K$21,2,FALSE)),0),2)","v":0},null,"Monitoring/Interim Work        ",false,""]
["Value of Work:",null,null,null,null,null,"Corrective Action Plan Work",false,""]
["Description of Bid Package:",null,null,null,{"$f":"ROUND(IF(B204>0,IF(B204=$J$17,INDEX($K$17:$M$21,MATCH(B204,$J$17:$J$21,0),MATCH(B205,$K$16:$M$16,0)),VLOOKUP(B204,$J$18:$K$21,2,FALSE)),0),2)","v":0},null,"Report Preparation ",false,""]
["Value of Work:"]
["Treatment System Design/Engineering/Planning and\nTreatment System Installation Design/Engineering/Planning",null,null,"$4,680.00\n(See page 73 of the CCGD)",{"$f":"ROUND(IF(C206>0,4680,0),2)","v":0},null,"Emergency/Initial Work   ",{"$f":"IF(H200=TRUE,1,\"\")","v":""}]
["Conveyance Notice \n(Copy of conveyance notice for each property is required for payment)",null,null,"$1,200.00\nper affected property",{"$f":"ROUND(IF(C207>0,1200,0),2)","v":0},null,"Investigation Work      ",{"$f":"IF(H201=TRUE,2,\"\")","v":""}]
["Corrective Action Plan Construction and Operations Report",null,null,"See page 56 of the 2017\nCost Control Guidance Document for rate descriptions",{"$f":"ROUND(IF(AND(B209>0,B210>0),VLOOKUP(B210,$J$24:$K$27,2,FALSE),0),2)","v":0},null,"Monitoring/Interim Work        ",{"$f":"IF(H202=TRUE,3,\"\")","v":""}]
["Date of Report:",null,null,null,null,null,"Corrective Action Plan Work",{"$f":"IF(H203=TRUE,4,\"\")","v":""}]
["Report Type:",null,null,null,null,null,"Report Preparation ",{"$f":"IF(H204=TRUE,5,\"\")","v":""}]
["P & A Report",null,null,"$750.00 per report",{"$f":"ROUND(IF(B212>0,750,0),2)","v":0}]
["Date of Report:"]
["Permit Application Development and Submittal (select from lists)",null,null,"See page 67 of the 2017 \nCCGD for rate descrpitions",{"$f":"IF(OR(COUNTIF(A214:B214,\"*Water*\")>1,COUNTIF(A214:B214,\"*Air*\")>1),\"Duplicate Entry\",SUM(IF(A214>0,VLOOKUP(A214,$G$32:$H$34,2,FALSE),0)+IF(B214>0,VLOOKUP(B214,$G$32:$H$34,2,FALSE),0)))","v":0}]
[]
["Quarterly Monitoring Reports (if applicable) – Indicate report period",null,null,"See page 61 of the 2017\nCost Control Guidance Document for rate descriptions"]
["Quarter","Year"]
[]
["Annual or Semi-Annual Report (if applicable) - Indicate report period",null,null,"See page 62 of the 2017\nCost Control Guidance Document for rate descriptions"]
["Report Type:"]
["Report Period:"]
["State or Municipal/Parish Quarterly Discharge Monitoring Report ",null,null,"$208.00 per report\n($78.00 for “No Discharge\")"]
["Report period(s):"]
["Permit number(s):"]
["Soil Confirmation Report       Date:\n",null,null,"17% of reimbursed\n field work ($10,000 max)",{"$f":"ROUND(IF(OR(B225=0,B224=0),0,IF(B225*0.17>10000,10000,B225*0.17)),2)","v":0}]
["Cost of Field Work:"]
["Vac. Events Report       Date of Report:",null,null,"See page 74-75 of the \n2017 Cost Control\nGuidance Document\nfor rate descriptions",{"$f":"ROUND(IF(OR(COUNTA(A229:B232)=0,B226=0),0,IF(COUNTA(A229:B232)=1,VLOOKUP(B227,$J$32:$M$33,2,FALSE),IF(COUNTA(A229:B232)>1,\nVLOOKUP(B227,$J$32:$M$33,2,FALSE)+((COUNTA(A229:B232)-1)*VLOOKUP(B227,$J$32:$M$33,3,FALSE)),0))),2)","v":0}]
["Report Type:"]
["List Dates of Events:"]
[]
[]
[]
[]
["Vacuum Event Planning         Type:",null,null,null,{"$f":"ROUND(IF(AND(B233>0,B234>0),VLOOKUP(B233,$J$31:$M$33,4,FALSE)*B234,0),2)","v":0}]
["Number of Events:"]
["Vacuum Extraction Pilot Test Report",null,null,"$350.00 per plan\n$2,912.00 per report",{"$f":"ROUND(IF(AND(B236>0,B237>0),(350+2912),IF(OR(B236>0,B237>0),IF(AND(B236>0,B237=0),350,IF(AND(B236=0,B237>0),2912,0)),0)),2)","v":0}]
[" Date of Plan:"]
[" Date of Report:"]
["SUBTOTAL OF THIS PAGE",null,null,{"$f":"SUM(E200:E236)","v":0},null,null,{"$f":"IF(H200=TRUE,$K$2,IF(H201=TRUE,$K$3,IF(H202=TRUE,$K$4,IF(H203=TRUE,$K$5,))))","v":0}]
["MISCELLANOUS TOTAL",null,null,{"$f":"SUM(G238)","v":0},null,null,{"$f":"IF(SUM(D238:E239)>0,1,0)","v":0}]
["Page             of                 (Miscellaneous Supplementary Sheet)"]

{"sheet":"Miscellaneous 4","index":18,"n_rows":39,"n_cols":12,"rows_kept":39,"cut":false,"hidden":false,"merged":[[38,0,38,4],[22,0,22,1],[26,0,26,1],[30,0,30,1],[30,3,34,3],[30,2,34,2],[36,3,36,4],[35,3,35,4],[35,0,35,2],[36,0,36,2],[30,4,34,4],[24,2,25,2],[24,3,25,3],[24,4,25,4],[26,2,29,2],[26,3,29,3],[26,4,29,4],[0,0,0,4],[1,0,1,4],[3,0,3,4],[2,0,2,4],[4,0,4,4],[13,4,14,4],[6,0,6,1],[13,0,13,1],[22,2,23,2],[22,3,23,3],[22,4,23,4],[16,2,17,2],[19,2,20,2],[15,3,21,3],[6,3,12,3],[5,0,5,1],[13,3,14,3],[13,2,14,2],[15,0,15,1],[10,2,12,2],[7,2,9,2],[7,4,9,4],[10,4,12,4],[10,6,10,8],[16,4,17,4],[19,4,20,4]]}
["PART 5.H (4)"]
["MISCELLANEOUS SUPPLEMENTARY SHEET"]
["UNIT PRICING FORM"]
["Check Event:"]
["Unit pricing for these activities is mandatory."]
["UNIT PRICE ACTIVITY",null,"RAC INVOICE NO.","RATES","COST",null,null,null,"Sheet total",null,"Sheet 1-3 total"]
["Corrective Action Plan ",null,null," See page 55 of the \n2017 Cost Control\nGuidance Document and MFTF Interim Guidance \nfor rate descriptions",null,null,"Report Preparation ",false,{"$f":"IF(H7=TRUE,D36,\"\")","v":""},"Report Preparation",{"$f":"'Miscellaneous 3'!K6","v":0},{"$f":"SUM(I7,K7)","v":0}]
[" Date of Work Plan:",null,null,null,{"$f":"ROUND(IF(OR(AND(B8>0,B9>0,B10>0),AND(B8>0,B9=G14)),IF(OR(B9=$G$17,B9=$G$19,B9=$G$20),IF(B10*VLOOKUP(B9,$G$12:$I$20,2,FALSE)>VLOOKUP(B9,$G$12:$I$20,3,FALSE),VLOOKUP(B9,$G$12:$I$20,3,FALSE),B10*VLOOKUP(B9,$G$12:$I$20,2,FALSE)),VLOOKUP(B9,$G$12:$I$20,2,FALSE)),0),2)","v":0}]
["CAP Category:",null,null,null,null,null,"Report Preparation ",{"$f":"IF(H7=TRUE,5,\"\")","v":""}]
["Budget Value:"]
[" Date of Work Plan:",null,null,null,{"$f":"ROUND(IF(OR(AND(B11>0,B12>0,B13>0),AND(B11>0,B12=G14)),IF(OR(B12=$G$17,B12=$G$19,B12=$G$20),IF(B13*VLOOKUP(B12,$G$12:$I$20,2,FALSE)>VLOOKUP(B12,$G$12:$I$20,3,FALSE),VLOOKUP(B12,$G$12:$I$20,3,FALSE),B13*VLOOKUP(B12,$G$12:$I$20,2,FALSE)),VLOOKUP(B12,$G$12:$I$20,2,FALSE)),0),2)","v":0},null,"Corrective Action Plan"]
["CAP Category:",null,null,null,null,null,null,"Rate","Max"]
["Budget Value:",null,null,null,null,null,"Category 1 - Complete CAP",7000]
["Plugging & Abandonment Work Plan",null,null,"$104.00 per plan",{"$f":"ROUND(IF(B15>0,104,0),2)","v":0},null,"Category 1 - Scoping Meeting",2800]
["Date of Work Plan:",null,null,null,null,null,"Category 1 - ROG Approval",4200]
["Risk Evaluation/Corrective Action Report – Appendix I Sites Only\n\n",null,null," See page 70 of the \n2017 Cost Control\nGuidance Document\nfor rate descriptions",null,null,"Category 2",2000]
[" Date of Report:",null,null,null,null,null,"Category 3",0.1,4000]
[" Description of Report:",null,null,null,null,null,"Category 4",500]
[null,null,null,null,null,null,"Category 5",0.05,2000]
[" Date of Report:",null,null,null,null,null,"Category 6",0.05,1000]
[" Description of Report:"]
[]
["Remediation Oversight Group Meeting Preparation and Attendance",null,null,"$702.00 per meeting",{"$f":"ROUND(IF(C23>0,702,0),2)","v":0}]
["Date of Meeting: "]
["Site Investigation Report            Date:",null,null,"17% of reimbursed field work performed \n($10,000 max)",{"$f":"ROUND(IF(OR(B26=0,B25=0),0,IF(B26*0.17>10000,10000,B26*0.17)),2)","v":0}]
["Cost of Field Work:",0]
["Site Investigation or Soil Confirmation Work Plan",null,null,"4% of approved field work in work plan\n($520 minimum, $1000 max)",{"$f":"ROUND(IF(OR(B28=0,B30=0),0,IF(B30*0.04<520,520,IF(B30*0.04>1000,1000,B30*0.04))),2)","v":0}]
["Date of Work Plan:"]
["Date of Team Leader Approval:"]
["Cost of Approved Field Work:"]
["Trust Fund Reimbursement for Application Preparation/Invoicing Work",null,null,"Applications Addressing\nField Work: $333.00\n\nApplication Addressing\nReports Only: $125.00"]
["July – September","October - December"]
[{"$f":"IF('Part 1'!E29=\"\",\"\",'Part 1'!E29)","v":""},{"$f":"IF('Part 1'!E31=\"\",\"\",'Part 1'!E31)","v":""}]
["January – March","April - June"]
[{"$f":"IF('Part 1'!E33=\"\",\"\",'Part 1'!E33)","v":""},{"$f":"IF('Part 1'!E35=\"\",\"\",'Part 1'!E35)","v":""}]
["SUBTOTAL OF THIS PAGE",null,null,{"$f":"SUM(E7:E35)","v":0}]
["TOTAL MISCELLANEOUS COSTS",null,null,{"$f":"L7","v":0},null,null,{"$f":"IF(D37>0,1,0)","v":0}]
[]
["Page               of                 (Miscellaneous Supplementary Sheet)"]

{"sheet":"Part 6","index":19,"n_rows":31,"n_cols":18,"rows_kept":31,"cut":false,"hidden":false,"merged":[[7,8,7,9],[6,6,6,10],[26,0,26,1],[25,0,25,1],[25,3,25,4],[8,1,8,7],[8,9,8,10],[12,0,12,1],[11,0,11,1],[10,0,10,1],[10,5,10,6],[11,5,11,6],[12,5,12,6],[10,3,10,4],[12,3,12,4],[11,3,11,4],[12,8,12,10],[20,3,20,4],[20,8,20,10],[15,8,15,10],[15,5,15,6],[20,5,20,6],[13,5,13,6],[13,3,13,4],[15,3,15,4],[14,0,14,1],[14,5,14,6],[21,3,21,4],[16,3,16,4],[17,3,17,4],[16,5,16,6],[17,5,17,6],[18,5,18,6],[18,3,18,4],[19,3,19,4],[19,5,19,6],[14,3,14,4],[15,0,15,1],[20,0,20,1],[22,5,22,6],[22,8,22,10],[18,8,18,10],[19,8,19,10],[24,0,24,1],[23,0,23,1],[18,0,18,1],[19,0,19,1],[22,0,22,1],[21,0,21,1],[26,3,26,4],[29,3,29,4],[21,8,21,10],[23,8,23,10],[24,8,24,10],[25,8,25,10],[26,8,26,10],[26,5,26,6],[29,5,29,6],[23,5,23,6],[24,5,24,6],[25,5,25,6],[23,3,23,4],[24,3,24,4],[21,5,21,6],[22,3,22,4],[0,0,0,10],[1,0,1,10],[2,0,2,10],[3,0,3,10],[4,0,4,10],[5,0,5,10],[16,0,16,1],[17,0,17,1],[16,8,16,10],[17,8,17,10],[7,5,7,6],[9,0,9,1],[7,1,7,4],[9,8,9,10],[9,5,9,6],[9,3,9,4],[10,8,10,10],[11,8,11,10],[13,8,13,10],[14,8,14,10],[13,0,13,1],[29,0,29,1],[29,8,29,10],[30,0,30,6],[30,7,30,10],[27,0,27,1],[27,3,27,4],[27,5,27,6],[27,8,27,10],[28,0,28,1],[28,3,28,4],[28,5,28,6],[28,8,28,10]]}
["PART 6"]
["RAC OR OWNER INVOICE SUMMARY"]
[]
["List in chronological order, all RAC invoices to the owner and all other invoices billed directly to the owner on this sheet. Each application can"]
["not address invoices dated for a period of more than one fiscal year (July 1 thru June 30).  Copies of all listed invoices must be attached."]
["Outside invoices/receipts must be attached to the appropriate RAC/Owner Invoice."]
[null,null,null,null,null,null,{"$f":"IF(OR(H8=\"\",K8=\"\",M31>0,AND(O12=0,M31=0)),\"MISSING INFORMATION\",\"\")","v":"MISSING INFORMATION"}]
["Site Name:",{"$f":"IF('Part 1'!A20>0,'Part 1'!A20,\"\")","v":""},null,null,null,"Invoicing Period:",null,null,"through"]
["Site Address:",{"$f":"IF('Part 1'!A24>0,'Part 1'!A24&\",  \"&'Part 1'!E24&\",  \"&'Part 1'!G24,\"\")","v":""},null,null,null,null,null,null,"AIN:",{"$f":"IF('Part 1'!A22>0,'Part 1'!A22,\"\")","v":""}]
["WORKED PERFORMED           (TIME PERIOD)",null,"INVOICE DATE","COMPANY NAME",null,"INVOICE NO.",null,"AMOUNT","DEQ COMMENTS",null,null,null,"Missing Invoice Info"]
[null,null,null,null,null,null,null,null,null,null,null,null,{"$f":"IF(OR(AND(A11=\"\",OR(C11>0,D11>0,F11>0,H11>0)), AND(C11=\"\",OR(A11>0,D11>0,F11>0,H11>0)), AND(D11=\"\",OR(A11>0,C11>0,F11>0,H11>0)), AND(F11=\"\",OR(A11>0,C11>0,D11>0,H11>0)), AND(H11=\"\",OR(A11>0,C11>0,D11>0,F11>0))),TRUE,FALSE)","v":false},"part 5",{"$f":"'Part 5'!A3","v":0},{"$f":"ROUND(O11,2)","v":0},null,{"$f":"IF(F11=\"\",\"\",F11&\"; \")","v":""}]
[null,null,null,null,null,null,null,null,null,null,null,null,{"$f":"IF(OR(AND(A12=\"\",OR(C12>0,D12>0,F12>0,H12>0)), AND(C12=\"\",OR(A12>0,D12>0,F12>0,H12>0)), AND(D12=\"\",OR(A12>0,C12>0,F12>0,H12>0)), AND(F12=\"\",OR(A12>0,C12>0,D12>0,H12>0)), AND(H12=\"\",OR(A12>0,C12>0,D12>0,F12>0))),TRUE,FALSE)","v":false},"part 6",{"$f":"H31","v":0},{"$f":"ROUND(O12,2)","v":0},null,{"$f":"IF(F12=\"\",\"\",F12&\"; \")","v":""}]
[null,null,null,null,null,null,null,null,null,null,null,null,false,null,null,null,null,""]
[null,null,null,null,null,null,null,null,null,null,null,null,false,{"$f":"IF(P11=P12,0,1)","v":0},null,null,null,""]
[null,null,null,null,null,null,null,null,null,null,null,null,false,null,null,null,null,""]
[null,null,null,null,null,null,null,null,null,null,null,null,false,null,null,null,null,""]
[null,null,null,null,null,null,null,null,null,null,null,null,false,null,null,null,null,""]
[null,null,null,null,null,null,null,null,null,null,null,null,false,null,null,null,null,""]
[null,null,null,null,null,null,null,null,null,null,null,null,false,null,null,null,null,""]
[null,null,null,null,null,null,null,null,null,null,null,null,false,null,null,null,null,""]
[null,null,null,null,null,null,null,null,null,null,null,null,false,null,null,null,null,""]
[null,null,null,null,null,null,null,null,null,null,null,null,false,null,null,null,null,""]
[null,null,null,null,null,null,null,null,null,null,null,null,false,null,null,null,null,""]
[null,null,null,null,null,null,null,null,null,null,null,null,false,null,null,null,null,""]
[null,null,null,null,null,null,null,null,null,null,null,null,false,null,null,null,null,""]
[null,null,null,null,null,null,null,null,null,null,null,null,false,null,null,null,null,""]
[null,null,null,null,null,null,null,null,null,null,null,null,false,null,null,null,null,""]
[null,null,null,null,null,null,null,null,null,null,null,null,false,null,null,null,null,""]
[null,null,null,null,null,null,null,null,null,null,null,null,false,null,null,null,null,""]
[null,null,null,null,null,null,null,null,null,null,null,null,false,null,null,null,null,""]
["TOTAL RAC OR OWNER INVOICE SUMMARY",null,null,null,null,null,null,{"$f":"SUM(H11:H30)","v":0},null,null,null,null,{"$f":"COUNTIF(M11:M30,TRUE)","v":0}]

{"sheet":"Part 7","index":20,"n_rows":48,"n_cols":24,"rows_kept":48,"cut":false,"hidden":false,"merged":[[37,0,37,21],[16,0,16,15],[16,16,16,21],[17,1,17,21],[33,0,33,8],[33,9,33,11],[29,9,29,11],[31,0,31,5],[35,0,35,21],[36,0,36,21],[33,17,33,20],[33,12,33,16],[30,9,30,11],[30,17,30,20],[34,9,34,11],[34,17,34,20],[26,0,26,21],[27,7,27,21],[27,0,27,6],[31,6,31,21],[29,0,29,8],[29,12,29,16],[29,17,29,20],[41,0,41,21],[47,0,47,21],[39,0,39,21],[40,0,40,21],[44,0,44,7],[42,0,42,1],[44,16,44,21],[46,17,46,21],[42,2,42,9],[46,3,46,9],[44,11,44,15],[44,8,44,10],[46,11,46,16],[42,11,42,14],[42,15,42,21],[9,0,9,21],[10,0,10,21],[11,0,11,9],[12,0,12,9],[18,0,18,21],[15,8,15,21],[15,0,15,7],[11,20,11,21],[12,19,12,20],[11,18,11,19],[12,15,12,18],[11,15,11,17],[11,11,11,14],[12,11,12,14],[14,5,14,21],[8,0,8,21],[0,0,0,21],[1,0,1,21],[4,4,4,21],[6,0,6,6],[6,7,6,21],[4,0,4,3],[22,19,22,21],[23,19,23,21],[24,5,24,8],[24,9,24,21],[22,1,22,8],[23,1,23,8],[22,12,22,18],[23,12,23,18],[22,9,22,11],[23,9,23,11],[19,16,19,21],[19,0,19,15],[20,0,20,21],[21,1,21,8],[21,12,21,18],[21,19,21,21],[21,9,21,11]]}
["PART 7"]
["TREATMENT SYSTEM TRACKING FORM"]
[]
[]
["Name of Current Site:",null,null,null,{"$f":"IF('Part 1'!A20>0,\"\"&\"  \"&'Part 1'!A20,\"\")","v":""}]
[]
["Agency Interest Number (AIN):",null,null,null,null,null,null,{"$f":"IF('Part 1'!A22>0,'Part 1'!A22,\"\")","v":""}]
[]
["Please provide the following for groundwater or vapor recovery equipment in use at the above listed site for"]
["which reimbursement is being ,or will be, requested."]
["1.      Detailed invoice indicating price of major components must be supplied."]
["        Purchase",null,null,null,null,null,null,null,null,null,"Cost",null,null,null,null,"Invoice No. ",null,null,null,null,"(Invoice attached)"]
["       Rental (5% of unit cost-DEQ approval only)",null,null,null,null,null,null,null,null,null,"Rate ",null,null,null,null,"Minimum Term:",null,null,null,null,null,"Months"]
[]
["2.      Manufacturer’s Name"]
["3.      Serial Number of Equipment"]
["4.      Prior location of the unit, if previously used at another site (include AIN)"]
[]
["5.      Brief information on the unit: (Please check appropriate method noted below)"]
[null,null,null,null,null,null,null,null,null,null,null,null,null,null,null,null,null,null,null,null,null,null,null,{"$f":"IF(F15>0,1,0)","v":0}]
["         Major Components and Manufacturer's Recommendations:"]
[null,"Motor Size (quantity and size)",null,null,null,null,null,null,null,null,null,null,"Carbon Filter (yes/no, size)"]
[null,"Pump (quantity and size)",null,null,null,null,null,null,null,null,null,null,"Oil Capacity (in gallons)"]
["   ","Air Stripper (flow rate)",null,null,null,null,null,null,null,null,null,null,"Oil Change Frequency"]
[null,null,null,null,null,"Other"]
[]
["6.       Period Operated (If original location, please estimate number of months of expected use at the site.)"]
["          Original Location/AIN:"]
[]
["          (Estimated time-frame) From",null,null,null,null,null,null,null,null,null,null,null,"Length of uses"]
[null,null,null,null,null,null,null,null,null,"(Installation Date)",null,null,null,null,null,null,null,"(Estimated Time)"]
["           New Location/ AIN:."]
[]
["          (Estimated time-frame) From",null,null,null,null,null,null,null,null,null,null,null,"Length of uses"]
[null,null,null,null,null,null,null,null,null,"(Installation Date)",null,null,null,null,null,null,null,"(Estimated Time)"]
["DEQ USE ONLY:"]
["Cost Comparison:  Purchase vs. Rental of the Treatment System "]
["No. Of  Months Projected for Use at the Site (                 ) X .05 of Cost of Unit (                     )=$"]
[]
["I hereby certify that all of the above information is true and correct to the best of my knowledge and I agree to "]
["notify the Trust Fund Section, in writing, indicating the specific address of the relocation of the treatment"]
["equipment as soon as possible, but prior to relocation of the equipment."]
["RAC Name:",null,null,null,null,null,null,null,null,null,"  ","*Signature: ",null,null,null,{"$f":"IF(OR(L12=\"\",S12=\"\",I16=\"\",J22=\"\",J23=\"\",J24=\"\",T22=\"\",T23=\"\",T24=\"\"),\"MISSING INFORMATION\",\"\")","v":"MISSING INFORMATION"}]
[]
["Owner, Operator, or RP Name:",null,null,null,null,null,null,null,null,null,null,"Title of Signatory:"]
[]
["Telefax Number:",null,null,null,null,null,null,null,null,null,null,"Telephone Number:"]
["* Signature is required of Owner, Operator, RP, or RAC (person purchasing unit).  RAC signature is required for rental."]

{"sheet":"Part 8","index":21,"n_rows":46,"n_cols":11,"rows_kept":46,"cut":false,"hidden":false,"merged":[[41,2,41,5],[43,0,43,1],[43,2,43,7],[39,1,39,7],[45,0,45,2],[45,3,45,7],[41,0,41,1],[35,0,35,8],[17,0,17,8],[18,0,18,8],[23,0,23,8],[27,0,27,8],[28,0,28,8],[31,0,31,8],[32,0,32,8],[26,7,26,8],[26,0,26,5],[30,7,30,8],[30,0,30,5],[34,0,34,7],[37,1,37,3],[29,6,29,8],[44,3,44,7],[15,0,15,8],[0,0,0,8],[1,0,1,8],[2,0,2,8],[4,0,4,8],[5,0,5,8],[7,0,7,8],[8,0,8,8],[9,0,9,8],[11,0,11,8],[12,0,12,8],[13,0,13,8],[37,6,37,8]]}
["PART 8"]
["PURCHASE AGREEMENT FORM"]
["(TREATMENT SYSTEMS ONLY)"]
[]
["1.    Treatment systems are defined as systems used in remediation of a contaminated underground storage tank "]
["       site (hereinafter referred to as “equipment”)."]
[]
["2.   The owner, operator, RP, or Response Action Contractor (RAC) (person retaining ownership) is responsible "]
["      for and will ensure that the equipment is inspected, serviced and repaired as required to ensure its continued "]
["      effectiveness."]
[]
["3.   Prior to relocating the equipment to another site, the owner, operator, RP, or RAC will notify the Trust Fund "]
["      Fund Section of the Financial Services Division of the relocation by completing a new Treatment System "]
["      Tracking Form."]
[]
["4.   After selling the equipment, the owner, operator, RP, or RAC will reimburse the Trust Fund all proceeds. "]
[]
["5.   If the owner, operator, RP, or RAC relocates the equipment to a non-Trust Fund site, the owner, operator, RP  "]
["      or RAC will reimburse the Trust Fund ten percent (10%) of the purchase cost of the equipment."]
[]
[]
[]
[]
["I agree to comply with the terms and conditions as stated above."]
[]
[]
[{"$f":"IF(OR(H31=\"\",D46=\"\",G30=\"VALUE DOES NOT MATCH PART 7\",D45=\"SERIAL NUMBER DOES NOT MATCH PART 7\"),\"MISSING INFORMATION\",\"\")","v":"MISSING INFORMATION"}]
["Signature of Owner, Operator, RP, or RAC                                                                        Date Signed"]
["    (Circle:  Owner, Operator, RP, or RAC)"]
[null,null,null,null,null,null,{"$f":"IF(AND(H31>0,H31<>'Part 7'!L12),\"VALUE DOES NOT MATCH PART 7\",\"\")","v":""}]
[null,null,null,null,null,null,null,null,null,null,{"$f":"IF(C44>0,1,0)","v":0}]
["Typed or Printed Name of Owner, Operator, RP, or RAC                                                     Cost of Unit"]
["    (Circle:  Owner, Operator, RP, or RAC)"]
[]
[]
["Mailing Address of Owner, Operator, RP, or RAC (above)"]
[]
["Phone No. ",null,null,null,null,"Telefax No. "]
[]
["Site Name:",{"$f":"IF('Part 1'!A20>0,'Part 1'!A20,\"\")","v":""}]
[]
["Agency Interest No. ",null,{"$f":"IF('Part 1'!A22>0,'Part 1'!A22,\"\")","v":""}]
[]
["Type of Equipment:"]
[null,null,null,{"$f":"IF(D46='Part 7'!I16,\"\",\"SERIAL NUMBER DOES NOT MATCH PART 7\")","v":""}]
["Equipment Serial Number:"]